{"text_format":"1","workbook":"xlsx","n_sheets":11,"sheets":["Inputs","Monthly Average Bill","Tariff Comparison","FAQ","Rates Table","Workings","Rates SPU - New","Rates SPU - Current","Mapping","Lists","Notes on updates"],"not_rendered":{"charts":2,"images":1,"macros":1,"external_links":2,"defined_names":124,"comments":1,"pivot_tables":0},"unopened":[],"bounds":{"document_bytes":16777216,"sheet_cells":100000,"rows_first":2000,"rows_last":500,"rows_between":2000,"halvings":0,"cell_chars":16384,"cell_head_chars":4096},"cells_cut":0,"cells_raw":0,"read":"whole","date_system":"1900"}

{"sheet":"Inputs","index":0,"n_rows":23,"n_cols":14,"rows_kept":23,"cut":false,"hidden":false,"merged":[[7,6,7,7],[8,6,8,7],[9,6,9,7],[20,10,23,14]]}
[]
[null,null,null,null,null,null,null,null,null,null,null,null,null,"Version 6.10    09 March 2021"]
[]
[null,"Tariff Input Sheet"]
[]
[null,"Please enter the required information below:"]
[]
[null,null,null,"Customer Name",null,null,"Customer Name",null,"Enter the customer name as it is displayed on the rates bill."]
{"$rows_left_out":16}
{"sheet":"Monthly Average Bill","index":1,"n_rows":50,"n_cols":16,"rows_kept":50,"cut":false,"hidden":false,"merged":[]}
[]
[]
[]
[null,"Monthly Average Bill",null,null,null,null,null,null,{"$f":"D10","v":"Businessrate 1"},null,{"$f":"B4","v":"Monthly Average Bill"},null,null,null,null,{"$f":"I4","v":"Businessrate 1"}]
[]
[null,"Annual",null,null,null,null,null,null,null,null,"Analysis"]
[]
[null,"Customer Name",null,{"$f":"Customer_Name","v":"Customer Name"}]
{"$rows_left_out":43}
{"sheet":"Tariff Comparison","index":2,"n_rows":41,"n_cols":18,"rows_kept":41,"cut":false,"hidden":false,"merged":[]}
[]
[null,null,null,null,null,null,null,"Please select tariffs from the dropdown boxes to set up the Comparison Report.\n"]
[]
[null,"Comparison against other tariffs",null,null,null,null,null,null,null,null,null,null,null,null,null,null,null,{"$f":"'Monthly Average Bill'!I4","v":"Businessrate 1"}]
[]
[null,null,null,null,null,null,null,9,null,{"$f":"MATCH(H8,Full_Tariff_List,0)","v":17},null,3,null,{"$f":"MATCH(L8,Full_Tariff_List,0)","v":10},null,10,null,{"$f":"MATCH(P8,Full_Tariff_List,0)","v":18}]
[]
[null,null,null,{"$f":"'Monthly Average Bill'!I4","v":"Businessrate 1"},null,null,null,{"$f":"IFERROR(INDEX(Compare_Tariff_List,Dropdown_Compare_1),$D$8)","v":"Landlight 20A"},null,null,null,{"$f":"IFERROR(INDEX(Compare_Tariff_List,Dropdown_Compare_2),$D$8)","v":"Homepower 4"},null,null,null,{"$f":"IFERROR(INDEX(Compare_Tariff_List,Dropdown_Compare_3),$D$8)","v":"Landlight 60A"}]
{"$rows_left_out":34}
{"sheet":"FAQ","index":3,"n_rows":4,"n_cols":2,"rows_kept":4,"cut":false,"hidden":true,"merged":[]}
[]
[]
[]
[null,"Frequently Asked Questions"]

{"sheet":"Rates Table","index":4,"n_rows":46,"n_cols":47,"rows_kept":46,"cut":false,"hidden":true,"merged":[]}
[]
[]
[]
[null,"Rates by Tariff"]
[]
[null,"Tariffs",null,null,{"$f":"Selected_Base_Tariff","v":"Businessrate 1"},{"$f":"INDEX(Full_Tariff_List,F$7,)","v":"Businessrate 1"},"Businessrate 2","Businessrate 3","Businessrate 4","Homelight 20A","Homelight 60A","Homepower 1","Homepower 2","Homepower 3","Homepower 4","Homepower Bulk","Landrate 1","Landrate 2","Landrate 3","Landrate 4","Landrate Dx","Landlight 20A","Landlight 60A","Public Lighting All Night","Public Lighting 24 Hours",null,{"$f":"E6","v":"Businessrate 1"},"Businessrate 1","Businessrate 2","Businessrate 3","Businessrate 4","Homelight 20A","Homelight 60A","Homepower 1","Homepower 2","Homepower 3","Homepower 4","Homepower Bulk","Landrate 1","Landrate 2","Landrate 3","Landrate 4",{"$f":"U6","v":"Landrate Dx"},"Landlight 20A","Landlight 60A","Public Lighting All Night","Public Lighting 24 Hours"]
[null,null,null,null,null,1,{"$f":"F7+1","v":2},{"$f":"G7+1","v":3},4,5,6,7,8,9,10,11,12,13,14,15,{"$f":"T7+1","v":16},{"$f":"U7+1","v":17},{"$f":"V7+1","v":18},{"$f":"W7+1","v":19},{"$f":"X7+1","v":20}]
[null,"Network charges",null,"Units",{"$f":"Current_Period&\" Rates\"","v":"2020/2021 Rates"},"2020/2021 Rates","2020/2021 Rates","2020/2021 Rates","2020/2021 Rates","2020/2021 Rates","2020/2021 Rates","2020/2021 Rates","2020/2021 Rates","2020/2021 Rates","2020/2021 Rates","2020/2021 Rates","2020/2021 Rates","2020/2021 Rates","2020/2021 Rates","2020/2021 Rates","2020/2021 Rates","2020/2021 Rates","2020/2021 Rates","2020/2021 Rates","2020/2021 Rates",null,{"$f":"New_Period&\" Rates\"","v":"2021/2022 Rates"},{"$f":"AA8","v":"2021/2022 Rates"},{"$f":"AB8","v":"2021/2022 Rates"},"2021/2022 Rates","2021/2022 Rates","2021/2022 Rates","2021/2022 Rates","2021/2022 Rates","2021/2022 Rates","2021/2022 Rates","2021/2022 Rates","2021/2022 Rates","2021/2022 Rates","2021/2022 Rates","2021/2022 Rates","2021/2022 Rates",{"$f":"AP8","v":"2021/2022 Rates"},{"$f":"AQ8","v":"2021/2022 Rates"},{"$f":"AR8","v":"2021/2022 Rates"},{"$f":"AS8","v":"2021/2022 Rates"},{"$f":"AT8","v":"2021/2022 Rates"}]
{"$rows_left_out":39}
{"sheet":"Workings","index":5,"n_rows":39,"n_cols":47,"rows_kept":39,"cut":false,"hidden":true,"merged":[]}
[]
[]
[]
[null,"Calculations by Tariff"]
[]
[null,"Tariffs",null,null,{"$f":"Selected_Base_Tariff","v":"Businessrate 1"},{"$f":"INDEX(Full_Tariff_List,F$7,)","v":"Businessrate 1"},"Businessrate 2","Businessrate 3","Businessrate 4","Homelight 20A","Homelight 60A","Homepower 1","Homepower 2","Homepower 3","Homepower 4","Homepower Bulk","Landrate 1","Landrate 2","Landrate 3","Landrate 4","Landrate Dx","Landlight 20A","Landlight 60A","Public Lighting All Night","Public Lighting 24 Hours",null,{"$f":"E6","v":"Businessrate 1"},"Businessrate 1","Businessrate 2","Businessrate 3","Businessrate 4","Homelight 20A","Homelight 60A","Homepower 1","Homepower 2","Homepower 3","Homepower 4","Homepower Bulk","Landrate 1","Landrate 2","Landrate 3","Landrate 4",{"$f":"U6","v":"Landrate Dx"},"Landlight 20A","Landlight 60A","Public Lighting All Night","Public Lighting 24 Hours"]
[null,null,null,null,null,1,{"$f":"F7+1","v":2},{"$f":"G7+1","v":3},4,5,6,7,8,9,10,11,12,13,14,15,{"$f":"T7+1","v":16},{"$f":"U7+1","v":17},{"$f":"V7+1","v":18},{"$f":"W7+1","v":19},{"$f":"X7+1","v":20}]
[null,"Network charges",null,"Units",{"$f":"Current_Period&\" Rates\"","v":"2020/2021 Rates"},{"$f":"E8","v":"2020/2021 Rates"},{"$f":"F8","v":"2020/2021 Rates"},"2020/2021 Rates","2020/2021 Rates","2020/2021 Rates","2020/2021 Rates","2020/2021 Rates","2020/2021 Rates","2020/2021 Rates","2020/2021 Rates","2020/2021 Rates","2020/2021 Rates","2020/2021 Rates","2020/2021 Rates","2020/2021 Rates",{"$f":"T8","v":"2020/2021 Rates"},{"$f":"U8","v":"2020/2021 Rates"},{"$f":"V8","v":"2020/2021 Rates"},{"$f":"W8","v":"2020/2021 Rates"},{"$f":"X8","v":"2020/2021 Rates"},null,{"$f":"New_Period&\" Rates\"","v":"2021/2022 Rates"},{"$f":"AA8","v":"2021/2022 Rates"},{"$f":"AB8","v":"2021/2022 Rates"},"2021/2022 Rates","2021/2022 Rates","2021/2022 Rates","2021/2022 Rates","2021/2022 Rates","2021/2022 Rates","2021/2022 Rates","2021/2022 Rates","2021/2022 Rates","2021/2022 Rates","2021/2022 Rates","2021/2022 Rates","2021/2022 Rates",{"$f":"AP8","v":"2021/2022 Rates"},{"$f":"AQ8","v":"2021/2022 Rates"},{"$f":"AR8","v":"2021/2022 Rates"},{"$f":"AS8","v":"2021/2022 Rates"},{"$f":"AT8","v":"2021/2022 Rates"}]
{"$rows_left_out":32}
{"sheet":"Rates SPU - New","index":6,"n_rows":47,"n_cols":19,"rows_kept":47,"cut":false,"hidden":true,"merged":[]}
[]
[]
[]
[null,null,{"$f":"\"Small Power User | Tariff Inputs | \"&New_Period","v":"Small Power User | Tariff Inputs | 2021/2022"}]
[null,null,null,null,null,null,null,null,null,null,null,null,null,"Dx NAC"]
[null,null,"Rates - All Other",null,null,null,null,null,"kWhRBlock1","kWhRBlock4","kWhHP","Reliab","DxNDC Energy","NAC POD","SerS"]
[null,null,"Tariff","Tariff Category","Type","Column1","Code","Matrix Code","Energy charge Block 1 [c/kWh]","Energy charge Block 2 [c/kWh]","Energy charge [c/kWh]","Ancillary service charge [c/kWh]","Network demand charge [c/kWh]","Network capacity charge [R/POD/day]","Service and administration charge [R/POD/day]","Environmental levy charge [c/kWh]",null,null,"check"]
[null,null,"Businessrate 1","Non-Local Authority",null,null,{"$f":"C8&\"_\"&D8","v":"Businessrate 1_Non-Local Authority"},{"$f":"INDEX(Matrix_Tariff_Map,MATCH(C8,Matrix_Model_Tariffs,0),2)&IFERROR(INDEX(Matrix_Transmission_Map,MATCH(E8,Matrix_Model_Transmission,0),2),0)&IFERROR(INDEX(Matrix_Voltage_Map,MATCH(F8,Matrix_Model_Voltage,0),2),1)&INDEX(Matrix_Category_Map,MATCH(D8,Matrix_Model_Category,0),2)","v":"B101N"},{"$f":"IFERROR(INDEX([1]EskRateMatrixRD!$B$2:$AR$261,MATCH($H8,[1]EskRateMatrixRD!$B$2:$B$261,0),MATCH(I$6,[1]EskRateMatrixRD!$B$1:$AR$1,0)),\"n/a\")","v":0},{"$f":"IFERROR(INDEX([1]EskRateMatrixRD!$B$2:$AR$261,MATCH($H8,[1]EskRateMatrixRD!$B$2:$B$261,0),MATCH(J$6,[1]EskRateMatrixRD!$B$1:$AR$1,0)),\"n/a\")","v":0},{"$f":"IFERROR(INDEX([1]EskRateMatrixRD!$B$2:$AR$261,MATCH($H8,[1]EskRateMatrixRD!$B$2:$B$261,0),MATCH(K$6,[1]EskRateMatrixRD!$B$1:$AR$1,0)),\"n/a\")","v":142.88999999999999},{"$f":"IFERROR(INDEX([1]EskRateMatrixRD!$B$2:$AR$261,MATCH($H8,[1]EskRateMatrixRD!$B$2:$B$261,0),MATCH(L$6,[1]EskRateMatrixRD!$B$1:$AR$1,0)),\"n/a\")","v":0.55000000000000004},{"$f":"IFERROR(INDEX([1]EskRateMatrixRD!$B$2:$AR$261,MATCH($H8,[1]EskRateMatrixRD!$B$2:$B$261,0),MATCH(M$6,[1]EskRateMatrixRD!$B$1:$AR$1,0)),\"n/a\")","v":20.170000000000002},{"$f":"IFERROR(INDEX([1]EskRateMatrixRD!$B$2:$AR$261,MATCH($H8,[1]EskRateMatrixRD!$B$2:$B$261,0),MATCH(N$6,[1]EskRateMatrixRD!$B$1:$AR$1,0)),\"n/a\")","v":28.97},{"$f":"IFERROR(INDEX([1]EskRateMatrixRD!$B$2:$AR$261,MATCH($H8,[1]EskRateMatrixRD!$B$2:$B$261,0),MATCH(O$6,[1]EskRateMatrixRD!$B$1:$AR$1,0)),\"n/a\")","v":25.03},{"$f":"IFERROR(INDEX([1]EskRateMatrixRD!$B$2:$AR$261,MATCH($H8,[1]EskRateMatrixRD!$B$2:$B$261,0),MATCH(P$6,[1]EskRateMatrixRD!$B$1:$AR$1,0)),\"n/a\")","v":"n/a"}]
{"$rows_left_out":40}
{"sheet":"Rates SPU - Current","index":7,"n_rows":47,"n_cols":16,"rows_kept":47,"cut":false,"hidden":true,"merged":[]}
[]
[]
[]
[null,null,{"$f":"\"Small Power User | Tariff Inputs | \"&Current_Period","v":"Small Power User | Tariff Inputs | 2020/2021"}]
[null,null,null,null,null,null,null,null,null,null,null,null,null,"Dx NAC"]
[null,null,"Rates - All Other",null,null,null,null,null,"kWhRBlock1","kWhRBlock4","kWhHP","Reliab","DxNDC Energy","NAC POD","SerS"]
[null,null,"Tariff","Tariff Category","Type","Column1","Code","Matrix Code","Energy charge Block 1 [c/kWh]","Energy charge Block 2 [c/kWh]","Energy charge [c/kWh]","Ancillary service charge [c/kWh]","Network demand charge [c/kWh]","Network capacity charge [R/POD/day]","Service and administration charge [R/POD/day]","Environmental levy charge [c/kWh]"]
[null,null,"Businessrate 1","Non-Local Authority",null,null,{"$f":"C8&\"_\"&D8","v":"Businessrate 1_Non-Local Authority"},{"$f":"INDEX(Matrix_Tariff_Map,MATCH(C8,Matrix_Model_Tariffs,0),2)&IFERROR(INDEX(Matrix_Transmission_Map,MATCH(E8,Matrix_Model_Transmission,0),2),0)&IFERROR(INDEX(Matrix_Voltage_Map,MATCH(F8,Matrix_Model_Voltage,0),2),1)&INDEX(Matrix_Category_Map,MATCH(D8,Matrix_Model_Category,0),2)","v":"B101N"},{"$f":"IFERROR(INDEX([2]EskRateMatrixRD!$B$2:$AR$257,MATCH($H8,[2]EskRateMatrixRD!$B$2:$B$257,0),MATCH(I$6,[2]EskRateMatrixRD!$B$1:$AR$1,0)),\"n/a\")","v":0},{"$f":"IFERROR(INDEX([2]EskRateMatrixRD!$B$2:$AR$257,MATCH($H8,[2]EskRateMatrixRD!$B$2:$B$257,0),MATCH(J$6,[2]EskRateMatrixRD!$B$1:$AR$1,0)),\"n/a\")","v":0},{"$f":"IFERROR(INDEX([2]EskRateMatrixRD!$B$2:$AR$257,MATCH($H8,[2]EskRateMatrixRD!$B$2:$B$257,0),MATCH(K$6,[2]EskRateMatrixRD!$B$1:$AR$1,0)),\"n/a\")","v":124.19},{"$f":"IFERROR(INDEX([2]EskRateMatrixRD!$B$2:$AR$257,MATCH($H8,[2]EskRateMatrixRD!$B$2:$B$257,0),MATCH(L$6,[2]EskRateMatrixRD!$B$1:$AR$1,0)),\"n/a\")","v":0.48},{"$f":"IFERROR(INDEX([2]EskRateMatrixRD!$B$2:$AR$257,MATCH($H8,[2]EskRateMatrixRD!$B$2:$B$257,0),MATCH(M$6,[2]EskRateMatrixRD!$B$1:$AR$1,0)),\"n/a\")","v":17.53},{"$f":"IFERROR(INDEX([2]EskRateMatrixRD!$B$2:$AR$257,MATCH($H8,[2]EskRateMatrixRD!$B$2:$B$257,0),MATCH(N$6,[2]EskRateMatrixRD!$B$1:$AR$1,0)),\"n/a\")","v":25.18},{"$f":"IFERROR(INDEX([2]EskRateMatrixRD!$B$2:$AR$257,MATCH($H8,[2]EskRateMatrixRD!$B$2:$B$257,0),MATCH(O$6,[2]EskRateMatrixRD!$B$1:$AR$1,0)),\"n/a\")","v":21.75},{"$f":"IFERROR(INDEX([2]EskRateMatrixRD!$B$2:$AR$257,MATCH($H8,[2]EskRateMatrixRD!$B$2:$B$257,0),MATCH(P$6,[2]EskRateMatrixRD!$B$1:$AR$1,0)),\"n/a\")","v":"n/a"}]
{"$rows_left_out":40}
{"sheet":"Mapping","index":8,"n_rows":34,"n_cols":6,"rows_kept":34,"cut":false,"hidden":true,"merged":[]}
[]
[]
[]
[null,"Mapping"]
[]
[]
[null,"Model Tariffs","Matrix Code",null,"Model Transmission Zone","Matrix Code"]
[null,{"$f":"Lists!B17","v":"Businessrate 1"},"B1",null,"Not Applicable",0]
{"$rows_left_out":27}
{"sheet":"Lists","index":9,"n_rows":107,"n_cols":15,"rows_kept":107,"cut":false,"hidden":true,"merged":[]}
[]
[]
[]
[null,"Model Lists"]
[]
[null,"Selections","Dropbox ID","Description","ID",null,null,null,null,"Description","Dates","Units",null,"Customer Category","Tariff Category ID"]
[null,"Selected Tariff Category",2,{"$f":"INDEX(Tariff_Category_List,Dropdown_Category)","v":"Local Authority"},{"$f":"MATCH(D7,Tariff_Category_List,0)","v":2},{"$f":"Selected_Tariff_Category_ID","v":2},null,null,null,"ESKOM Financial Year End","2022-03-31","dd-mmm-yy",null,"Small Power User",1]
[null,"Selected Customer Category",1,{"$f":"INDEX(Customer_Category_List,Dropdown_Customer)","v":"Small Power User"},{"$f":"MATCH(D8,Customer_Category_List,0)","v":1},null,null,null,null,"Municipality Financial Year End",{"$f":"EOMONTH(ESKOM_Period,3)","v":"2022-06-30"},"dd-mmm-yy",null,"Large Power User",2]
{"$rows_left_out":100}
{"sheet":"Notes on updates","index":10,"n_rows":66,"n_cols":6,"rows_kept":66,"cut":false,"hidden":true,"merged":[[59,1,65,1],[51,1,57,1],[2,1,16,1],[18,1,26,1],[28,1,33,1],[35,1,41,1],[43,1,49,1]]}
[]
[null,null,"Notes on updates",null,"Sheet","Status"]
[null,"2015/16","]","Need to add SPU tariffs"]
[null,null,null,"Public Lighting All Night",null,"Done"]
[null,null,null,"Public Lighting 24 Hours"]
[null,null,null,"Public Lighting Urban Fixed"]
[null,null,null,"Landlight"]
[]
{"$rows_left_out":58}