{"text_format":"1","workbook":"xlsx","n_sheets":36,"sheets":["Menu","WEPS inc","WEPS Munic inc","Nightsave Large inc","Nightsave Large Munic inc","Nightsave Small inc","Nightsave Small Munic inc","Megaflex inc","Megaflex Munic inc ","Megaflex Gen inc","Miniflex inc","Miniflex Munic inc ","Businessrate inc","Businessrate Munic inc","Public Lighting inc","Public Lighting Munic inc","Homepower inc","Homepower Munic inc","Homelight inc","Nightsave Rural inc","Nightsave Rural Munic inc ","Ruraflex inc","Ruraflex Munic inc","Ruraflex Gen inc","Landrate inc","Landrate Munic inc","Homeflex inc","TOuS Original","TUoS","DUoS","Loss Factors","Excess NCC or MEC","Excess NCC Munic","Env levy","Sheet2","Reconciliaton"],"not_rendered":{"charts":0,"images":0,"macros":0,"external_links":7,"defined_names":782,"comments":2,"pivot_tables":0},"unopened":[],"bounds":{"document_bytes":16777216,"sheet_cells":100000,"rows_first":2000,"rows_last":500,"rows_between":2000,"halvings":0,"cell_chars":16384,"cell_head_chars":4096},"cells_cut":0,"cells_raw":0,"read":"whole","date_system":"1900"}

{"sheet":"Menu","index":0,"n_rows":28,"n_cols":10,"rows_kept":28,"cut":false,"hidden":false,"merged":[[1,5,1,10],[7,32,7,35],[8,32,8,35],[12,35,12,36],[3,32,3,38],[6,32,6,35],[5,7,5,9],[3,5,3,10]]}
[]
[null,null,null,null,null,"This file contains the excel tables of the rates contained in the published Schedule fo Standard Prices for Eskom tariffs."]
[]
[null,null,null,null,null,"\n2017/18 SCHEDULE OF STANDARD PRICES FOR ESKOM TARIFFS \n\n1 April 2017 to 31 March 2018 for Non-Local Authority supplies, and\n1 July 2017 to 30 June 2018 for Local Authority supplies. "]
[]
[null,null,null,null,null,null,null,"Click on the arrow to select the tariff"]
[null,null,null,null,null,null,null,"Non-local authority",null,"Local Authority"]
[null,null,null,null,null,"ê","WEPS","u",null,"u"]
[null,null,null,null,null,"ê","Megaflex","u",null,"u"]
[null,null,null,null,null,"ê","Nightsave large Urban","u",null,"u"]
[null,null,null,null,null,"ê","Miniflex","u",null,"u"]
[null,null,null,null,null,"ê","Nightsave small ","u",null,"u"]
[null,null,null,null,null,"ê","Businessrate","u",null,"u"]
[null,null,null,null,null,"ê","Public lighting","u",null,"u"]
[null,null,null,null,null,"ê","Ruraflex","u",null,"u"]
[null,null,null,null,null,"ê","Nightsave rural","u",null,"u"]
[null,null,null,null,null,"ê","Landrate tariffs","u",null,"u"]
[null,null,null,null,null,"ê","Homepower tariffs","u",null,"u"]
[null,null,null,null,null,"ê","Homelight tariffs","u",null,"n/a"]
[null,null,null,null,null,"ê","Excess NCC charges","u",null,"u"]
[null,null,null,null,null,"ê","Loss factors","u",null,"u"]
[null,null,null,null,null,"ê","Transmission use of system charges","u",null,"n/a"]
[null,null,null,null,null,"ê","Distribution use of system charges","u",null,"n/a"]
[null,null,null,null,null,"ê","Genflex Urban","u",null,"n/a"]
[null,null,null,null,null,"ê","Genflex Rural","u",null,"n/a"]
[null,null,null,null,null,"ê","Muniflex Urban","n/a",null,"u"]
[null,null,null,null,null,"ê","Muniflex Rural","n/a",null,"u"]
[null,null,null,null,null,"ê","Homeflex","u",null,"n/a"]

{"sheet":"WEPS inc","index":1,"n_rows":61,"n_cols":23,"rows_kept":61,"cut":false,"hidden":false,"merged":[[3,21,5,22],[11,7,14,7],[1,6,1,16],[1,17,1,22],[3,9,3,20],[4,7,6,7],[4,9,4,14],[4,15,4,20],[5,9,5,10],[5,11,5,12],[5,13,5,14],[5,15,5,16],[5,17,5,18],[5,19,5,20],[7,7,10,7],[29,7,29,8],[29,16,29,17],[15,7,18,7],[19,7,22,7],[24,7,24,14],[25,7,26,8],[25,9,26,10],[25,11,26,12],[25,13,26,14],[26,18,26,19],[27,7,27,8],[27,16,27,17],[28,7,28,8],[28,16,28,17],[26,16,26,17],[30,7,30,8],[30,16,30,17],[31,7,31,8],[31,16,31,17],[33,7,33,8],[33,9,34,10],[33,11,34,12],[33,16,33,19],[50,7,50,18],[35,7,35,8],[35,16,35,17],[35,18,35,19],[36,7,36,8],[37,7,37,8],[38,7,38,8],[39,7,39,8],[40,7,40,8],[43,9,44,10],[45,9,45,10],[43,7,45,8],[51,7,51,12],[51,13,51,18],[52,7,52,8],[52,9,52,10],[52,11,52,12],[52,13,52,14],[52,15,52,16],[52,17,52,18],[56,7,56,18],[57,7,57,12],[57,13,57,18],[58,7,58,8],[58,9,58,10],[58,11,58,12],[58,13,58,14],[58,15,58,16],[58,17,58,18]]}
[null,null,null,null,null,null,"Back to menu"]
["Non-municipal",null,null,null,null,null,"WEPS",null,null,null,null,null,null,null,null,null,null,"Non-local authority"]
[]
[null,null,null,null,null,null,null,null,null,"Active energy charge [c/kWh]",null,null,null,null,null,null,null,null,null,null,null,"Transmission network charges [R/kVA/m]"]
[null,null,null,null,null,null,null,"Transmission zone",null,"High demand season [Jun - Aug]",null,null,null,null,null,"Low demand season [Sep - May]"]
[null,null,null,null,null,null,null,null,"Voltage","Peak",null,"Standard",null,"Off Peak",null,"Peak",null,"Standard",null,"Off Peak"]
["Tariff","Tariff nameBillcode","Tx zone","Voltage","Billcode",null,null,null,null,null,"VAT incl",null,"VAT incl",null,"VAT incl",null,"VAT incl",null,"VAT incl",null,"VAT incl",null,"VAT incl"]
["WEPS","We",0,1,{"$f":"B8&C8&D8&IF($A$2=\"Non-municipal\",\"N\",IF($A$2=\"Municiple\",\"Y\",\"error\"))","v":"We01N"},null,null,"≤ 300km","< 500V",278.33,{"$f":"ROUND(J8 * (1 + VAT), 2)","v":317.3},84.68,{"$f":"ROUND(L8 * (1 + VAT), 2)","v":96.54},46.24,{"$f":"ROUND(N8 * (1 + VAT), 2)","v":52.71},91.14,{"$f":"ROUND(P8 * (1 + VAT), 2)","v":103.9},62.89,{"$f":"ROUND(R8 * (1 + VAT), 2)","v":71.69},40.090000000000003,{"$f":"ROUND(T8 * (1 + VAT), 2)","v":45.7},7.96,{"$f":"ROUND(V8 * (1 + VAT), 2)","v":9.07}]
["WEPS","We",0,2,"We02N",null,null,null,"≥ 500V & < 66kV",273.95999999999998,{"$f":"ROUND(J9 * (1 + VAT), 2)","v":312.31},83,94.62,45.07,51.38,89.36,101.87,61.51,70.12,39.020000000000003,44.48,7.28,8.3000000000000007]
["WEPS","We",0,3,"We03N",null,null,null,"≥ 66kV & ≤ 132kV",265.29000000000002,302.43,80.36,91.61,43.65,49.76,86.55,98.67,59.56,67.900000000000006,37.79,43.08,7.09,8.08]
["WEPS","We",0,4,"We04N",null,null,null,"> 132kV*",250.03,285.02999999999997,75.739999999999995,86.34,41.14,46.9,81.58,93,56.13,63.99,35.619999999999997,40.61,8.9499999999999993,10.199999999999999]
["WEPS","We",1,1,"We11N",null,null,"> 300km and \n≤ 600km","< 500V",280.60000000000002,319.88,85.02,96.92,46.16,52.62,91.54,104.36,63.02,71.84,39.979999999999997,45.58,8.02,9.14]
["WEPS","We",1,2,"We12N",null,null,null,"≥ 500V & < 66kV",276.7,315.44,83.82,95.55,45.52,51.89,90.27,102.91,62.12,70.819999999999993,39.409999999999997,44.93,7.35,8.3800000000000008]
["WEPS","We",1,3,"We13N",null,null,null,"≥ 66kV & ≤ 132kV",267.89999999999998,305.41000000000003,81.150000000000006,92.51,44.06,50.23,87.39,99.62,60.14,68.56,38.15,43.49,7.14,8.14]
["WEPS","We",1,4,"We14N",null,null,null,"> 132kV*",252.53,287.88,76.510000000000005,87.22,41.52,47.33,82.36,93.89,56.69,64.63,35.950000000000003,40.98,9.0399999999999991,10.31]
["WEPS","We",2,1,"We21N",null,null,"> 600km and \n≤ 900km","< 500V",283.39999999999998,323.08,85.85,97.87,46.6,53.12,92.45,105.39,63.63,72.540000000000006,40.35,46,8.1199999999999992,9.26]
["WEPS","We",2,2,"We22N",null,null,null,"≥ 500V & < 66kV",279.48,318.61,84.67,96.52,45.98,52.42,91.16,103.92,62.75,71.540000000000006,39.81,45.38,7.41,8.4499999999999993]
["WEPS","We",2,3,"We23N",null,null,null,"≥ 66kV & ≤ 132kV",270.63,308.52,81.98,93.46,44.51,50.74,88.27,100.63,60.76,69.27,38.54,43.94,7.18,8.19]
["WEPS","We",2,4,"We24N",null,null,null,"> 132kV*",255.08,290.79000000000002,77.260000000000005,88.08,41.97,47.85,83.21,94.86,57.26,65.28,36.340000000000003,41.43,9.17,10.45]
["WEPS","We",3,1,"We31N",null,null,"> 900km","< 500V",286.25,326.33,86.74,98.88,47.09,53.68,93.39,106.46,64.260000000000005,73.260000000000005,40.79,46.5,8.16,9.3000000000000007]
["WEPS","We",3,2,"We32N",null,null,null,"≥ 500V & < 66kV",282.26,321.77999999999997,85.5,97.47,46.41,52.91,92.06,104.95,63.35,72.22,40.200000000000003,45.83,7.5,8.5500000000000007]
["WEPS","We",3,3,"We33N",null,null,null,"≥ 66kV & ≤ 132kV",273.33999999999997,311.61,82.8,94.39,44.96,51.25,89.16,101.64,61.37,69.959999999999994,38.93,44.38,7.25,8.27]
["WEPS","We",3,4,"We34N",null,null,null,"> 132kV*",257.56,293.62,78.06,88.99,42.41,48.35,84.07,95.84,57.88,65.98,36.74,41.88,9.24,10.53]
[null,null,null,null,null,null,null,null,"* 132 kV or Transmission connected"]
[null,null,null,null,null,null,null,"Distribution network charges"]
[null,null,null,null,null,null,null,"Voltage",null,"Network capacity charge \n[R/kVA/m]",null,"Network demand charge \n[R/kVA/m]",null,"Urban low voltage subsidy charge [R/kVA/m]"]
[null,null,null,null,null,null,null,null,null,null,null,null,null,null,null,null,"Voltage",null,"Ancillary service charge [c/kWh]"]
["Tariff","Tariff nameBillcode","Tx zone","Voltage","Billcode",null,null,null,null,null,"VAT incl",null,"VAT incl",null,"VAT incl",null,null,null,null,"VAT incl"]
["WEPS","We",0,1,"We01N",null,null,"< 500V",null,15.82,{"$f":"ROUND(J29 * (1 + VAT), 2)","v":18.03},30,{"$f":"ROUND(L29 * (1 + VAT), 2)","v":34.200000000000003},0,{"$f":"ROUND(N29 * (1 + VAT), 2)","v":0},null,"< 500V",null,0.37,{"$f":"ROUND(S29 * (1 + VAT), 2)","v":0.42}]
["WEPS","We",0,2,"We02N",null,null,"≥ 500V & < 66kV",null,14.51,{"$f":"ROUND(J30 * (1 + VAT), 2)","v":16.54},27.52,{"$f":"ROUND(L30 * (1 + VAT), 2)","v":31.37},0,{"$f":"ROUND(N30 * (1 + VAT), 2)","v":0},null,"≥ 500V & < 66kV",null,0.36,{"$f":"ROUND(S30 * (1 + VAT), 2)","v":0.41}]
["WEPS","We",0,3,"We03N",null,null,"≥ 66kV & ≤ 132kV",null,5.18,{"$f":"ROUND(J31 * (1 + VAT), 2)","v":5.91},9.6,{"$f":"ROUND(L31 * (1 + VAT), 2)","v":10.94},12.78,{"$f":"ROUND(N31 * (1 + VAT), 2)","v":14.57},null,"≥ 66kV & ≤ 132kV",null,0.34,{"$f":"ROUND(S31 * (1 + VAT), 2)","v":0.39}]
["WEPS","We",0,4,"We04N",null,null,"> 132kV / Transmission connected",null,0,{"$f":"ROUND(J32 * (1 + VAT), 2)","v":0},0,{"$f":"ROUND(L32 * (1 + VAT), 2)","v":0},12.78,{"$f":"ROUND(N32 * (1 + VAT), 2)","v":14.57},null,"> 132kV / Transmission connected",null,0.32,{"$f":"ROUND(S32 * (1 + VAT), 2)","v":0.36}]
[]
[null,null,null,null,null,null,null,"Customer categories",null,"Service charge  [R/account/day]",null,"Administration charge  [R/POD/day]",null,null,null,null,"Reactive energy charge  [c/kVArh]"]
[]
["Tariff","Tariff nameBillcode","Tx zone","Voltage","Billcode",null,null,null,null,null,"VAT incl",null,"VAT incl",null,null,null,"High season",null,"Low season"]
["WEPS","We",0,1,"We01N",null,null,"≤ 100 kVA",null,12.92,{"$f":"ROUND(J37 * (1 + VAT), 2)","v":14.73},2.84,{"$f":"ROUND(L37 * (1 + VAT), 2)","v":3.24},null,null,null,null,"VAT incl",null,"VAT incl"]
["WEPS","We",0,1,"We01N",null,null,"> 100 kVA & ≤ 500 kVA",null,59.03,{"$f":"ROUND(J38 * (1 + VAT), 2)","v":67.290000000000006},16.55,{"$f":"ROUND(L38 * (1 + VAT), 2)","v":18.87},null,null,null,12.8,{"$f":"ROUND(Q38 * (1 + VAT), 2)","v":14.59},0,{"$f":"ROUND(S38 * (1 + VAT), 2)","v":0}]
["WEPS","We",0,1,"We01N",null,null,"> 500 kVA & ≤ 1 MVA",null,181.66,{"$f":"ROUND(J39 * (1 + VAT), 2)","v":207.09},32.880000000000003,{"$f":"ROUND(L39 * (1 + VAT), 2)","v":37.479999999999997}]
["WEPS","We",0,1,"We01N",null,null,"> 1 MVA",null,181.66,{"$f":"ROUND(J40 * (1 + VAT), 2)","v":207.09},81.87,{"$f":"ROUND(L40 * (1 + VAT), 2)","v":93.33}]
["WEPS","We",0,1,"We01N",null,null,"Key customers",null,3559.79,{"$f":"ROUND(J41 * (1 + VAT), 2)","v":4058.16},113.69,{"$f":"ROUND(L41 * (1 + VAT), 2)","v":129.61000000000001}]
[]
[]
[null,null,null,null,null,null,null,"Electrification and rural network subsidy charge  [c/kWh]",null,"Affordability subsidy charge [c/kWh] \nOnly payable by non-local authority tariffs"]
[]
[]
["Tariff","Tariff nameBillcode","Tx zone","Voltage","Billcode",null,null,null,"VAT incl",null,"VAT incl"]
["WEPS","We",0,1,"We01N",null,null,7.08,{"$f":"ROUND(H48 * (1 + VAT), 2)","v":8.07},2.87,{"$f":"ROUND(J48 * (1 + VAT), 2)","v":3.27}]
[]
[]
[null,null,null,null,null,null,null,"Active energy charge excluding losses   [c/kWh]"]
[null,null,null,null,null,null,null,"High demand season [Jun - Aug]",null,null,null,null,null,"Low demand season [Sep - May]"]
[null,null,null,null,null,null,null,"Peak",null,"Standard",null,"Off Peak",null,"Peak",null,"Standard",null,"Off Peak"]
["Tariff","Tariff nameBillcode","Tx zone","Voltage","Billcode",null,null,null,"VAT incl",null,"VAT incl",null,"VAT incl",null,"VAT incl",null,"VAT incl",null,"VAT incl"]
["WEPS","We",0,1,"We01N",null,null,{"$f":"ROUND(J11/'Loss Factors'!$T$6, 2)","v":247.38},{"$f":"ROUND(H55 * (1 + VAT), 2)","v":282.01},{"$f":"ROUND(L11/'Loss Factors'!$T$6, 2)","v":74.94},{"$f":"ROUND(J55 * (1 + VAT), 2)","v":85.43},{"$f":"ROUND(N11/'Loss Factors'!$T$6, 2)","v":40.700000000000003},{"$f":"ROUND(L55 * (1 + VAT), 2)","v":46.4},{"$f":"ROUND(P11/'Loss Factors'!$T$6, 2)","v":80.72},{"$f":"ROUND(N55 * (1 + VAT), 2)","v":92.02},{"$f":"ROUND(R11/'Loss Factors'!$T$6, 2)","v":55.54},{"$f":"ROUND(P55 * (1 + VAT), 2)","v":63.32},{"$f":"ROUND(T11/'Loss Factors'!$T$6, 2)","v":35.24},{"$f":"ROUND(R55 * (1 + VAT), 2)","v":40.17}]
[]
[null,null,null,null,null,null,null,"Active energy charge excluding losses and enviromental levy   [c/kWh]"]
[null,null,null,null,null,null,null,"High demand season [Jun - Aug]",null,null,null,null,null,"Low demand season [Sep - May]"]
[null,null,null,null,null,null,null,"Peak",null,"Standard",null,"Off Peak",null,"Peak",null,"Standard",null,"Off Peak"]
["Tariff","Tariff nameBillcode","Tx zone","Voltage","Billcode",null,null,null,"VAT incl",null,"VAT incl",null,"VAT incl",null,"VAT incl",null,"VAT incl",null,"VAT incl"]
["WEPS","We",0,1,"We01N",null,null,{"$f":"H55-ROUND('Env levy'!$C$8,2)","v":243.89},{"$f":"ROUND(H61 * (1 + VAT), 2)","v":278.02999999999997},{"$f":"J55-ROUND('Env levy'!$C$8,2)","v":71.45},{"$f":"ROUND(J61 * (1 + VAT), 2)","v":81.45},{"$f":"L55-ROUND('Env levy'!$C$8,2)","v":37.21},{"$f":"ROUND(L61 * (1 + VAT), 2)","v":42.42},{"$f":"N55-ROUND('Env levy'!$C$8,2)","v":77.23},{"$f":"ROUND(N61 * (1 + VAT), 2)","v":88.04},{"$f":"P55-ROUND('Env levy'!$C$8,2)","v":52.05},{"$f":"ROUND(P61 * (1 + VAT), 2)","v":59.34},{"$f":"R55-ROUND('Env levy'!$C$8,2)","v":31.75},{"$f":"ROUND(R61 * (1 + VAT), 2)","v":36.200000000000003}]

{"sheet":"WEPS Munic inc","index":2,"n_rows":61,"n_cols":23,"rows_kept":61,"cut":false,"hidden":false,"merged":[[3,21,5,22],[11,7,14,7],[1,6,1,16],[1,17,1,22],[3,9,3,20],[4,7,6,7],[4,9,4,14],[4,15,4,20],[5,9,5,10],[5,11,5,12],[5,13,5,14],[5,15,5,16],[5,17,5,18],[5,19,5,20],[7,7,10,7],[29,7,29,8],[15,7,18,7],[19,7,22,7],[24,7,24,14],[25,7,26,8],[25,9,26,10],[25,11,26,12],[25,13,26,14],[26,18,26,19],[27,7,27,8],[28,7,28,8],[28,16,28,17],[26,16,27,17],[43,7,45,8],[38,7,38,8],[30,7,30,8],[30,16,30,17],[31,7,31,8],[31,16,31,17],[33,7,33,8],[33,9,34,10],[33,11,34,12],[33,16,33,19],[35,7,35,8],[35,16,35,17],[35,18,35,19],[36,7,36,8],[37,7,37,8],[52,7,52,8],[52,9,52,10],[52,11,52,12],[52,13,52,14],[52,15,52,16],[29,16,29,17],[56,7,56,18],[57,7,57,12],[57,13,57,18],[58,7,58,8],[58,9,58,10],[58,11,58,12],[58,13,58,14],[58,15,58,16],[58,17,58,18],[52,17,52,18],[39,7,39,8],[40,7,40,8],[50,7,50,18],[51,7,51,12],[51,13,51,18]]}
[null,null,null,null,null,null,"Back to menu"]
["Municiple",null,null,null,null,null,"WEPS",null,null,null,null,null,null,null,null,null,null,"Local authority"]
[]
[null,null,null,null,null,null,null,null,null,"Active energy charge [c/kWh]",null,null,null,null,null,null,null,null,null,null,null,"Transmission network charges [R/kVA/m]"]
[null,null,null,null,null,null,null,"Transmission zone",null,"High demand season [Jun - Aug]",null,null,null,null,null,"Low demand season [Sep - May]"]
[null,null,null,null,null,null,null,null,"Voltage","Peak",null,"Standard",null,"Off Peak",null,"Peak",null,"Standard",null,"Off Peak"]
["Tariff","Tariff nameBillcode","Tx zone","Voltage","Billcode",null,null,null,null,null,"VAT incl",null,"VAT incl",null,"VAT incl",null,"VAT incl",null,"VAT incl",null,"VAT incl",null,"VAT incl"]
["WEPS","We",0,1,{"$f":"B8&C8&D8&IF($A$2=\"Non-municipal\",\"N\",IF($A$2=\"Municiple\",\"Y\",\"error\"))","v":"We01Y"},null,null,"≤ 300km","< 500V",279.70999999999998,{"$f":"ROUND(J8 * (1 + VAT), 2)","v":318.87},85.11,{"$f":"ROUND(L8 * (1 + VAT), 2)","v":97.03},46.44,{"$f":"ROUND(N8 * (1 + VAT), 2)","v":52.94},91.58,{"$f":"ROUND(P8 * (1 + VAT), 2)","v":104.4},63.2,{"$f":"ROUND(R8 * (1 + VAT), 2)","v":72.05},40.28,{"$f":"ROUND(T8 * (1 + VAT), 2)","v":45.92},7.79,{"$f":"ROUND(V8 * (1 + VAT), 2)","v":8.8800000000000008}]
["WEPS","We",0,2,{"$f":"B9&C9&D9&IF($A$2=\"Non-municipal\",\"N\",IF($A$2=\"Municiple\",\"Y\",\"error\"))","v":"We02Y"},null,null,null,"≥ 500V & < 66kV",275.3,313.83999999999997,83.41,95.09,45.29,51.63,89.81,102.38,61.81,70.459999999999994,39.22,44.71,7.11,8.11]
["WEPS","We",0,3,"We03Y",null,null,null,"≥ 66kV & ≤ 132kV",266.61,303.94,80.760000000000005,92.07,43.86,50,86.97,99.15,59.87,68.25,37.97,43.29,6.92,7.89]
["WEPS","We",0,4,"We04Y",null,null,null,"> 132kV*",251.27,286.45,76.12,86.78,41.33,47.12,81.96,93.43,56.41,64.31,35.79,40.799999999999997,8.76,9.99]
["WEPS","We",1,1,"We11Y",null,null,"> 300km and \n≤ 600km","< 500V",281.99,321.47000000000003,85.43,97.39,46.38,52.87,91.99,104.87,63.33,72.2,40.17,45.79,7.83,8.93]
["WEPS","We",1,2,"We12Y",null,null,null,"≥ 500V & < 66kV",278.05,316.98,84.23,96.02,45.74,52.14,90.71,103.41,62.43,71.17,39.6,45.14,7.18,8.19]
["WEPS","We",1,3,"We13Y",null,null,null,"≥ 66kV & ≤ 132kV",269.22000000000003,306.91000000000003,81.55,92.97,44.28,50.48,87.82,100.11,60.44,68.900000000000006,38.33,43.7,6.97,7.95]
["WEPS","We",1,4,"We14Y",null,null,null,"> 132kV*",253.77,289.3,76.89,87.65,41.74,47.58,82.77,94.36,56.98,64.959999999999994,36.14,41.2,8.84,10.08]
["WEPS","We",2,1,"We21Y",null,null,"> 600km and \n≤ 900km","< 500V",284.8,324.67,86.28,98.36,46.84,53.4,92.9,105.91,63.95,72.900000000000006,40.57,46.25,7.93,9.0399999999999991]
["WEPS","We",2,2,"We22Y",null,null,null,"≥ 500V & < 66kV",280.85000000000002,320.17,85.07,96.98,46.2,52.67,91.63,104.46,63.03,71.849999999999994,40,45.6,7.24,8.25]
["WEPS","We",2,3,"We23Y",null,null,null,"≥ 66kV & ≤ 132kV",271.95999999999998,310.02999999999997,82.37,93.9,44.73,50.99,88.69,101.11,61.04,69.59,38.72,44.14,7.03,8.01]
["WEPS","We",2,4,"We24Y",null,null,null,"> 132kV*",256.32,292.2,77.66,88.53,42.16,48.06,83.62,95.33,57.55,65.61,36.51,41.62,8.9600000000000009,10.210000000000001]
["WEPS","We",3,1,"We31Y",null,null,"> 900km","< 500V",287.66000000000003,327.93,87.15,99.35,47.33,53.96,93.84,106.98,64.58,73.62,40.98,46.72,7.97,9.09]
["WEPS","We",3,2,"We32Y",null,null,null,"≥ 500V & < 66kV",283.66000000000003,323.37,85.92,97.95,46.66,53.19,92.52,105.47,63.68,72.599999999999994,40.380000000000003,46.03,7.31,8.33]
["WEPS","We",3,3,"We33Y",null,null,null,"≥ 66kV & ≤ 132kV",274.7,313.16000000000003,83.22,94.87,45.19,51.52,89.6,102.14,61.66,70.290000000000006,39.119999999999997,44.6,7.08,8.07]
["WEPS","We",3,4,"We34Y",null,null,null,"> 132kV*",258.83999999999997,295.08,78.45,89.43,42.63,48.6,84.48,96.31,58.15,66.290000000000006,36.909999999999997,42.08,9.0299999999999994,10.29]
[null,null,null,null,null,null,null,null,"* 132 kV or Transmission connected"]
[null,null,null,null,null,null,null,"Distribution network charges"]
[null,null,null,null,null,null,null,"Voltage",null,"Network capacity charge \n[R/kVA/m]",null,"Network demand charge \n[R/kVA/m]",null,"Urban low voltage subsidy charge [R/kVA/m]"]
[null,null,null,null,null,null,null,null,null,null,null,null,null,null,null,null,"Voltage",null,"Ancillary service charge [c/kWh]"]
["Tariff","Tariff nameBillcode","Tx zone","Voltage","Billcode",null,null,null,null,null,"VAT incl",null,"VAT incl",null,"VAT incl",null,null,null,null,"VAT incl"]
["WEPS","We",0,1,{"$f":"B29&C29&D29&IF($A$2=\"Non-municipal\",\"N\",IF($A$2=\"Municiple\",\"Y\",\"error\"))","v":"We01Y"},null,null,"< 500V",null,15.54,{"$f":"ROUND(J29 * (1 + VAT), 2)","v":17.72},29.45,{"$f":"ROUND(L29 * (1 + VAT), 2)","v":33.57},0,{"$f":"ROUND(N29 * (1 + VAT), 2)","v":0},null,"< 500V",null,0.36,{"$f":"ROUND(S29 * (1 + VAT), 2)","v":0.41}]
["WEPS","We",0,2,{"$f":"B30&C30&D30&IF($A$2=\"Non-municipal\",\"N\",IF($A$2=\"Municiple\",\"Y\",\"error\"))","v":"We02Y"},null,null,"≥ 500V & < 66kV",null,14.25,{"$f":"ROUND(J30 * (1 + VAT), 2)","v":16.25},27.01,{"$f":"ROUND(L30 * (1 + VAT), 2)","v":30.79},0,{"$f":"ROUND(N30 * (1 + VAT), 2)","v":0},null,"≥ 500V & < 66kV",null,0.35,{"$f":"ROUND(S30 * (1 + VAT), 2)","v":0.4}]
["WEPS","We",0,3,"We03Y",null,null,"≥ 66kV & ≤ 132kV",null,5.0999999999999996,{"$f":"ROUND(J31 * (1 + VAT), 2)","v":5.81},9.42,{"$f":"ROUND(L31 * (1 + VAT), 2)","v":10.74},12.48,{"$f":"ROUND(N31 * (1 + VAT), 2)","v":14.23},null,"≥ 66kV & ≤ 132kV",null,0.33,{"$f":"ROUND(S31 * (1 + VAT), 2)","v":0.38}]
["WEPS","We",0,4,"We04Y",null,null,"> 132kV / Transmission connected",null,0,{"$f":"ROUND(J32 * (1 + VAT), 2)","v":0},0,{"$f":"ROUND(L32 * (1 + VAT), 2)","v":0},12.48,{"$f":"ROUND(N32 * (1 + VAT), 2)","v":14.23},null,"> 132kV / Transmission",null,0.31,{"$f":"ROUND(S32 * (1 + VAT), 2)","v":0.35}]
[]
[null,null,null,null,null,null,null,"Customer categories",null,"Service charge  [R/account/day]",null,"Administration charge  [R/POD/day]",null,null,null,null,"Reactive energy charge  [c/kVArh]"]
[]
["Tariff","Tariff nameBillcode","Tx zone","Voltage","Billcode",null,null,null,null,null,"VAT incl",null,"VAT incl",null,null,null,"High season",null,"Low season"]
["WEPS","We",0,1,{"$f":"B37&C37&D37&IF($A$2=\"Non-municipal\",\"N\",IF($A$2=\"Municiple\",\"Y\",\"error\"))","v":"We01Y"},null,null,"≤ 100 kVA",null,12.62,{"$f":"ROUND(J37 * (1 + VAT), 2)","v":14.39},2.77,{"$f":"ROUND(L37 * (1 + VAT), 2)","v":3.16},null,null,null,null,"VAT incl",null,"VAT incl"]
["WEPS","We",0,1,{"$f":"B38&C38&D38&IF($A$2=\"Non-municipal\",\"N\",IF($A$2=\"Municiple\",\"Y\",\"error\"))","v":"We01Y"},null,null,"> 100 kVA & ≤ 500 kVA",null,57.67,{"$f":"ROUND(J38 * (1 + VAT), 2)","v":65.739999999999995},16.16,{"$f":"ROUND(L38 * (1 + VAT), 2)","v":18.420000000000002},null,null,null,12.49,{"$f":"ROUND(Q38 * (1 + VAT), 2)","v":14.24},0,{"$f":"ROUND(S38 * (1 + VAT), 2)","v":0}]
["WEPS","We",0,1,{"$f":"B39&C39&D39&IF($A$2=\"Non-municipal\",\"N\",IF($A$2=\"Municiple\",\"Y\",\"error\"))","v":"We01Y"},null,null,"> 500 kVA & ≤ 1 MVA",null,177.48,{"$f":"ROUND(J39 * (1 + VAT), 2)","v":202.33},32.130000000000003,{"$f":"ROUND(L39 * (1 + VAT), 2)","v":36.630000000000003}]
["WEPS","We",0,1,{"$f":"B40&C40&D40&IF($A$2=\"Non-municipal\",\"N\",IF($A$2=\"Municiple\",\"Y\",\"error\"))","v":"We01Y"},null,null,"> 1 MVA",null,177.48,{"$f":"ROUND(J40 * (1 + VAT), 2)","v":202.33},80,{"$f":"ROUND(L40 * (1 + VAT), 2)","v":91.2}]
["WEPS","We",0,1,{"$f":"B41&C41&D41&IF($A$2=\"Non-municipal\",\"N\",IF($A$2=\"Municiple\",\"Y\",\"error\"))","v":"We01Y"},null,null,"Key customers",null,3477.93,{"$f":"ROUND(J41 * (1 + VAT), 2)","v":3964.84},111.07,{"$f":"ROUND(L41 * (1 + VAT), 2)","v":126.62}]
[]
[]
[null,null,null,null,null,null,null,"Electrification and rural network subsidy charge  [c/kWh]"]
[]
[]
["Tariff","Tariff nameBillcode","Tx zone","Voltage","Billcode",null,null,null,"VAT incl"]
["WEPS","We",0,1,{"$f":"B48&C48&D48&IF($A$2=\"Non-municipal\",\"N\",IF($A$2=\"Municiple\",\"Y\",\"error\"))","v":"We01Y"},null,null,6.91,{"$f":"ROUND(H48 * (1 + VAT), 2)","v":7.88}]
[]
[]
[null,null,null,null,null,null,null,"Active energy charge excluding losses   [c/kWh]"]
[null,null,null,null,null,null,null,"High demand season [Jun - Aug]",null,null,null,null,null,"Low demand season [Sep - May]"]
[null,null,null,null,null,null,null,"Peak",null,"Standard",null,"Off Peak",null,"Peak",null,"Standard",null,"Off Peak"]
["Tariff","Tariff nameBillcode","Tx zone","Voltage","Billcode",null,null,null,"VAT incl",null,"VAT incl",null,"VAT incl",null,"VAT incl",null,"VAT incl",null,"VAT incl"]
["WEPS","We",0,1,{"$f":"B55&C55&D55&IF($A$2=\"Non-municipal\",\"N\",IF($A$2=\"Municiple\",\"Y\",\"error\"))","v":"We01Y"},null,null,{"$f":"ROUND(J11/'Loss Factors'!$T$6, 2)","v":248.61},{"$f":"ROUND(H55 * (1 + VAT), 2)","v":283.42},{"$f":"ROUND(L11/'Loss Factors'!$T$6, 2)","v":75.31},{"$f":"ROUND(J55 * (1 + VAT), 2)","v":85.85},{"$f":"ROUND(N11/'Loss Factors'!$T$6, 2)","v":40.89},{"$f":"ROUND(L55 * (1 + VAT), 2)","v":46.61},{"$f":"ROUND(P11/'Loss Factors'!$T$6, 2)","v":81.09},{"$f":"ROUND(N55 * (1 + VAT), 2)","v":92.44},{"$f":"ROUND(R11/'Loss Factors'!$T$6, 2)","v":55.81},{"$f":"ROUND(P55 * (1 + VAT), 2)","v":63.62},{"$f":"ROUND(T11/'Loss Factors'!$T$6, 2)","v":35.409999999999997},{"$f":"ROUND(R55 * (1 + VAT), 2)","v":40.369999999999997}]
[]
[null,null,null,null,null,null,null,"Active energy charge excluding losses and enviromental levy   [c/kWh]"]
[null,null,null,null,null,null,null,"High demand season [Jun - Aug]",null,null,null,null,null,"Low demand season [Sep - May]"]
[null,null,null,null,null,null,null,"Peak",null,"Standard",null,"Off Peak",null,"Peak",null,"Standard",null,"Off Peak"]
["Tariff","Tariff nameBillcode","Tx zone","Voltage","Billcode",null,null,null,"VAT incl",null,"VAT incl",null,"VAT incl",null,"VAT incl",null,"VAT incl",null,"VAT incl"]
["WEPS","We",0,1,{"$f":"B61&C61&D61&IF($A$2=\"Non-municipal\",\"N\",IF($A$2=\"Municiple\",\"Y\",\"error\"))","v":"We01Y"},null,null,{"$f":"H55-ROUND('Env levy'!$C$8,2)","v":245.12},{"$f":"ROUND(H61 * (1 + VAT), 2)","v":279.44},{"$f":"J55-ROUND('Env levy'!$C$8,2)","v":71.820000000000007},{"$f":"ROUND(J61 * (1 + VAT), 2)","v":81.87},{"$f":"L55-ROUND('Env levy'!$C$8,2)","v":37.4},{"$f":"ROUND(L61 * (1 + VAT), 2)","v":42.64},{"$f":"N55-ROUND('Env levy'!$C$8,2)","v":77.600000000000009},{"$f":"ROUND(N61 * (1 + VAT), 2)","v":88.46},{"$f":"P55-ROUND('Env levy'!$C$8,2)","v":52.32},{"$f":"ROUND(P61 * (1 + VAT), 2)","v":59.64},{"$f":"R55-ROUND('Env levy'!$C$8,2)","v":31.919999999999995},{"$f":"ROUND(R61 * (1 + VAT), 2)","v":36.39}]

{"sheet":"Nightsave Large inc","index":3,"n_rows":47,"n_cols":33,"rows_kept":47,"cut":false,"hidden":false,"merged":[[1,16,1,18],[3,9,3,12],[3,13,3,16],[4,7,6,7],[4,9,5,10],[4,11,5,12],[4,13,5,14],[4,15,5,16],[3,17,5,18],[7,7,10,7],[11,7,14,7],[15,7,18,7],[19,7,22,7],[25,7,25,14],[42,7,44,8],[26,7,27,8],[44,9,44,10],[27,17,27,18],[28,7,28,8],[29,7,29,8],[30,7,30,8],[31,7,31,8],[32,7,32,8],[26,9,27,10],[26,11,27,12],[26,13,27,14],[35,7,36,7],[35,8,36,9],[35,10,36,11],[42,9,43,10]]}
[null,null,null,null,null,null,null,"Back to menu"]
["Non-municipal",null,null,null,null,null,null,"Nightsave Urban Large tariff",null,null,null,null,null,null,null,null,"Non-local authority",null,null,null,null,null,null,null,null,null,null,null,null,null,null,null,"check value"]
[]
[null,null,null,null,null,null,null,null,null,"Active energy charge [c/kWh]",null,null,null,"Energy demand charge [R/kVA/m]",null,null,null,"Transmission network charges [R/kVA/m]"]
[null,null,null,null,null,null,null,"Transmission zone",null,"High demand season \n[Jun - Aug]",null,"Low demand season \n[Sep - May]",null,"High demand season \n[Jun - Aug]",null,"Low demand season \n[Sep - May]"]
[null,null,null,null,null,null,null,null,"Voltage"]
["Tariff","Tariff nameBillcode","Tx zone","Voltage","Billcode",null,null,null,null,"","VAT incl",null,"VAT incl","","VAT incl",null,"VAT incl",null,"VAT incl"]
["Nightsave Large","NL",0,1,{"$f":"B8&C8&D8&IF($A$2=\"Non-municipal\",\"N\",IF($A$2=\"Municiple\",\"Y\",\"error\"))","v":"NL01N"},null,null,"≤ 300km","< 500V",68.739999999999995,{"$f":"ROUND(J8 * (1 + VAT), 2)","v":78.36},53.44,{"$f":"ROUND(L8 * (1 + VAT), 2)","v":60.92},209.17,{"$f":"ROUND(N8 * (1 + VAT), 2)","v":238.45},29.23,{"$f":"ROUND(P8 * (1 + VAT), 2)","v":33.32},7.96,{"$f":"ROUND(R8 * (1 + VAT), 2)","v":9.07}]
["Nightsave Large","NL",0,2,{"$f":"B9&C9&D9&IF($A$2=\"Non-municipal\",\"N\",IF($A$2=\"Municiple\",\"Y\",\"error\"))","v":"NL02N"},null,null,null,"≥ 500V & < 66kV",65.099999999999994,74.209999999999994,50.81,57.92,202.45,230.79,28.3,32.26,7.28,8.3000000000000007]
["Nightsave Large","NL",0,3,"NL03N",null,null,null,"≥ 66kV & ≤ 132kV",64.62,73.67,50.2,57.23,195.08,222.39,27.27,31.09,7.09,8.08]
["Nightsave Large","NL",0,4,"NL04N",null,null,null,"> 132kV*",60.45,68.91,47,53.58,188.18,214.53,26.3,29.98,8.9499999999999993,10.199999999999999]
["Nightsave Large","NL",1,1,"NL11N",null,null,"> 300km and \n≤ 600km","< 500V",69.67,79.42,54.02,61.58,211.33,240.92,29.52,33.65,8.02,9.14]
["Nightsave Large","NL",1,2,"NL12N",null,null,null,"≥ 500V & < 66kV",66.459999999999994,75.760000000000005,51.85,59.11,204.5,233.13,28.55,32.549999999999997,7.35,8.3800000000000008]
["Nightsave Large","NL",1,3,"NL13N",null,null,null,"≥ 66kV & ≤ 132kV",65.97,75.209999999999994,51.22,58.39,197.01,224.59,27.52,31.37,7.14,8.14]
["Nightsave Large","NL",1,4,"NL14N",null,null,null,"> 132kV*",61.72,70.36,47.96,54.67,190.1,216.71,26.54,30.26,9.0399999999999991,10.31]
["Nightsave Large","NL",2,1,"NL21N",null,null,"> 600km and \n≤ 900km","< 500V",70.31,80.150000000000006,54.55,62.19,213.49,243.38,29.82,33.99,8.1199999999999992,9.26]
["Nightsave Large","NL",2,2,"NL22N",null,null,null,"≥ 500V & < 66kV",67.12,76.52,52.38,59.71,206.56,235.48,28.87,32.909999999999997,7.41,8.4499999999999993]
["Nightsave Large","NL",2,3,"NL23N",null,null,null,"≥ 66kV & ≤ 132kV",66.62,75.95,51.73,58.97,198.99,226.85,27.8,31.69,7.18,8.19]
["Nightsave Large","NL",2,4,"NL24N",null,null,null,"> 132kV*",62.32,71.040000000000006,48.45,55.23,192,218.88,26.81,30.56,9.17,10.45]
["Nightsave Large","NL",3,1,"NL31N",null,null,"> 900km","< 500V",71.06,81.010000000000005,55.11,62.83,215.56,245.74,30.11,34.33,8.16,9.3000000000000007]
["Nightsave Large","NL",3,2,"NL32N",null,null,null,"≥ 500V & < 66kV",67.78,77.27,52.89,60.29,208.63,237.84,29.12,33.200000000000003,7.5,8.5500000000000007]
["Nightsave Large","NL",3,3,"NL33N",null,null,null,"≥ 66kV & ≤ 132kV",67.31,76.73,52.24,59.55,201.03,229.17,28.08,32.01,7.25,8.27]
["Nightsave Large","NL",3,4,"NL34N",null,null,null,"> 132kV*",62.99,71.81,48.98,55.84,193.94,221.09,27.08,30.87,9.24,10.53]
[null,null,null,null,null,null,null,null,"* 132 kV or Transmission connected"]
[]
[null,null,null,null,null,null,null,"Distribution network charges"]
[null,null,null,null,null,null,null,"Voltage",null,"Network capacity charge \n[R/kVA/m]",null,"Network demand charge \n[R/kVA/m]",null,"Urban low voltage subsidy charge [R/kVA/m]"]
[null,null,null,null,null,null,null,null,null,null,null,null,null,null,null,null,"Voltage","Ancillary service charge [c/kWh]"]
["Tariff","Tariff nameBillcode","Tx zone","Voltage","Billcode",null,null,null,null,null,"VAT incl",null,"VAT incl",null,"VAT incl",null,null,null,"VAT incl"]
["Nightsave Large","NL",0,1,{"$f":"B30&C30&D30&IF($A$2=\"Non-municipal\",\"N\",IF($A$2=\"Municiple\",\"Y\",\"error\"))","v":"NL01N"},null,null,"< 500V",null,15.82,{"$f":"ROUND(J30 * (1 + VAT), 2)","v":18.03},30,{"$f":"ROUND(L30 * (1 + VAT), 2)","v":34.200000000000003},0,{"$f":"ROUND(N30 * (1 + VAT), 2)","v":0},null,"< 500V",0.37,{"$f":"ROUND(R30 * (1 + VAT), 2)","v":0.42}]
["Nightsave Large","NL",0,2,{"$f":"B31&C31&D31&IF($A$2=\"Non-municipal\",\"N\",IF($A$2=\"Municiple\",\"Y\",\"error\"))","v":"NL02N"},null,null,"≥ 500V & < 66kV",null,14.51,{"$f":"ROUND(J31 * (1 + VAT), 2)","v":16.54},27.52,{"$f":"ROUND(L31 * (1 + VAT), 2)","v":31.37},0,{"$f":"ROUND(N31 * (1 + VAT), 2)","v":0},null,"≥ 500V & < 66kV",0.36,{"$f":"ROUND(R31 * (1 + VAT), 2)","v":0.41}]
["Nightsave Large","NL",0,3,"NL03N",null,null,"≥ 66kV & ≤ 132kV",null,5.18,{"$f":"ROUND(J32 * (1 + VAT), 2)","v":5.91},9.6,{"$f":"ROUND(L32 * (1 + VAT), 2)","v":10.94},12.78,{"$f":"ROUND(N32 * (1 + VAT), 2)","v":14.57},null,"≥ 66kV & ≤ 132kV",0.34,{"$f":"ROUND(R32 * (1 + VAT), 2)","v":0.39}]
["Nightsave Large","NL",0,4,"NL04N",null,null,"> 132kV / Transmission connected",null,0,{"$f":"ROUND(J33 * (1 + VAT), 2)","v":0},0,{"$f":"ROUND(L33 * (1 + VAT), 2)","v":0},12.78,{"$f":"ROUND(N33 * (1 + VAT), 2)","v":14.57},null,"> 132kV*",0.32,{"$f":"ROUND(R33 * (1 + VAT), 2)","v":0.36}]
[null,null,null,null,null,null,null,null,null,null,null,null,null,null,null,null,"* 132 kV or Transmission connected"]
[]
[null,null,null,null,null,null,null,"Customer categories","Service charge  [R/account/day]",null,"Administration charge  [R/POD/day]"]
[]
["Tariff","Tariff nameBillcode","Tx zone","Voltage","Billcode",null,null,null,null,"VAT incl",null,"VAT incl"]
["Nightsave Large","NL",0,1,{"$f":"B39&C39&D39&IF($A$2=\"Non-municipal\",\"N\",IF($A$2=\"Municiple\",\"Y\",\"error\"))","v":"NL01N"},null,null,">1  MVA",181.66,{"$f":"ROUND(I39 * (1 + VAT), 2)","v":207.09},81.87,{"$f":"ROUND(K39 * (1 + VAT), 2)","v":93.33}]
["Nightsave Large","NL",0,1,{"$f":"B40&C40&D40&IF($A$2=\"Non-municipal\",\"N\",IF($A$2=\"Municiple\",\"Y\",\"error\"))","v":"NL01N"},null,null,"Key customers",3559.79,{"$f":"ROUND(I40 * (1 + VAT), 2)","v":4058.16},113.69,{"$f":"ROUND(K40 * (1 + VAT), 2)","v":129.61000000000001}]
[]
[]
[null,null,null,null,null,null,null,"Electrification and rural network subsidy charge  [c/kWh]",null,"Affordability subsidy charge [c/kWh] \nOnly payable by non-local authority tariffs"]
[]
[]
["Tariff","Tariff nameBillcode","Tx zone","Voltage","Billcode",null,null,null,"VAT incl",null,"VAT incl"]
["Nightsave Large","NL",0,1,{"$f":"B47&C47&D47&IF($A$2=\"Non-municipal\",\"N\",IF($A$2=\"Municiple\",\"Y\",\"error\"))","v":"NL01N"},null,null,7.08,{"$f":"ROUND(H47 * (1 + VAT), 2)","v":8.07},2.87,{"$f":"ROUND(J47 * (1 + VAT), 2)","v":3.27}]

{"sheet":"Nightsave Large Munic inc","index":4,"n_rows":47,"n_cols":33,"rows_kept":47,"cut":false,"hidden":false,"merged":[[1,16,1,18],[3,9,3,12],[3,13,3,16],[4,7,6,7],[4,9,5,10],[4,11,5,12],[4,13,5,14],[4,15,5,16],[3,17,5,18],[7,7,10,7],[11,7,14,7],[15,7,18,7],[19,7,22,7],[25,7,25,14],[35,7,36,7],[35,8,36,9],[35,10,36,11],[42,7,44,8],[27,17,27,18],[28,7,28,8],[29,7,29,8],[30,7,30,8],[31,7,31,8],[26,7,27,8],[32,7,32,8],[26,9,27,10],[26,11,27,12],[26,13,27,14]]}
[null,null,null,null,null,null,null,"Back to menu"]
["Municiple",null,null,null,null,null,null,"Nightsave Urban Large tariff",null,null,null,null,null,null,null,null,"Local authority",null,null,null,null,null,null,null,null,null,null,null,null,null,null,null,"check value"]
[]
[null,null,null,null,null,null,null,null,null,"Active energy charge [c/kWh]",null,null,null,"Energy demand charge [R/kVA/m]",null,null,null,"Transmission network charges [R/kVA/m]"]
[null,null,null,null,null,null,null,"Transmission zone",null,"High demand season \n[Jun - Aug]",null,"Low demand season \n[Sep - May]",null,"High demand season \n[Jun - Aug]",null,"Low demand season \n[Sep - May]"]
[null,null,null,null,null,null,null,null,"Voltage"]
["Tariff","Tariff nameBillcode","Tx zone","Voltage","Billcode",null,null,null,null,"","VAT incl",null,"VAT incl","","VAT incl",null,"VAT incl",null,"VAT incl"]
["Nightsave Large","NL",0,1,{"$f":"B8&C8&D8&IF($A$2=\"Non-municipal\",\"N\",IF($A$2=\"Municiple\",\"Y\",\"error\"))","v":"NL01Y"},null,null,"≤ 300km","< 500V",69.08,{"$f":"ROUND(J8 * (1 + VAT), 2)","v":78.75},53.72,{"$f":"ROUND(L8 * (1 + VAT), 2)","v":61.24},206.26,{"$f":"ROUND(N8 * (1 + VAT), 2)","v":235.14},28.82,{"$f":"ROUND(P8 * (1 + VAT), 2)","v":32.85},7.79,{"$f":"ROUND(R8 * (1 + VAT), 2)","v":8.8800000000000008}]
["Nightsave Large","NL",0,2,{"$f":"B9&C9&D9&IF($A$2=\"Non-municipal\",\"N\",IF($A$2=\"Municiple\",\"Y\",\"error\"))","v":"NL02Y"},null,null,null,"≥ 500V & < 66kV",65.42,74.58,51.06,58.21,199.64,227.59,27.92,31.83,7.11,8.11]
["Nightsave Large","NL",0,3,"NL03Y",null,null,null,"≥ 66kV & ≤ 132kV",64.94,74.03,50.43,57.49,192.37,219.3,26.88,30.64,6.92,7.89]
["Nightsave Large","NL",0,4,"NL04Y",null,null,null,"> 132kV*",60.75,69.260000000000005,47.24,53.85,185.57,211.55,25.92,29.55,8.76,9.99]
["Nightsave Large","NL",1,1,"NL11Y",null,null,"> 300km and \n≤ 600km","< 500V",69.989999999999995,79.790000000000006,54.3,61.9,208.4,237.58,29.1,33.17,7.83,8.93]
["Nightsave Large","NL",1,2,"NL12Y",null,null,null,"≥ 500V & < 66kV",66.78,76.13,52.09,59.38,201.65,229.88,28.16,32.1,7.18,8.19]
["Nightsave Large","NL",1,3,"NL13Y",null,null,null,"≥ 66kV & ≤ 132kV",66.290000000000006,75.569999999999993,51.48,58.69,194.28,221.48,27.15,30.95,6.97,7.95]
["Nightsave Large","NL",1,4,"NL14Y",null,null,null,"> 132kV*",62,70.680000000000007,48.2,54.95,187.46,213.7,26.18,29.85,8.84,10.08]
["Nightsave Large","NL",2,1,"NL21Y",null,null,"> 600km and \n≤ 900km","< 500V",70.66,80.55,54.82,62.49,210.51,239.98,29.41,33.53,7.93,9.0399999999999991]
["Nightsave Large","NL",2,2,"NL22Y",null,null,null,"≥ 500V & < 66kV",67.45,76.89,52.63,60,203.7,232.22,28.47,32.46,7.24,8.25]
["Nightsave Large","NL",2,3,"NL23Y",null,null,null,"≥ 66kV & ≤ 132kV",66.95,76.319999999999993,52,59.28,196.24,223.71,27.4,31.24,7.03,8.01]
["Nightsave Large","NL",2,4,"NL24Y",null,null,null,"> 132kV*",62.63,71.400000000000006,48.69,55.51,189.35,215.86,26.45,30.15,8.9600000000000009,10.210000000000001]
["Nightsave Large","NL",3,1,"NL31Y",null,null,"> 900km","< 500V",71.41,81.41,55.37,63.12,212.58,242.34,29.7,33.86,7.97,9.09]
["Nightsave Large","NL",3,2,"NL32Y",null,null,null,"≥ 500V & < 66kV",68.12,77.66,53.14,60.58,205.73,234.53,28.72,32.74,7.31,8.33]
["Nightsave Large","NL",3,3,"NL33Y",null,null,null,"≥ 66kV & ≤ 132kV",67.62,77.09,52.5,59.85,198.22,225.97,27.7,31.58,7.08,8.07]
["Nightsave Large","NL",3,4,"NL34Y",null,null,null,"> 132kV*",63.31,72.17,49.23,56.12,191.25,218.03,26.7,30.44,9.0299999999999994,10.29]
[null,null,null,null,null,null,null,null,"* 132 kV or Transmission connected"]
[]
[null,null,null,null,null,null,null,"Distribution network charges"]
[null,null,null,null,null,null,null,"Voltage",null,"Network capacity charge \n[R/kVA/m]",null,"Network demand charge \n[R/kVA/m]",null,"Urban low voltage subsidy charge [R/kVA/m]"]
[null,null,null,null,null,null,null,null,null,null,null,null,null,null,null,null,"Voltage","Ancillary service charge [c/kWh]"]
["Tariff","Tariff nameBillcode","Tx zone","Voltage","Billcode",null,null,null,null,null,"VAT incl",null,"VAT incl",null,"VAT incl",null,null,null,"VAT incl"]
["Nightsave Large","NL",0,1,{"$f":"B30&C30&D30&IF($A$2=\"Non-municipal\",\"N\",IF($A$2=\"Municiple\",\"Y\",\"error\"))","v":"NL01Y"},null,null,"< 500V",null,15.54,{"$f":"ROUND(J30 * (1 + VAT), 2)","v":17.72},29.45,{"$f":"ROUND(L30 * (1 + VAT), 2)","v":33.57},0,{"$f":"ROUND(N30 * (1 + VAT), 2)","v":0},null,"< 500V",0.36,{"$f":"ROUND(R30 * (1 + VAT), 2)","v":0.41}]
["Nightsave Large","NL",0,2,{"$f":"B31&C31&D31&IF($A$2=\"Non-municipal\",\"N\",IF($A$2=\"Municiple\",\"Y\",\"error\"))","v":"NL02Y"},null,null,"≥ 500V & < 66kV",null,14.25,{"$f":"ROUND(J31 * (1 + VAT), 2)","v":16.25},27.01,{"$f":"ROUND(L31 * (1 + VAT), 2)","v":30.79},0,{"$f":"ROUND(N31 * (1 + VAT), 2)","v":0},null,"≥ 500V & < 66kV",0.35,{"$f":"ROUND(R31 * (1 + VAT), 2)","v":0.4}]
["Nightsave Large","NL",0,3,"NL03Y",null,null,"≥ 66kV & ≤ 132kV",null,5.0999999999999996,{"$f":"ROUND(J32 * (1 + VAT), 2)","v":5.81},9.42,{"$f":"ROUND(L32 * (1 + VAT), 2)","v":10.74},12.48,{"$f":"ROUND(N32 * (1 + VAT), 2)","v":14.23},null,"≥ 66kV & ≤ 132kV",0.33,{"$f":"ROUND(R32 * (1 + VAT), 2)","v":0.38}]
["Nightsave Large","NL",0,4,"NL04Y",null,null,"> 132kV / Transmission connected",null,0,{"$f":"ROUND(J33 * (1 + VAT), 2)","v":0},0,{"$f":"ROUND(L33 * (1 + VAT), 2)","v":0},12.48,{"$f":"ROUND(N33 * (1 + VAT), 2)","v":14.23},null,"> 132kV*",0.31,{"$f":"ROUND(R33 * (1 + VAT), 2)","v":0.35}]
[null,null,null,null,null,null,null,null,null,null,null,null,null,null,null,null,"* 132 kV or Transmission connected"]
[]
[null,null,null,null,null,null,null,"Customer categories","Service charge  [R/account/day]",null,"Administration charge  [R/POD/day]"]
[]
["Tariff","Tariff nameBillcode","Tx zone","Voltage","Billcode",null,null,null,null,"VAT incl",null,"VAT incl"]
["Nightsave Large","NL",0,1,{"$f":"B39&C39&D39&IF($A$2=\"Non-municipal\",\"N\",IF($A$2=\"Municiple\",\"Y\",\"error\"))","v":"NL01Y"},null,null,">1  MVA",177.48,{"$f":"ROUND(I39 * (1 + VAT), 2)","v":202.33},80,{"$f":"ROUND(K39 * (1 + VAT), 2)","v":91.2}]
["Nightsave Large","NL",0,1,{"$f":"B40&C40&D40&IF($A$2=\"Non-municipal\",\"N\",IF($A$2=\"Municiple\",\"Y\",\"error\"))","v":"NL01Y"},null,null,"Key customers",3477.93,{"$f":"ROUND(I40 * (1 + VAT), 2)","v":3964.84},111.07,{"$f":"ROUND(K40 * (1 + VAT), 2)","v":126.62}]
[]
[]
[null,null,null,null,null,null,null,"Electrification and rural network subsidy charge  [c/kWh]"]
[]
[]
["Tariff","Tariff nameBillcode","Tx zone","Voltage","Billcode",null,null,null,"VAT incl"]
["Nightsave Large","NL",0,1,{"$f":"B47&C47&D47&IF($A$2=\"Non-municipal\",\"N\",IF($A$2=\"Municiple\",\"Y\",\"error\"))","v":"NL01Y"},null,null,6.91,{"$f":"ROUND(H47 * (1 + VAT), 2)","v":7.88}]

{"sheet":"Nightsave Small inc","index":5,"n_rows":48,"n_cols":33,"rows_kept":48,"cut":false,"hidden":false,"merged":[[27,7,28,8],[1,6,1,16],[1,17,1,18],[3,9,3,12],[3,13,3,16],[3,17,5,18],[4,7,6,7],[4,9,5,10],[4,11,5,12],[4,13,5,14],[4,15,5,16],[7,7,10,7],[11,7,14,7],[15,7,18,7],[19,7,22,7],[25,7,25,14],[25,19,25,20],[26,9,27,10],[26,11,27,12],[26,13,27,14],[27,17,27,18],[35,10,36,11],[43,7,45,8],[43,9,44,10],[45,9,45,10],[29,7,29,8],[30,7,30,8],[31,7,31,8],[32,7,32,8],[35,7,36,7],[35,8,36,9]]}
[null,null,null,null,null,null,"Back to menu"]
["Non-municipal",null,null,null,null,null,"Nightsave Urban Small tariff  ",null,null,null,null,null,null,null,null,null,null,"Non-local authority",null,null,null,null,null,null,null,null,null,null,null,null,null,{"$f":"SUM(#REF!,#REF!,#REF!,#REF!,#REF!,#REF!,#REF!,#REF!,#REF!)","v":{"$error":"#REF!"}},"check value"]
[]
[null,null,null,null,null,null,null,null,null,"Active energy charge [c/kWh]",null,null,null,"Energy demand charge [R/kVA/m]",null,null,null,"Transmission network charges [R/kVA/m]"]
[null,null,null,null,null,null,null,"Transmission zone",null,"High demand season \n[Jun - Aug]",null,"Low demand season \n[Sep - May]",null,"High demand season \n[Jun - Aug]",null,"Low demand season \n[Sep - May]"]
[null,null,null,null,null,null,null,null,"Voltage"]
["Tariff","Tariff nameBillcode","Tx zone","Voltage","Billcode",null,null,null,null,"","VAT incl",null,"VAT incl","","VAT incl",null,"VAT incl",null,"VAT incl"]
["Nightsave Small","NS",0,1,{"$f":"B8&C8&D8&IF($A$2=\"Non-municipal\",\"N\",IF($A$2=\"Municiple\",\"Y\",\"error\"))","v":"NS01N"},null,null,"≤ 300km","< 500V",68.739999999999995,{"$f":"ROUND(J8 * (1 + VAT), 2)","v":78.36},53.44,{"$f":"ROUND(L8 * (1 + VAT), 2)","v":60.92},146.9,{"$f":"ROUND(N8 * (1 + VAT), 2)","v":167.47},18.93,{"$f":"ROUND(P8 * (1 + VAT), 2)","v":21.58},7.96,{"$f":"ROUND(R8 * (1 + VAT), 2)","v":9.07}]
["Nightsave Small","NS",0,2,{"$f":"B9&C9&D9&IF($A$2=\"Non-municipal\",\"N\",IF($A$2=\"Municiple\",\"Y\",\"error\"))","v":"NS02N"},null,null,null,"≥ 500V & < 66kV",65.099999999999994,74.209999999999994,50.81,57.92,142.16999999999999,162.07,18.29,20.85,7.28,8.3000000000000007]
["Nightsave Small","NS",0,3,"NS03N",null,null,null,"≥ 66kV & ≤ 132kV",64.62,73.67,50.2,57.23,136.94,156.11000000000001,17.61,20.079999999999998,7.09,8.08]
["Nightsave Small","NS",0,4,"NS04N",null,null,null,"> 132kV*",60.45,68.91,47,53.58,132.15,150.65,17,19.38,8.9499999999999993,10.199999999999999]
["Nightsave Small","NS",1,1,"NS11N",null,null,"> 300km and \n≤ 600km","< 500V",69.67,79.42,54.02,61.58,148.4,169.18,19.079999999999998,21.75,8.02,9.14]
["Nightsave Small","NS",1,2,"NS12N",null,null,null,"≥ 500V & < 66kV",66.459999999999994,75.760000000000005,51.85,59.11,143.6,163.69999999999999,18.47,21.06,7.35,8.3800000000000008]
["Nightsave Small","NS",1,3,"NS13N",null,null,null,"≥ 66kV & ≤ 132kV",65.97,75.209999999999994,51.22,58.39,138.35,157.72,17.8,20.29,7.14,8.14]
["Nightsave Small","NS",1,4,"NS14N",null,null,null,"> 132kV*",61.72,70.36,47.96,54.67,133.47,152.16,17.170000000000002,19.57,9.0399999999999991,10.31]
["Nightsave Small","NS",2,1,"NS21N",null,null,"> 600km and \n≤ 900km","< 500V",70.31,80.150000000000006,54.55,62.19,149.86000000000001,170.84,19.260000000000002,21.96,8.1199999999999992,9.26]
["Nightsave Small","NS",2,2,"NS22N",null,null,null,"≥ 500V & < 66kV",67.12,76.52,52.38,59.71,145.07,165.38,18.66,21.27,7.41,8.4499999999999993]
["Nightsave Small","NS",2,3,"NS23N",null,null,null,"≥ 66kV & ≤ 132kV",66.62,75.95,51.73,58.97,139.74,159.30000000000001,17.98,20.5,7.18,8.19]
["Nightsave Small","NS",2,4,"NS24N",null,null,null,"> 132kV*",62.32,71.040000000000006,48.45,55.23,134.79,153.66,17.34,19.77,9.17,10.45]
["Nightsave Small","NS",3,1,"NS31N",null,null,"> 900km","< 500V",71.06,81.010000000000005,55.11,62.83,151.38999999999999,172.58,19.47,22.2,8.16,9.3000000000000007]
["Nightsave Small","NS",3,2,"NS32N",null,null,null,"≥ 500V & < 66kV",67.78,77.27,52.89,60.29,146.49,167,18.850000000000001,21.49,7.5,8.5500000000000007]
["Nightsave Small","NS",3,3,"NS33N",null,null,null,"≥ 66kV & ≤ 132kV",67.31,76.73,52.24,59.55,141.16999999999999,160.93,18.170000000000002,20.71,7.25,8.27]
["Nightsave Small","NS",3,4,"NS34N",null,null,null,"> 132kV*",62.99,71.81,48.98,55.84,136.19999999999999,155.27000000000001,17.54,20,9.24,10.53]
[null,null,null,null,null,null,null,null,"* 132 kV or Transmission connected"]
[]
[null,null,null,null,null,null,null,"Distribution network charges"]
[null,null,null,null,null,null,null,null,null,"Network capacity charge \n[R/kVA/m]",null,"Network demand charge \n[R/kVA/m]",null,"Urban low voltage subsidy charge [R/kVA/m]"]
[null,null,null,null,null,null,null,"Voltage",null,null,null,null,null,null,null,null,"Voltage","Ancillary service charge [c/kWh]"]
["Tariff","Tariff nameBillcode","Tx zone","Voltage","Billcode",null,null,null,null,null,"VAT incl",null,"VAT incl",null,"VAT incl",null,null,null,"VAT incl"]
["Nightsave Small","NS",0,1,{"$f":"B30&C30&D30&IF($A$2=\"Non-municipal\",\"N\",IF($A$2=\"Municiple\",\"Y\",\"error\"))","v":"NS01N"},null,null,"< 500V",null,15.82,{"$f":"ROUND(J30 * (1 + VAT), 2)","v":18.03},30,{"$f":"ROUND(L30 * (1 + VAT), 2)","v":34.200000000000003},0,{"$f":"ROUND(N30 * (1 + VAT), 2)","v":0},null,"< 500V",0.37,{"$f":"ROUND(R30 * (1 + VAT), 2)","v":0.42}]
["Nightsave Small","NS",0,2,{"$f":"B31&C31&D31&IF($A$2=\"Non-municipal\",\"N\",IF($A$2=\"Municiple\",\"Y\",\"error\"))","v":"NS02N"},null,null,"≥ 500V & < 66kV",null,14.51,{"$f":"ROUND(J31 * (1 + VAT), 2)","v":16.54},27.52,{"$f":"ROUND(L31 * (1 + VAT), 2)","v":31.37},0,{"$f":"ROUND(N31 * (1 + VAT), 2)","v":0},null,"≥ 500V & < 66kV",0.36,{"$f":"ROUND(R31 * (1 + VAT), 2)","v":0.41}]
["Nightsave Small","NS",0,3,"NS03N",null,null,"≥ 66kV & ≤ 132kV",null,5.18,{"$f":"ROUND(J32 * (1 + VAT), 2)","v":5.91},9.6,{"$f":"ROUND(L32 * (1 + VAT), 2)","v":10.94},12.78,{"$f":"ROUND(N32 * (1 + VAT), 2)","v":14.57},null,"≥ 66kV & ≤ 132kV",0.34,{"$f":"ROUND(R32 * (1 + VAT), 2)","v":0.39}]
["Nightsave Small","NS",0,4,"NS04N",null,null,"> 132kV / Transmission connected",null,0,{"$f":"ROUND(J33 * (1 + VAT), 2)","v":0},0,{"$f":"ROUND(L33 * (1 + VAT), 2)","v":0},12.78,{"$f":"ROUND(N33 * (1 + VAT), 2)","v":14.57},null,"> 132kV*",0.32,{"$f":"ROUND(R33 * (1 + VAT), 2)","v":0.36}]
[null,null,null,null,null,null,null,null,null,null,null,null,null,null,null,null,"* 132 kV or Transmission connected"]
[]
[null,null,null,null,null,null,null,"Customer categories","Service charge  [R/account/day]",null,"Administration charge  [R/POD/day]"]
[]
["Tariff","Tariff nameBillcode","Tx zone","Voltage","Billcode",null,null,null,null,"VAT incl",null,"VAT incl"]
["Nightsave Small","NS",0,1,{"$f":"B39&C39&D39&IF($A$2=\"Non-municipal\",\"N\",IF($A$2=\"Municiple\",\"Y\",\"error\"))","v":"NS01N"},null,null,"≤ 100 kVA",12.92,{"$f":"ROUND(I39 * (1 + VAT), 2)","v":14.73},2.84,{"$f":"ROUND(K39 * (1 + VAT), 2)","v":3.24}]
["Nightsave Small","NS",0,1,{"$f":"B40&C40&D40&IF($A$2=\"Non-municipal\",\"N\",IF($A$2=\"Municiple\",\"Y\",\"error\"))","v":"NS01N"},null,null,"> 100 kVA & ≤ 500 kVA",59.03,{"$f":"ROUND(I40 * (1 + VAT), 2)","v":67.290000000000006},16.55,{"$f":"ROUND(K40 * (1 + VAT), 2)","v":18.87}]
["Nightsave Small","NS",0,1,{"$f":"B41&C41&D41&IF($A$2=\"Non-municipal\",\"N\",IF($A$2=\"Municiple\",\"Y\",\"error\"))","v":"NS01N"},null,null,"> 500 kVA & ≤ 1 MVA",181.66,{"$f":"ROUND(I41 * (1 + VAT), 2)","v":207.09},32.880000000000003,{"$f":"ROUND(K41 * (1 + VAT), 2)","v":37.479999999999997}]
["Nightsave Small","NS",0,1,{"$f":"B42&C42&D42&IF($A$2=\"Non-municipal\",\"N\",IF($A$2=\"Municiple\",\"Y\",\"error\"))","v":"NS01N"},null,null,"Key customers",3559.79,{"$f":"ROUND(I42 * (1 + VAT), 2)","v":4058.16},113.69,{"$f":"ROUND(K42 * (1 + VAT), 2)","v":129.61000000000001}]
[]
[null,null,null,null,null,null,null,"Electrification and rural network subsidy charge  [c/kWh]",null,"Affordability subsidy charge [c/kWh] \nOnly payable by non-local authority tariffs"]
[]
[]
["Tariff","Tariff nameBillcode","Tx zone","Voltage","Billcode",null,null,null,"VAT incl",null,"VAT incl"]
["Nightsave Small","NS",0,1,{"$f":"B48&C48&D48&IF($A$2=\"Non-municipal\",\"N\",IF($A$2=\"Municiple\",\"Y\",\"error\"))","v":"NS01N"},null,null,7.08,{"$f":"ROUND(H48 * (1 + VAT), 2)","v":8.07},2.87,{"$f":"ROUND(J48 * (1 + VAT), 2)","v":3.27}]

{"sheet":"Nightsave Small Munic inc","index":6,"n_rows":48,"n_cols":33,"rows_kept":48,"cut":false,"hidden":false,"merged":[[27,7,28,8],[1,6,1,16],[1,17,1,18],[3,9,3,12],[3,13,3,16],[3,17,5,18],[4,7,6,7],[4,9,5,10],[4,11,5,12],[4,13,5,14],[4,15,5,16],[7,7,10,7],[11,7,14,7],[15,7,18,7],[19,7,22,7],[25,7,25,14],[25,19,25,20],[26,9,27,10],[26,11,27,12],[26,13,27,14],[27,17,27,18],[35,10,36,11],[43,7,45,8],[29,7,29,8],[30,7,30,8],[31,7,31,8],[32,7,32,8],[35,7,36,7],[35,8,36,9]]}
[null,null,null,null,null,null,"Back to menu"]
["Municiple",null,null,null,null,null,"Nightsave Urban Small tariff  ",null,null,null,null,null,null,null,null,null,null,"Local authority",null,null,null,null,null,null,null,null,null,null,null,null,null,{"$f":"SUM(#REF!,#REF!,#REF!,#REF!,#REF!,#REF!,#REF!,#REF!,#REF!)","v":{"$error":"#REF!"}},"check value"]
[]
[null,null,null,null,null,null,null,null,null,"Active energy charge [c/kWh]",null,null,null,"Energy demand charge [R/kVA/m]",null,null,null,"Transmission network charges [R/kVA/m]"]
[null,null,null,null,null,null,null,"Transmission zone",null,"High demand season \n[Jun - Aug]",null,"Low demand season \n[Sep - May]",null,"High demand season \n[Jun - Aug]",null,"Low demand season \n[Sep - May]"]
[null,null,null,null,null,null,null,null,"Voltage"]
["Tariff","Tariff nameBillcode","Tx zone","Voltage","Billcode",null,null,null,null,"","VAT incl",null,"VAT incl","","VAT incl",null,"VAT incl",null,"VAT incl"]
["Nightsave Small","NS",0,1,{"$f":"B8&C8&D8&IF($A$2=\"Non-municipal\",\"N\",IF($A$2=\"Municiple\",\"Y\",\"error\"))","v":"NS01Y"},null,null,"≤ 300km","< 500V",69.08,{"$f":"ROUND(J8 * (1 + VAT), 2)","v":78.75},53.72,{"$f":"ROUND(L8 * (1 + VAT), 2)","v":61.24},144.85,{"$f":"ROUND(N8 * (1 + VAT), 2)","v":165.13},18.68,{"$f":"ROUND(P8 * (1 + VAT), 2)","v":21.3},7.79,{"$f":"ROUND(R8 * (1 + VAT), 2)","v":8.8800000000000008}]
["Nightsave Small","NS",0,2,{"$f":"B9&C9&D9&IF($A$2=\"Non-municipal\",\"N\",IF($A$2=\"Municiple\",\"Y\",\"error\"))","v":"NS02Y"},null,null,null,"≥ 500V & < 66kV",65.42,74.58,51.06,58.21,140.19,159.82,18.04,20.57,7.11,8.11]
["Nightsave Small","NS",0,3,"NS03Y",null,null,null,"≥ 66kV & ≤ 132kV",64.94,74.03,50.43,57.49,135.05000000000001,153.96,17.36,19.79,6.92,7.89]
["Nightsave Small","NS",0,4,"NS04Y",null,null,null,"> 132kV*",60.75,69.260000000000005,47.24,53.85,130.31,148.55000000000001,16.760000000000002,19.11,8.76,9.99]
["Nightsave Small","NS",1,1,"NS11Y",null,null,"> 300km and \n≤ 600km","< 500V",69.989999999999995,79.790000000000006,54.3,61.9,146.34,166.83,18.829999999999998,21.47,7.83,8.93]
["Nightsave Small","NS",1,2,"NS12Y",null,null,null,"≥ 500V & < 66kV",66.78,76.13,52.09,59.38,141.63,161.46,18.21,20.76,7.18,8.19]
["Nightsave Small","NS",1,3,"NS13Y",null,null,null,"≥ 66kV & ≤ 132kV",66.290000000000006,75.569999999999993,51.48,58.69,136.44,155.54,17.54,20,6.97,7.95]
["Nightsave Small","NS",1,4,"NS14Y",null,null,null,"> 132kV*",62,70.680000000000007,48.2,54.95,131.62,150.05000000000001,16.93,19.3,8.84,10.08]
["Nightsave Small","NS",2,1,"NS21Y",null,null,"> 600km and \n≤ 900km","< 500V",70.66,80.55,54.82,62.49,147.80000000000001,168.49,19,21.66,7.93,9.0399999999999991]
["Nightsave Small","NS",2,2,"NS22Y",null,null,null,"≥ 500V & < 66kV",67.45,76.89,52.63,60,143.04,163.07,18.399999999999999,20.98,7.24,8.25]
["Nightsave Small","NS",2,3,"NS23Y",null,null,null,"≥ 66kV & ≤ 132kV",66.95,76.319999999999993,52,59.28,137.81,157.1,17.72,20.2,7.03,8.01]
["Nightsave Small","NS",2,4,"NS24Y",null,null,null,"> 132kV*",62.63,71.400000000000006,48.69,55.51,132.91999999999999,151.53,17.09,19.48,8.9600000000000009,10.210000000000001]
["Nightsave Small","NS",3,1,"NS31Y",null,null,"> 900km","< 500V",71.41,81.41,55.37,63.12,149.29,170.19,19.190000000000001,21.88,7.97,9.09]
["Nightsave Small","NS",3,2,"NS32Y",null,null,null,"≥ 500V & < 66kV",68.12,77.66,53.14,60.58,144.46,164.68,18.579999999999998,21.18,7.31,8.33]
["Nightsave Small","NS",3,3,"NS33Y",null,null,null,"≥ 66kV & ≤ 132kV",67.62,77.09,52.5,59.85,139.19999999999999,158.69,17.91,20.420000000000002,7.08,8.07]
["Nightsave Small","NS",3,4,"NS34Y",null,null,null,"> 132kV*",63.31,72.17,49.23,56.12,134.32,153.12,17.29,19.71,9.0299999999999994,10.29]
[null,null,null,null,null,null,null,null,"* 132 kV or Transmission connected"]
[]
[null,null,null,null,null,null,null,"Distribution network charges"]
[null,null,null,null,null,null,null,null,null,"Network capacity charge \n[R/kVA/m]",null,"Network demand charge \n[R/kVA/m]",null,"Urban low voltage subsidy charge [R/kVA/m]"]
[null,null,null,null,null,null,null,"Voltage",null,null,null,null,null,null,null,null,"Voltage","Ancillary service charge [c/kWh]"]
["Tariff","Tariff nameBillcode","Tx zone","Voltage","Billcode",null,null,null,null,null,"VAT incl",null,"VAT incl",null,"VAT incl",null,null,null,"VAT incl"]
["Nightsave Small","NS",0,1,{"$f":"B30&C30&D30&IF($A$2=\"Non-municipal\",\"N\",IF($A$2=\"Municiple\",\"Y\",\"error\"))","v":"NS01Y"},null,null,"< 500V",null,15.54,{"$f":"ROUND(J30 * (1 + VAT), 2)","v":17.72},29.45,{"$f":"ROUND(L30 * (1 + VAT), 2)","v":33.57},0,{"$f":"ROUND(N30 * (1 + VAT), 2)","v":0},null,"< 500V",0.36,{"$f":"ROUND(R30 * (1 + VAT), 2)","v":0.41}]
["Nightsave Small","NS",0,2,{"$f":"B31&C31&D31&IF($A$2=\"Non-municipal\",\"N\",IF($A$2=\"Municiple\",\"Y\",\"error\"))","v":"NS02Y"},null,null,"≥ 500V & < 66kV",null,14.25,{"$f":"ROUND(J31 * (1 + VAT), 2)","v":16.25},27.01,{"$f":"ROUND(L31 * (1 + VAT), 2)","v":30.79},0,{"$f":"ROUND(N31 * (1 + VAT), 2)","v":0},null,"≥ 500V & < 66kV",0.35,{"$f":"ROUND(R31 * (1 + VAT), 2)","v":0.4}]
["Nightsave Small","NS",0,3,"NS03Y",null,null,"≥ 66kV & ≤ 132kV",null,5.0999999999999996,{"$f":"ROUND(J32 * (1 + VAT), 2)","v":5.81},9.42,{"$f":"ROUND(L32 * (1 + VAT), 2)","v":10.74},12.48,{"$f":"ROUND(N32 * (1 + VAT), 2)","v":14.23},null,"≥ 66kV & ≤ 132kV",0.33,{"$f":"ROUND(R32 * (1 + VAT), 2)","v":0.38}]
["Nightsave Small","NS",0,4,"NS04Y",null,null,"> 132kV / Transmission connected",null,0,{"$f":"ROUND(J33 * (1 + VAT), 2)","v":0},0,{"$f":"ROUND(L33 * (1 + VAT), 2)","v":0},12.48,{"$f":"ROUND(N33 * (1 + VAT), 2)","v":14.23},null,"> 132kV*",0.31,{"$f":"ROUND(R33 * (1 + VAT), 2)","v":0.35}]
[null,null,null,null,null,null,null,null,null,null,null,null,null,null,null,null,"* 132 kV or Transmission connected"]
[]
[null,null,null,null,null,null,null,"Customer categories","Service charge  [R/account/day]",null,"Administration charge  [R/POD/day]"]
[]
["Tariff","Tariff nameBillcode","Tx zone","Voltage","Billcode",null,null,null,null,"VAT incl",null,"VAT incl"]
["Nightsave Small","NS",0,1,{"$f":"B39&C39&D39&IF($A$2=\"Non-municipal\",\"N\",IF($A$2=\"Municiple\",\"Y\",\"error\"))","v":"NS01Y"},null,null,"≤ 100 kVA",12.62,{"$f":"ROUND(I39 * (1 + VAT), 2)","v":14.39},2.77,{"$f":"ROUND(K39 * (1 + VAT), 2)","v":3.16}]
["Nightsave Small","NS",0,1,{"$f":"B40&C40&D40&IF($A$2=\"Non-municipal\",\"N\",IF($A$2=\"Municiple\",\"Y\",\"error\"))","v":"NS01Y"},null,null,"> 100 kVA & ≤ 500 kVA",57.67,{"$f":"ROUND(I40 * (1 + VAT), 2)","v":65.739999999999995},16.16,{"$f":"ROUND(K40 * (1 + VAT), 2)","v":18.420000000000002}]
["Nightsave Small","NS",0,1,{"$f":"B41&C41&D41&IF($A$2=\"Non-municipal\",\"N\",IF($A$2=\"Municiple\",\"Y\",\"error\"))","v":"NS01Y"},null,null,"> 500 kVA & ≤ 1 MVA",177.48,{"$f":"ROUND(I41 * (1 + VAT), 2)","v":202.33},32.130000000000003,{"$f":"ROUND(K41 * (1 + VAT), 2)","v":36.630000000000003}]
["Nightsave Small","NS",0,1,{"$f":"B42&C42&D42&IF($A$2=\"Non-municipal\",\"N\",IF($A$2=\"Municiple\",\"Y\",\"error\"))","v":"NS01Y"},null,null,"Key customers",3477.93,{"$f":"ROUND(I42 * (1 + VAT), 2)","v":3964.84},111.07,{"$f":"ROUND(K42 * (1 + VAT), 2)","v":126.62}]
[]
[null,null,null,null,null,null,null,"Electrification and rural network subsidy charge  [c/kWh]"]
[]
[]
["Tariff","Tariff nameBillcode","Tx zone","Voltage","Billcode",null,null,null,"VAT incl"]
["Nightsave Small","NS",0,1,{"$f":"B48&C48&D48&IF($A$2=\"Non-municipal\",\"N\",IF($A$2=\"Municiple\",\"Y\",\"error\"))","v":"NS01Y"},null,null,6.91,{"$f":"ROUND(H48 * (1 + VAT), 2)","v":7.88}]

{"sheet":"Megaflex inc","index":7,"n_rows":46,"n_cols":33,"rows_kept":46,"cut":false,"hidden":false,"merged":[[11,7,14,7],[7,7,10,7],[30,7,30,8],[30,16,30,17],[15,7,18,7],[19,7,22,7],[25,7,25,14],[26,9,27,10],[26,11,27,12],[26,13,27,14],[29,7,29,8],[29,16,29,17],[37,7,37,8],[39,7,39,8],[1,6,1,16],[1,17,1,22],[3,9,3,20],[4,7,6,7],[4,9,4,14],[4,15,4,20],[5,9,5,10],[5,11,5,12],[5,13,5,14],[5,15,5,16],[5,17,5,18],[5,19,5,20],[3,21,5,22],[27,18,27,19],[41,7,43,8],[27,7,28,8],[27,16,28,17],[31,7,31,8],[31,16,31,17],[38,7,38,8],[41,9,42,10],[43,9,43,10],[32,7,32,8],[32,16,32,17],[35,7,35,8],[35,9,36,10],[35,11,36,12],[35,16,35,19],[36,16,36,17],[36,18,36,19]]}
[null,null,null,null,null,null,"Back to menu"]
["Non-municipal",null,null,null,null,null,"Megaflex tariff",null,null,null,null,null,null,null,null,null,null,"Non-local authority",null,null,null,null,null,null,null,null,null,null,null,null,null,{"$f":"SUM(J8:T23,V8:V23,#REF!,#REF!,#REF!,#REF!,H26:J26,L26)","v":{"$error":"#REF!"}},"check value"]
[]
[null,null,null,null,null,null,null,null,null,"Active energy charge [c/kWh]",null,null,null,null,null,null,null,null,null,null,null,"Transmission network charges [R/kVA/m]"]
[null,null,null,null,null,null,null,"Transmission zone",null,"High demand season [Jun - Aug]",null,null,null,null,null,"Low demand season [Sep - May]"]
[null,null,null,null,null,null,null,null,"Voltage","Peak",null,"Standard",null,"Off Peak",null,"Peak",null,"Standard",null,"Off Peak"]
["Tariff","Tariff nameBillcode","Tx zone","Voltage","Billcode",null,null,null,null,"","VAT incl",null,"VAT incl",null,"VAT incl",null,"VAT incl",null,"VAT incl",null,"VAT incl",null,"VAT incl"]
["Megaflex","Me",0,1,{"$f":"B8&C8&D8&IF($A$2=\"Non-municipal\",\"N\",IF($A$2=\"Municiple\",\"Y\",\"error\"))","v":"Me01N"},null,null,"≤ 300km","< 500V",278.33,{"$f":"ROUND(J8 * (1 + VAT), 2)","v":317.3},84.68,{"$f":"ROUND(L8 * (1 + VAT), 2)","v":96.54},46.24,{"$f":"ROUND(N8 * (1 + VAT), 2)","v":52.71},91.14,{"$f":"ROUND(P8 * (1 + VAT), 2)","v":103.9},62.89,{"$f":"ROUND(R8 * (1 + VAT), 2)","v":71.69},40.090000000000003,{"$f":"ROUND(T8 * (1 + VAT), 2)","v":45.7},7.96,{"$f":"ROUND(V8 * (1 + VAT), 2)","v":9.07}]
["Megaflex","Me",0,2,{"$f":"B9&C9&D9&IF($A$2=\"Non-municipal\",\"N\",IF($A$2=\"Municiple\",\"Y\",\"error\"))","v":"Me02N"},null,null,null,"≥ 500V & < 66kV",273.95999999999998,312.31,83,94.62,45.07,51.38,89.36,101.87,61.51,70.12,39.020000000000003,44.48,7.28,8.3000000000000007]
["Megaflex","Me",0,3,"Me03N",null,null,null,"≥ 66kV & ≤ 132kV",265.29000000000002,302.43,80.36,91.61,43.65,49.76,86.55,98.67,59.56,67.900000000000006,37.79,43.08,7.09,8.08]
["Megaflex","Me",0,4,"Me04N",null,null,null,"> 132kV*",250.03,285.02999999999997,75.739999999999995,86.34,41.14,46.9,81.58,93,56.13,63.99,35.619999999999997,40.61,8.9499999999999993,10.199999999999999]
["Megaflex","Me",1,1,"Me11N",null,null,"> 300km and \n≤ 600km","< 500V",280.60000000000002,319.88,85.02,96.92,46.16,52.62,91.54,104.36,63.02,71.84,39.979999999999997,45.58,8.02,9.14]
["Megaflex","Me",1,2,"Me12N",null,null,null,"≥ 500V & < 66kV",276.7,315.44,83.82,95.55,45.52,51.89,90.27,102.91,62.12,70.819999999999993,39.409999999999997,44.93,7.35,8.3800000000000008]
["Megaflex","Me",1,3,"Me13N",null,null,null,"≥ 66kV & ≤ 132kV",267.89999999999998,305.41000000000003,81.150000000000006,92.51,44.06,50.23,87.39,99.62,60.14,68.56,38.15,43.49,7.14,8.14]
["Megaflex","Me",1,4,"Me14N",null,null,null,"> 132kV*",252.53,287.88,76.510000000000005,87.22,41.52,47.33,82.36,93.89,56.69,64.63,35.950000000000003,40.98,9.0399999999999991,10.31]
["Megaflex","Me",2,1,"Me21N",null,null,"> 600km and \n≤ 900km","< 500V",283.39999999999998,323.08,85.85,97.87,46.6,53.12,92.45,105.39,63.63,72.540000000000006,40.35,46,8.1199999999999992,9.26]
["Megaflex","Me",2,2,"Me22N",null,null,null,"≥ 500V & < 66kV",279.48,318.61,84.67,96.52,45.98,52.42,91.16,103.92,62.75,71.540000000000006,39.81,45.38,7.41,8.4499999999999993]
["Megaflex","Me",2,3,"Me23N",null,null,null,"≥ 66kV & ≤ 132kV",270.63,308.52,81.98,93.46,44.51,50.74,88.27,100.63,60.76,69.27,38.54,43.94,7.18,8.19]
["Megaflex","Me",2,4,"Me24N",null,null,null,"> 132kV*",255.08,290.79000000000002,77.260000000000005,88.08,41.97,47.85,83.21,94.86,57.26,65.28,36.340000000000003,41.43,9.17,10.45]
["Megaflex","Me",3,1,"Me31N",null,null,"> 900km","< 500V",286.25,326.33,86.74,98.88,47.09,53.68,93.39,106.46,64.260000000000005,73.260000000000005,40.79,46.5,8.16,9.3000000000000007]
["Megaflex","Me",3,2,"Me32N",null,null,null,"≥ 500V & < 66kV",282.26,321.77999999999997,85.5,97.47,46.41,52.91,92.06,104.95,63.35,72.22,40.200000000000003,45.83,7.5,8.5500000000000007]
["Megaflex","Me",3,3,"Me33N",null,null,null,"≥ 66kV & ≤ 132kV",273.33999999999997,311.61,82.8,94.39,44.96,51.25,89.16,101.64,61.37,69.959999999999994,38.93,44.38,7.25,8.27]
["Megaflex","Me",3,4,"Me34N",null,null,null,"> 132kV*",257.56,293.62,78.06,88.99,42.41,48.35,84.07,95.84,57.88,65.98,36.74,41.88,9.24,10.53]
[null,null,null,null,null,null,null,null,"* 132 kV or Transmission connected"]
[]
[null,null,null,null,null,null,null,"Distribution network charges"]
[null,null,null,null,null,null,null,null,null,"Network capacity charge \n[R/kVA/m]",null,"Network demand charge \n[R/kVA/m]",null,"Urban low voltage subsidy charge [R/kVA/m]"]
[null,null,null,null,null,null,null,"Voltage",null,null,null,null,null,null,null,null,"Voltage",null,"Ancillary service charge [c/kWh]"]
["Tariff","Tariff nameBillcode","Tx zone","Voltage","Billcode",null,null,null,null,null,"VAT incl",null,"VAT incl",null,"VAT incl",null,null,null,null,"VAT incl"]
["Megaflex","Me",0,1,{"$f":"B30&C30&D30&IF($A$2=\"Non-municipal\",\"N\",IF($A$2=\"Municiple\",\"Y\",\"error\"))","v":"Me01N"},null,null,"< 500V",null,15.82,{"$f":"ROUND(J30 * (1 + VAT), 2)","v":18.03},30,{"$f":"ROUND(L30 * (1 + VAT), 2)","v":34.200000000000003},0,{"$f":"ROUND(N30 * (1 + VAT), 2)","v":0},null,"< 500V",null,0.37,{"$f":"ROUND(S30 * (1 + VAT), 2)","v":0.42}]
["Megaflex","Me",0,2,{"$f":"B31&C31&D31&IF($A$2=\"Non-municipal\",\"N\",IF($A$2=\"Municiple\",\"Y\",\"error\"))","v":"Me02N"},null,null,"≥ 500V & < 66kV",null,14.51,{"$f":"ROUND(J31 * (1 + VAT), 2)","v":16.54},27.52,{"$f":"ROUND(L31 * (1 + VAT), 2)","v":31.37},0,{"$f":"ROUND(N31 * (1 + VAT), 2)","v":0},null,"≥ 500V & < 66kV",null,0.36,{"$f":"ROUND(S31 * (1 + VAT), 2)","v":0.41}]
["Megaflex","Me",0,3,"Me03N",null,null,"≥ 66kV & ≤ 132kV",null,5.18,{"$f":"ROUND(J32 * (1 + VAT), 2)","v":5.91},9.6,{"$f":"ROUND(L32 * (1 + VAT), 2)","v":10.94},12.78,{"$f":"ROUND(N32 * (1 + VAT), 2)","v":14.57},null,"≥ 66kV & ≤ 132kV",null,0.34,{"$f":"ROUND(S32 * (1 + VAT), 2)","v":0.39}]
["Megaflex","Me",0,4,"Me04N",null,null,"> 132kV / Transmission connected",null,0,{"$f":"ROUND(J33 * (1 + VAT), 2)","v":0},0,{"$f":"ROUND(L33 * (1 + VAT), 2)","v":0},12.78,{"$f":"ROUND(N33 * (1 + VAT), 2)","v":14.57},null,"> 132kV / Transmission connected",null,0.32,{"$f":"ROUND(S33 * (1 + VAT), 2)","v":0.36}]
[]
[]
[null,null,null,null,null,null,null,"Customer categories",null,"Service charge  [R/account/day]",null,"Administration charge  [R/POD/day]",null,null,null,null,"Reactive energy charge  [c/kVArh]"]
[null,null,null,null,null,null,null,null,null,null,null,null,null,null,null,null,"High season",null,"Low season"]
["Tariff","Tariff nameBillcode","Tx zone","Voltage","Billcode",null,null,null,null,null,"VAT incl",null,"VAT incl",null,null,null,null,"VAT incl",null,"VAT incl"]
["Megaflex","Me",0,1,{"$f":"B39&C39&D39&IF($A$2=\"Non-municipal\",\"N\",IF($A$2=\"Municiple\",\"Y\",\"error\"))","v":"Me01N"},null,null,"> 1 MVA",null,181.66,{"$f":"ROUND(J39 * (1 + VAT), 2)","v":207.09},81.87,{"$f":"ROUND(L39 * (1 + VAT), 2)","v":93.33},null,null,null,12.8,{"$f":"ROUND(Q39 * (1 + VAT), 2)","v":14.59},0,{"$f":"ROUND(S39 * (1 + VAT), 2)","v":0}]
["Megaflex","Me",0,1,{"$f":"B40&C40&D40&IF($A$2=\"Non-municipal\",\"N\",IF($A$2=\"Municiple\",\"Y\",\"error\"))","v":"Me01N"},null,null,"Key customers",null,3559.79,{"$f":"ROUND(J40 * (1 + VAT), 2)","v":4058.16},113.69,{"$f":"ROUND(L40 * (1 + VAT), 2)","v":129.61000000000001}]
[]
[null,null,null,null,null,null,null,"Electrification and rural network subsidy charge  [c/kWh]",null,"Affordability subsidy charge [c/kWh] \nOnly payable by non-local authority tariffs"]
[]
[]
["Tariff","Tariff nameBillcode","Tx zone","Voltage","Billcode",null,null,null,"VAT incl",null,"VAT incl"]
["Megaflex","Me",0,1,{"$f":"B46&C46&D46&IF($A$2=\"Non-municipal\",\"N\",IF($A$2=\"Municiple\",\"Y\",\"error\"))","v":"Me01N"},null,null,7.08,{"$f":"ROUND(H46 * (1 + VAT), 2)","v":8.07},2.87,{"$f":"ROUND(J46 * (1 + VAT), 2)","v":3.27}]

{"sheet":"Megaflex Munic inc ","index":8,"n_rows":46,"n_cols":33,"rows_kept":46,"cut":false,"hidden":false,"merged":[[35,16,35,19],[36,16,36,17],[36,18,36,19],[11,7,14,7],[7,7,10,7],[30,7,30,8],[30,16,30,17],[15,7,18,7],[19,7,22,7],[25,7,25,14],[26,9,27,10],[26,11,27,12],[26,13,27,14],[1,17,1,22],[3,9,3,20],[4,7,6,7],[4,9,4,14],[4,15,4,20],[5,9,5,10],[5,11,5,12],[5,13,5,14],[5,15,5,16],[5,17,5,18],[5,19,5,20],[3,21,5,22],[1,6,1,16],[41,7,43,8],[27,18,27,19],[29,7,29,8],[29,16,29,17],[27,7,28,8],[27,16,28,17],[39,7,39,8],[38,7,38,8],[37,7,37,8],[31,7,31,8],[31,16,31,17],[32,7,32,8],[32,16,32,17],[35,7,35,8],[35,9,36,10],[35,11,36,12]]}
[null,null,null,null,null,null,"Back to menu",null,null,null,null,null,null,null,null,null,null,null,null,null,null,null,{"$error":"#REF!"}]
["Municiple",null,null,null,null,null,"Megaflex tariff",null,null,null,null,null,null,null,null,null,null,"Local authority",null,null,null,null,null,null,null,null,null,null,null,null,null,{"$f":"SUM(J8:T23,V8:V23,#REF!,#REF!,#REF!,#REF!,H26:J26,L26)","v":{"$error":"#REF!"}},"check value"]
[]
[null,null,null,null,null,null,null,null,null,"Active energy charge [c/kWh]",null,null,null,null,null,null,null,null,null,null,null,"Transmission network charges [R/kVA/m]"]
[null,null,null,null,null,null,null,"Transmission zone",null,"High demand season [Jun - Aug]",null,null,null,null,null,"Low demand season [Sep - May]"]
[null,null,null,null,null,null,null,null,"Voltage","Peak",null,"Standard",null,"Off Peak",null,"Peak",null,"Standard",null,"Off Peak"]
["Tariff","Tariff nameBillcode","Tx zone","Voltage","Billcode",null,null,null,null,"","VAT incl",null,"VAT incl",null,"VAT incl",null,"VAT incl",null,"VAT incl",null,"VAT incl",null,"VAT incl"]
["Megaflex","Me",0,1,{"$f":"B8&C8&D8&IF($A$2=\"Non-municipal\",\"N\",IF($A$2=\"Municiple\",\"Y\",\"error\"))","v":"Me01Y"},null,null,"≤ 300km","< 500V",279.70999999999998,{"$f":"ROUND(J8 * (1 + VAT), 2)","v":318.87},85.11,{"$f":"ROUND(L8 * (1 + VAT), 2)","v":97.03},46.44,{"$f":"ROUND(N8 * (1 + VAT), 2)","v":52.94},91.58,{"$f":"ROUND(P8 * (1 + VAT), 2)","v":104.4},63.2,{"$f":"ROUND(R8 * (1 + VAT), 2)","v":72.05},40.28,{"$f":"ROUND(T8 * (1 + VAT), 2)","v":45.92},7.79,{"$f":"ROUND(V8 * (1 + VAT), 2)","v":8.8800000000000008}]
["Megaflex","Me",0,2,{"$f":"B9&C9&D9&IF($A$2=\"Non-municipal\",\"N\",IF($A$2=\"Municiple\",\"Y\",\"error\"))","v":"Me02Y"},null,null,null,"≥ 500V & < 66kV",275.3,313.83999999999997,83.41,95.09,45.29,51.63,89.81,102.38,61.81,70.459999999999994,39.22,44.71,7.11,8.11]
["Megaflex","Me",0,3,"Me03Y",null,null,null,"≥ 66kV & ≤ 132kV",266.61,303.94,80.760000000000005,92.07,43.86,50,86.97,99.15,59.87,68.25,37.97,43.29,6.92,7.89]
["Megaflex","Me",0,4,"Me04Y",null,null,null,"> 132kV*",251.27,286.45,76.12,86.78,41.33,47.12,81.96,93.43,56.41,64.31,35.79,40.799999999999997,8.76,9.99]
["Megaflex","Me",1,1,"Me11Y",null,null,"> 300km and \n≤ 600km","< 500V",281.99,321.47000000000003,85.43,97.39,46.38,52.87,91.99,104.87,63.33,72.2,40.17,45.79,7.83,8.93]
["Megaflex","Me",1,2,"Me12Y",null,null,null,"≥ 500V & < 66kV",278.05,316.98,84.23,96.02,45.74,52.14,90.71,103.41,62.43,71.17,39.6,45.14,7.18,8.19]
["Megaflex","Me",1,3,"Me13Y",null,null,null,"≥ 66kV & ≤ 132kV",269.22000000000003,306.91000000000003,81.55,92.97,44.28,50.48,87.82,100.11,60.44,68.900000000000006,38.33,43.7,6.97,7.95]
["Megaflex","Me",1,4,"Me14Y",null,null,null,"> 132kV*",253.77,289.3,76.89,87.65,41.74,47.58,82.77,94.36,56.98,64.959999999999994,36.14,41.2,8.84,10.08]
["Megaflex","Me",2,1,"Me21Y",null,null,"> 600km and \n≤ 900km","< 500V",284.8,324.67,86.28,98.36,46.84,53.4,92.9,105.91,63.95,72.900000000000006,40.57,46.25,7.93,9.0399999999999991]
["Megaflex","Me",2,2,"Me22Y",null,null,null,"≥ 500V & < 66kV",280.85000000000002,320.17,85.07,96.98,46.2,52.67,91.63,104.46,63.03,71.849999999999994,40,45.6,7.24,8.25]
["Megaflex","Me",2,3,"Me23Y",null,null,null,"≥ 66kV & ≤ 132kV",271.95999999999998,310.02999999999997,82.37,93.9,44.73,50.99,88.69,101.11,61.04,69.59,38.72,44.14,7.03,8.01]
["Megaflex","Me",2,4,"Me24Y",null,null,null,"> 132kV*",256.32,292.2,77.66,88.53,42.16,48.06,83.62,95.33,57.55,65.61,36.51,41.62,8.9600000000000009,10.210000000000001]
["Megaflex","Me",3,1,"Me31Y",null,null,"> 900km","< 500V",287.66000000000003,327.93,87.15,99.35,47.33,53.96,93.84,106.98,64.58,73.62,40.98,46.72,7.97,9.09]
["Megaflex","Me",3,2,"Me32Y",null,null,null,"≥ 500V & < 66kV",283.66000000000003,323.37,85.92,97.95,46.66,53.19,92.52,105.47,63.68,72.599999999999994,40.380000000000003,46.03,7.31,8.33]
["Megaflex","Me",3,3,"Me33Y",null,null,null,"≥ 66kV & ≤ 132kV",274.7,313.16000000000003,83.22,94.87,45.19,51.52,89.6,102.14,61.66,70.290000000000006,39.119999999999997,44.6,7.08,8.07]
["Megaflex","Me",3,4,"Me34Y",null,null,null,"> 132kV*",258.83999999999997,295.08,78.45,89.43,42.63,48.6,84.48,96.31,58.15,66.290000000000006,36.909999999999997,42.08,9.0299999999999994,10.29]
[null,null,null,null,null,null,null,null,"* 132 kV or Transmission connected"]
[]
[null,null,null,null,null,null,null,"Distribution network charges"]
[null,null,null,null,null,null,null,null,null,"Network capacity charge \n[R/kVA/m]",null,"Network demand charge \n[R/kVA/m]",null,"Urban low voltage subsidy charge [R/kVA/m]"]
[null,null,null,null,null,null,null,"Voltage",null,null,null,null,null,null,null,null,"Voltage",null,"Ancillary service charge [c/kWh]"]
["Tariff","Tariff nameBillcode","Tx zone","Voltage","Billcode",null,null,null,null,null,"VAT incl",null,"VAT incl",null,"VAT incl",null,null,null,null,"VAT incl"]
["Megaflex","Me",0,1,{"$f":"B30&C30&D30&IF($A$2=\"Non-municipal\",\"N\",IF($A$2=\"Municiple\",\"Y\",\"error\"))","v":"Me01Y"},null,null,"< 500V",null,15.54,{"$f":"ROUND(J30 * (1 + VAT), 2)","v":17.72},29.45,{"$f":"ROUND(L30 * (1 + VAT), 2)","v":33.57},0,{"$f":"ROUND(N30 * (1 + VAT), 2)","v":0},null,"< 500V",null,0.36,{"$f":"ROUND(S30 * (1 + VAT), 2)","v":0.41}]
["Megaflex","Me",0,2,{"$f":"B31&C31&D31&IF($A$2=\"Non-municipal\",\"N\",IF($A$2=\"Municiple\",\"Y\",\"error\"))","v":"Me02Y"},null,null,"≥ 500V & < 66kV",null,14.25,{"$f":"ROUND(J31 * (1 + VAT), 2)","v":16.25},27.01,{"$f":"ROUND(L31 * (1 + VAT), 2)","v":30.79},0,{"$f":"ROUND(N31 * (1 + VAT), 2)","v":0},null,"≥ 500V & < 66kV",null,0.35,{"$f":"ROUND(S31 * (1 + VAT), 2)","v":0.4}]
["Megaflex","Me",0,3,"Me03Y",null,null,"≥ 66kV & ≤ 132kV",null,5.0999999999999996,{"$f":"ROUND(J32 * (1 + VAT), 2)","v":5.81},9.42,{"$f":"ROUND(L32 * (1 + VAT), 2)","v":10.74},12.48,{"$f":"ROUND(N32 * (1 + VAT), 2)","v":14.23},null,"≥ 66kV & ≤ 132kV",null,0.33,{"$f":"ROUND(S32 * (1 + VAT), 2)","v":0.38}]
["Megaflex","Me",0,4,"Me04Y",null,null,"> 132kV / Transmission connected",null,0,{"$f":"ROUND(J33 * (1 + VAT), 2)","v":0},0,{"$f":"ROUND(L33 * (1 + VAT), 2)","v":0},12.48,{"$f":"ROUND(N33 * (1 + VAT), 2)","v":14.23},null,"> 132kV / Transmission connected",null,0.31,{"$f":"ROUND(S33 * (1 + VAT), 2)","v":0.35}]
[]
[]
[null,null,null,null,null,null,null,"Customer categories",null,"Service charge  [R/account/day]",null,"Administration charge  [R/POD/day]",null,null,null,null,"Reactive energy charge  [c/kVArh]"]
[null,null,null,null,null,null,null,null,null,null,null,null,null,null,null,null,"High season",null,"Low season"]
["Tariff","Tariff nameBillcode","Tx zone","Voltage","Billcode",null,null,null,null,null,"VAT incl",null,"VAT incl",null,null,null,null,"VAT incl",null,"VAT incl"]
["Megaflex","Me",0,1,{"$f":"B39&C39&D39&IF($A$2=\"Non-municipal\",\"N\",IF($A$2=\"Municiple\",\"Y\",\"error\"))","v":"Me01Y"},null,null,"> 1 MVA",null,177.48,{"$f":"ROUND(J39 * (1 + VAT), 2)","v":202.33},80,{"$f":"ROUND(L39 * (1 + VAT), 2)","v":91.2},null,null,null,12.49,{"$f":"ROUND(Q39 * (1 + VAT), 2)","v":14.24},0,{"$f":"ROUND(S39 * (1 + VAT), 2)","v":0}]
["Megaflex","Me",0,1,{"$f":"B40&C40&D40&IF($A$2=\"Non-municipal\",\"N\",IF($A$2=\"Municiple\",\"Y\",\"error\"))","v":"Me01Y"},null,null,"Key customers",null,3477.93,{"$f":"ROUND(J40 * (1 + VAT), 2)","v":3964.84},111.07,{"$f":"ROUND(L40 * (1 + VAT), 2)","v":126.62}]
[]
[null,null,null,null,null,null,null,"Electrification and rural network subsidy charge  [c/kWh]"]
[]
[]
["Tariff","Tariff nameBillcode","Tx zone","Voltage","Billcode",null,null,null,"VAT incl"]
["Megaflex","Me",0,1,{"$f":"B46&C46&D46&IF($A$2=\"Non-municipal\",\"N\",IF($A$2=\"Municiple\",\"Y\",\"error\"))","v":"Me01Y"},null,null,6.91,{"$f":"ROUND(H46 * (1 + VAT), 2)","v":7.88}]

{"sheet":"Megaflex Gen inc","index":9,"n_rows":64,"n_cols":25,"rows_kept":64,"cut":false,"hidden":false,"merged":[[58,12,58,13],[56,7,56,10],[56,12,56,14],[57,7,57,9],[57,10,57,11],[57,12,57,14],[58,10,58,11],[39,7,39,8],[38,7,38,8],[46,9,47,10],[48,9,48,10],[40,7,40,8],[41,7,41,8],[42,7,42,8],[43,7,43,8],[46,7,48,8],[45,7,45,10],[32,7,32,8],[33,7,33,8],[36,7,36,8],[36,9,37,10],[36,11,37,12],[37,7,37,8],[31,7,31,8],[15,7,18,7],[19,7,22,7],[26,7,26,14],[27,9,28,10],[27,11,28,12],[27,13,28,14],[23,7,23,8],[30,7,30,8],[28,7,29,8],[11,7,14,7],[1,6,1,16],[3,9,3,20],[4,7,6,7],[4,9,4,14],[4,15,4,20],[5,9,5,10],[5,11,5,12],[5,13,5,14],[5,15,5,16],[5,17,5,18],[5,19,5,20],[7,7,10,7],[1,17,1,24],[3,21,5,22],[26,16,26,19],[26,20,26,23],[28,16,28,17],[28,20,28,21],[32,20,32,21],[28,22,29,23],[28,18,28,19],[33,20,33,21],[30,20,30,21],[31,20,31,21],[46,16,46,19],[47,16,47,17],[47,18,47,19],[34,20,35,23],[30,16,30,17],[31,16,31,17],[32,16,32,17],[33,16,33,17],[34,16,34,17],[35,16,35,17],[39,16,39,17],[37,16,38,19],[39,18,39,19],[44,16,44,17],[43,16,43,17],[41,16,41,17],[40,16,40,17],[42,16,42,17],[53,7,53,14],[54,7,54,11],[54,12,54,14],[55,7,55,11],[55,12,55,14]]}
[null,null,null,null,null,null,"Back to menu",null,null,null,null,null,null,null,null,null,null,null,null,null,null,null,{"$error":"#REF!"}]
["Non-municipal",null,null,null,null,null,"Megaflex Gen tariff",null,null,null,null,null,null,null,null,null,null,{"$f":"Menu!$H$7","v":"Non-local authority"}]
[]
[null,null,null,null,null,null,null,null,null,"Active energy charge for loads [c/kWh]",null,null,null,null,null,null,null,null,null,null,null,"Transmission network charges [R/kVA/m]"]
[null,null,null,null,null,null,null,"Transmission zone",null,"High demand season [Jun - Aug]",null,null,null,null,null,"Low demand season [Sep - May]"]
[null,null,null,null,null,null,null,null,"Voltage","Peak",null,"Standard",null,"Off Peak",null,"Peak",null,"Standard",null,"Off Peak"]
["Tariff","Tariff nameBillcode","Tx zone","Voltage","Billcode",null,null,null,null,"","VAT incl",null,"VAT incl",null,"VAT incl",null,"VAT incl",null,"VAT incl",null,"VAT incl",null,"VAT incl"]
["Genflex urban loads","GU",0,1,{"$f":"B8&C8&D8&IF($A$2=\"Non-municipal\",\"N\",IF($A$2=\"Municiple\",\"Y\",\"error\"))","v":"GU01N"},null,null,"≤ 300km","< 500V",278.33,{"$f":"ROUND(J8 * (1 + VAT), 2)","v":317.3},84.68,{"$f":"ROUND(L8 * (1 + VAT), 2)","v":96.54},46.24,{"$f":"ROUND(N8 * (1 + VAT), 2)","v":52.71},91.14,{"$f":"ROUND(P8 * (1 + VAT), 2)","v":103.9},62.89,{"$f":"ROUND(R8 * (1 + VAT), 2)","v":71.69},40.090000000000003,{"$f":"ROUND(T8 * (1 + VAT), 2)","v":45.7},7.96,{"$f":"ROUND(V8 * (1 + VAT), 2)","v":9.07}]
["Genflex urban loads","GU",0,2,{"$f":"B9&C9&D9&IF($A$2=\"Non-municipal\",\"N\",IF($A$2=\"Municiple\",\"Y\",\"error\"))","v":"GU02N"},null,null,null,"≥ 500V & < 66kV",273.95999999999998,312.31,83,94.62,45.07,51.38,89.36,101.87,61.51,70.12,39.020000000000003,44.48,7.28,8.3000000000000007]
["Genflex urban loads","GU",0,3,"GU03N",null,null,null,"≥ 66kV & ≤ 132kV",265.29000000000002,302.43,80.36,91.61,43.65,49.76,86.55,98.67,59.56,67.900000000000006,37.79,43.08,7.09,8.08]
["Genflex urban loads","GU",0,4,"GU04N",null,null,null,"> 132kV*",250.03,285.02999999999997,75.739999999999995,86.34,41.14,46.9,81.58,93,56.13,63.99,35.619999999999997,40.61,8.9499999999999993,10.199999999999999]
["Genflex urban loads","GU",1,1,"GU11N",null,null,"> 300km and \n≤ 600km","< 500V",280.60000000000002,319.88,85.02,96.92,46.16,52.62,91.54,104.36,63.02,71.84,39.979999999999997,45.58,8.02,9.14]
["Genflex urban loads","GU",1,2,"GU12N",null,null,null,"≥ 500V & < 66kV",276.7,315.44,83.82,95.55,45.52,51.89,90.27,102.91,62.12,70.819999999999993,39.409999999999997,44.93,7.35,8.3800000000000008]
["Genflex urban loads","GU",1,3,"GU13N",null,null,null,"≥ 66kV & ≤ 132kV",267.89999999999998,305.41000000000003,81.150000000000006,92.51,44.06,50.23,87.39,99.62,60.14,68.56,38.15,43.49,7.14,8.14]
["Genflex urban loads","GU",1,4,"GU14N",null,null,null,"> 132kV*",252.53,287.88,76.510000000000005,87.22,41.52,47.33,82.36,93.89,56.69,64.63,35.950000000000003,40.98,9.0399999999999991,10.31]
["Genflex urban loads","GU",2,1,"GU21N",null,null,"> 600km and \n≤ 900km","< 500V",283.39999999999998,323.08,85.85,97.87,46.6,53.12,92.45,105.39,63.63,72.540000000000006,40.35,46,8.1199999999999992,9.26]
["Genflex urban loads","GU",2,2,"GU22N",null,null,null,"≥ 500V & < 66kV",279.48,318.61,84.67,96.52,45.98,52.42,91.16,103.92,62.75,71.540000000000006,39.81,45.38,7.41,8.4499999999999993]
["Genflex urban loads","GU",2,3,"GU23N",null,null,null,"≥ 66kV & ≤ 132kV",270.63,308.52,81.98,93.46,44.51,50.74,88.27,100.63,60.76,69.27,38.54,43.94,7.18,8.19]
["Genflex urban loads","GU",2,4,"GU24N",null,null,null,"> 132kV*",255.08,290.79000000000002,77.260000000000005,88.08,41.97,47.85,83.21,94.86,57.26,65.28,36.340000000000003,41.43,9.17,10.45]
["Genflex urban loads","GU",3,1,"GU31N",null,null,"> 900km","< 500V",286.25,326.33,86.74,98.88,47.09,53.68,93.39,106.46,64.260000000000005,73.260000000000005,40.79,46.5,8.16,9.3000000000000007]
["Genflex urban loads","GU",3,2,"GU32N",null,null,null,"≥ 500V & < 66kV",282.26,321.77999999999997,85.5,97.47,46.41,52.91,92.06,104.95,63.35,72.22,40.200000000000003,45.83,7.5,8.5500000000000007]
["Genflex urban loads","GU",3,3,"GU33N",null,null,null,"≥ 66kV & ≤ 132kV",273.33999999999997,311.61,82.8,94.39,44.96,51.25,89.16,101.64,61.37,69.959999999999994,38.93,44.38,7.25,8.27]
["Genflex urban loads","GU",3,4,"GU34N",null,null,null,"> 132kV*",257.56,293.62,78.06,88.99,42.41,48.35,84.07,95.84,57.88,65.98,36.74,41.88,9.24,10.53]
["Gen-purchase","NLPurchADJ",0,4,"NLPurchADJ04N",null,null,"WEPS energy rate excluding losses",null,247.38300187988526,282.02,74.938161670129617,{"$f":"ROUND(L24 * (1 + VAT), 2)","v":85.43},40.704462253883449,{"$f":"ROUND(N24 * (1 + VAT), 2)","v":46.4},80.716335213218571,{"$f":"ROUND(P24 * (1 + VAT), 2)","v":92.02},55.53576728999704,{"$f":"ROUND(R24 * (1 + VAT), 2)","v":63.31},35.242900959730882,{"$f":"ROUND(T24 * (1 + VAT), 2)","v":40.18}]
["TUoS network charges for Transmission connected generators","GenTUOS","Cape",4,"GenTUOSCape4N",null,null,null,"* 132 kV or Transmission connected"]
["TUoS network charges for Transmission connected generators","GenTUOS","Karoo",4,"GenTUOSKaroo4N"]
["TUoS network charges for Transmission connected generators","GenTUOS","Kwazulu-Natal",4,"GenTUOSKwazulu-Natal4N",null,null,"Distribution network charges for loads",null,null,null,null,null,null,null,null,"Transmission network charges for generators ",null,null,null,"Distribution network charges for generators*"]
["TUoS network charges for Transmission connected generators","GenTUOS","Vaal",4,"GenTUOSVaal4N",null,null,null,null,"Network capacity charge \n[R/kVA/m]",null,"Network demand charge \n[R/kVA/m]",null,"Urban low voltage subsidy charge [R/kVA/m]"]
["TUoS network charges for Transmission connected generators","GenTUOS","Waterburg",4,"GenTUOSWaterburg4N",null,null,"Voltage",null,null,null,null,null,null,null,null,"TUoS [ > 132kV]",null,"Network charge\n[R/kW]",null,"Voltage ",null,"Network capacity charge    [R/kW/m]"]
["TUoS network charges for Transmission connected generators","GenTUOS","Mpumalanga",4,"GenTUOSMpumalanga4N",null,null,"Voltage",null,null,"VAT incl",null,"VAT incl",null,"VAT incl",null,null,null,null,"VAT incl"]
["Genflex urban loads","GU",0,1,{"$f":"B31&C31&D31&IF($A$2=\"Non-municipal\",\"N\",IF($A$2=\"Municiple\",\"Y\",\"error\"))","v":"GU01N"},null,null,"< 500V",null,15.82,{"$f":"ROUND(J31 * (1 + VAT), 2)","v":18.03},30,{"$f":"ROUND(L31 * (1 + VAT), 2)","v":34.200000000000003},0,{"$f":"ROUND(N31 * (1 + VAT), 2)","v":0},null,"Cape",null,0,{"$f":"ROUND(S31 * (1 + VAT), 2)","v":0},null,null,null,"VAT incl"]
["Genflex urban loads","GU",0,2,{"$f":"B32&C32&D32&IF($A$2=\"Non-municipal\",\"N\",IF($A$2=\"Municiple\",\"Y\",\"error\"))","v":"GU02N"},null,null,"≥ 500V & < 66kV",null,14.51,{"$f":"ROUND(J32 * (1 + VAT), 2)","v":16.54},27.52,{"$f":"ROUND(L32 * (1 + VAT), 2)","v":31.37},0,{"$f":"ROUND(N32 * (1 + VAT), 2)","v":0},null,"Karoo",null,0,0,"< 500V"]
["Genflex urban loads","GU",0,3,"GU03N",null,null,"≥ 66kV & ≤ 132kV",null,5.18,{"$f":"ROUND(J33 * (1 + VAT), 2)","v":5.91},9.6,{"$f":"ROUND(L33 * (1 + VAT), 2)","v":10.94},12.78,{"$f":"ROUND(N33 * (1 + VAT), 2)","v":14.57},null,"Kwazulu-Natal",null,1.88,2.14,"≥ 500V & < 66kV"]
["Genflex urban loads","GU",0,4,"GU04N",null,null,"> 132kV / Transmission connected",null,0,{"$f":"ROUND(J34 * (1 + VAT), 2)","v":0},0,{"$f":"ROUND(L34 * (1 + VAT), 2)","v":0},12.78,{"$f":"ROUND(N34 * (1 + VAT), 2)","v":14.57},null,"Vaal",null,6.26,7.14,"≥ 66kV & ≤ 132kV",null,12.8,{"$f":"ROUND(W34 * (1 + VAT), 2)","v":14.59}]
["Gen-DUoS urban","NEGenDUoSU",0,3,"NEGenDUoSU03N",null,null,null,null,null,null,null,null,null,null,null,"Waterberg",null,8.02,9.14,"* The Distribution network charge will be rebated by the Losses charge, but not beyond extintion"]
[null,null,null,null,null,null,null,null,null,null,null,null,null,null,null,null,"Mpumalanga",null,7.44,8.48]
[null,null,null,null,null,null,null,"Customer categories",null,"Service charge  [R/account/day]",null,"Administration charge  [R/POD/day]"]
[null,null,null,null,null,null,null,"[kVA or MVA = loads]",null,null,null,null,null,null,null,null,"Ancillary service charge for loads and generators"]
["Tariff","Tariff nameBillcode","Tx zone","Voltage","Billcode",null,null,"[kW or MW = generators]",null,null,"VAT incl",null,"VAT incl"]
["Genflex urban loads","GU",0,1,{"$f":"B40&C40&D40&IF($A$2=\"Non-municipal\",\"N\",IF($A$2=\"Municiple\",\"Y\",\"error\"))","v":"GU01N"},null,null,"≤ 100 KVA/ kW ",null,12.92,{"$f":"ROUND(J40 * (1 + VAT), 2)","v":14.73},2.84,{"$f":"ROUND(L40 * (1 + VAT), 2)","v":3.24},null,null,null,"Voltage",null,"Ancillary service charge [c/kWh]"]
["Genflex urban loads","GU",0,1,{"$f":"B41&C41&D41&IF($A$2=\"Non-municipal\",\"N\",IF($A$2=\"Municiple\",\"Y\",\"error\"))","v":"GU01N"},null,null,"> 100 kVA/ kW & ≤ 500 kVA/ kW",null,59.03,{"$f":"ROUND(J41 * (1 + VAT), 2)","v":67.290000000000006},16.55,{"$f":"ROUND(L41 * (1 + VAT), 2)","v":18.87},null,null,null,null,null,null,"VAT incl"]
["Genflex urban loads","GU",0,1,"GU01N",null,null,"> 500 kVA/ kW & ≤ 1 MVA/MW",null,181.66,{"$f":"ROUND(J42 * (1 + VAT), 2)","v":207.09},32.880000000000003,{"$f":"ROUND(L42 * (1 + VAT), 2)","v":37.479999999999997},null,null,null,"< 500V",null,0.37,{"$f":"ROUND(S42 * (1 + VAT), 2)","v":0.42}]
["Genflex urban loads","GU",0,1,"GU01N",null,null,"> 1 MVA/MW",null,181.66,{"$f":"ROUND(J43 * (1 + VAT), 2)","v":207.09},81.87,{"$f":"ROUND(L43 * (1 + VAT), 2)","v":93.33},null,null,null,"≥ 500V & < 66kV",null,0.36,{"$f":"ROUND(S43 * (1 + VAT), 2)","v":0.41}]
["Genflex urban loads","GU",0,1,{"$f":"B44&C44&D44&IF($A$2=\"Non-municipal\",\"N\",IF($A$2=\"Municiple\",\"Y\",\"error\"))","v":"GU01N"},null,null,"Key customers or Transmission connected generators",null,3559.79,{"$f":"ROUND(J44 * (1 + VAT), 2)","v":4058.16},113.69,{"$f":"ROUND(L44 * (1 + VAT), 2)","v":129.61000000000001},null,null,null,"≥ 66kV & ≤ 132kV",null,0.34,{"$f":"ROUND(S44 * (1 + VAT), 2)","v":0.39}]
[null,null,null,null,null,null,null,null,null,null,null,null,null,null,null,null,"> 132kV / Transmission connected",null,0.32,{"$f":"ROUND(S45 * (1 + VAT), 2)","v":0.36},null,null,null,null,{"$f":"'Loss Factors'!R10","v":0}]
[null,null,null,null,null,null,null,"Applicable to loads"]
[null,null,null,null,null,null,null,"Electrification and rural network subsidy charge  [c/kWh]",null,"Affordability subsidy charge [c/kWh] \nOnly payable by non-local authority tariffs",null,null,null,null,null,null,"Reactive energy charge  [c/kVArh] (loads)"]
[null,null,null,null,null,null,null,null,null,null,null,null,null,null,null,null,"High season",null,"Low season"]
[null,null,null,null,null,null,null,null,null,null,null,null,null,null,null,null,null,"VAT incl",null,"VAT incl"]
["Tariff","Tariff nameBillcode","Tx zone","Voltage","Billcode",null,null,null,"VAT incl",null,"VAT incl",null,null,null,null,null,12.8,{"$f":"ROUND(Q50 * (1 + VAT), 2)","v":14.59},0,{"$f":"ROUND(S50 * (1 + VAT), 2)","v":0}]
["Genflex urban loads","GU",0,1,{"$f":"B51&C51&D51&IF($A$2=\"Non-municipal\",\"N\",IF($A$2=\"Municiple\",\"Y\",\"error\"))","v":"GU01N"},null,null,7.08,{"$f":"ROUND(H51 * (1 + VAT), 2)","v":8.07},2.87,{"$f":"ROUND(J51 * (1 + VAT), 2)","v":3.27}]
[]
[]
[null,null,null,null,null,null,null,"Losses charge for generators"]
[null,null,null,null,null,null,null,"Distribution connected generators",null,null,null,null,"Transmission connected generators"]
[null,null,null,null,null,null,null,"Formula",null,null,null,null,"Formula"]
[null,null,null,null,null,null,null,"Distribution = - ((Energy produced x WEPS rate excluding losses) x (Distribution loss factor x Transmission loss factor-1)) in each TOU period",null,null,null,null,"Transmission = (Energy produced x WEPS rate excluding losses) x (Transmission loss factor-1/Transmission loss factor) in each TOU period"]
[null,null,null,null,null,null,null,"Transmission loss factors for Distribution connected",null,null,"Distribution loss factors",null,"Generator loss factor"]
[null,null,null,null,null,null,null,{"$f":"'Loss Factors'!R5","v":"Distance from\nJohannesburg"},null,{"$f":"'Loss Factors'!S5","v":"Zone"},{"$f":"'Loss Factors'!N5","v":"Voltage"},null,{"$f":"TUoS!I38","v":"Cape"},null,{"$f":"TUoS!J38","v":0.97099999999999997}]
[null,null,null,null,null,null,null,{"$f":"'Loss Factors'!R6","v":"≤ 300km"},null,{"$f":"'Loss Factors'!S6","v":0},{"$f":"'Loss Factors'!N6","v":"< 500V"},{"$f":"'Loss Factors'!O6","v":1.1111},{"$f":"TUoS!I39","v":"Karoo"},null,{"$f":"TUoS!J39","v":0.995}]
[null,null,null,null,null,null,null,{"$f":"'Loss Factors'!R7","v":"> 300km & ≤ 600km"},null,{"$f":"'Loss Factors'!S7","v":1},{"$f":"'Loss Factors'!N7","v":"≥ 500V & < 66kV"},{"$f":"'Loss Factors'!O7","v":1.0956999999999999},{"$f":"TUoS!I40","v":"Kwazulu-Natal"},null,{"$f":"TUoS!J40","v":1.004}]
[null,null,null,null,null,null,null,{"$f":"'Loss Factors'!R8","v":"> 600km & ≤ 900km"},null,{"$f":"'Loss Factors'!S8","v":2},{"$f":"'Loss Factors'!N8","v":"≥ 66kV & ≤ 132kV"},{"$f":"'Loss Factors'!O8","v":1.0610999999999999},{"$f":"TUoS!I41","v":"Vaal"},null,{"$f":"TUoS!J41","v":1.02}]
[null,null,null,null,null,null,null,{"$f":"'Loss Factors'!R9","v":"> 900km"},null,{"$f":"'Loss Factors'!S9","v":3},{"$f":"'Loss Factors'!N9","v":"> 132kV/Transmission connected"},{"$f":"'Loss Factors'!O9","v":1},{"$f":"TUoS!I42","v":"Waterberg"},null,{"$f":"TUoS!J42","v":1.0229999999999999}]
[null,null,null,null,null,null,null,null,null,null,null,null,{"$f":"TUoS!I43","v":"Mpumalanga"},null,{"$f":"TUoS!J43","v":1.0209999999999999}]

{"sheet":"Miniflex inc","index":10,"n_rows":45,"n_cols":23,"rows_kept":45,"cut":false,"hidden":false,"merged":[[5,17,5,18],[5,19,5,20],[7,7,10,7],[1,6,1,16],[1,17,1,18],[1,19,1,22],[3,9,3,20],[4,7,6,7],[4,9,4,14],[4,15,4,20],[5,9,5,10],[3,21,5,22],[25,9,26,10],[25,11,26,12],[5,11,5,12],[5,13,5,14],[5,15,5,16],[11,7,14,7],[15,7,18,7],[19,7,22,7],[27,7,27,8],[25,7,25,8],[35,7,37,8],[27,15,27,16],[27,17,27,18],[27,20,27,22],[28,7,28,8],[37,9,37,10],[37,14,37,15],[37,16,37,17],[30,7,30,8],[31,7,31,8],[32,7,32,8],[35,9,36,10],[35,14,36,17],[29,7,29,8]]}
[null,null,null,null,null,null,"Back to menu",null,null,null,null,null,null,null,null,null,null,null,null,null,null,null,{"$error":"#REF!"}]
["Non-municipal",null,null,null,null,null,"Miniflex tariff",null,null,null,null,null,null,null,null,null,null,null,null,"Non-local authority"]
[]
[null,null,null,null,null,null,null,null,null,"Active energy charge [c/kWh]",null,null,null,null,null,null,null,null,null,null,null,"Network capacity charge [R/kVA/m]"]
[null,null,null,null,null,null,null,"Transmission zone",null,"High demand season [Jun - Aug]",null,null,null,null,null,"Low demand season [Sep - May]"]
[null,null,null,null,null,null,null,null,"Voltage","Peak",null,"Standard",null,"Off Peak",null,"Peak",null,"Standard",null,"Off Peak"]
["Tariff","Tariff nameBillcode","Tx zone","Voltage","Billcode",null,null,null,null,"","VAT incl",null,"VAT incl",null,"VAT incl",null,"VAT incl",null,"VAT incl",null,"VAT incl",null,"VAT incl"]
["Miniflex","Mi",0,1,{"$f":"B8&C8&D8&IF($A$2=\"Non-municipal\",\"N\",IF($A$2=\"Municiple\",\"Y\",\"error\"))","v":"Mi01N"},null,null,"≤ 300km","< 500V",278.33,{"$f":"ROUND(J8 * (1 + VAT), 2)","v":317.3},84.68,{"$f":"ROUND(L8 * (1 + VAT), 2)","v":96.54},46.24,{"$f":"ROUND(N8 * (1 + VAT), 2)","v":52.71},91.14,{"$f":"ROUND(P8 * (1 + VAT), 2)","v":103.9},62.89,{"$f":"ROUND(R8 * (1 + VAT), 2)","v":71.69},40.090000000000003,{"$f":"ROUND(T8 * (1 + VAT), 2)","v":45.7},23.76,{"$f":"ROUND(V8 * (1 + VAT), 2)","v":27.09}]
["Miniflex","Mi",0,2,{"$f":"B9&C9&D9&IF($A$2=\"Non-municipal\",\"N\",IF($A$2=\"Municiple\",\"Y\",\"error\"))","v":"Mi02N"},null,null,null,"≥ 500V & < 66kV",273.95999999999998,312.31,83,94.62,45.07,51.38,89.36,101.87,61.51,70.12,39.020000000000003,44.48,21.77,24.82]
["Miniflex","Mi",0,3,"Mi03N",null,null,null,"≥ 66kV & ≤ 132kV",265.29000000000002,302.43,80.36,91.61,43.65,49.76,86.55,98.67,59.56,67.900000000000006,37.79,43.08,12.23,13.94]
["Miniflex","Mi",0,4,"Mi04N",null,null,null,"> 132kV*",250.03,285.02999999999997,75.739999999999995,86.34,41.14,46.9,81.58,93,56.13,63.99,35.619999999999997,40.61,8.91,10.16]
["Miniflex","Mi",1,1,"Mi11N",null,null,"> 300km and \n≤ 600km","< 500V",280.60000000000002,319.88,85.02,96.92,46.16,52.62,91.54,104.36,63.02,71.84,39.979999999999997,45.58,23.81,27.14]
["Miniflex","Mi",1,2,"Mi12N",null,null,null,"≥ 500V & < 66kV",276.7,315.44,83.82,95.55,45.52,51.89,90.27,102.91,62.12,70.819999999999993,39.409999999999997,44.93,21.84,24.9]
["Miniflex","Mi",1,3,"Mi13N",null,null,null,"≥ 66kV & ≤ 132kV",267.89999999999998,305.41000000000003,81.150000000000006,92.51,44.06,50.23,87.39,99.62,60.14,68.56,38.15,43.49,12.28,14]
["Miniflex","Mi",1,4,"Mi14N",null,null,null,"> 132kV*",252.53,287.88,76.510000000000005,87.22,41.52,47.33,82.36,93.89,56.69,64.63,35.950000000000003,40.98,9.01,10.27]
["Miniflex","Mi",2,1,"Mi21N",null,null,"> 600km and \n≤ 900km","< 500V",283.39999999999998,323.08,85.85,97.87,46.6,53.12,92.45,105.39,63.63,72.540000000000006,40.35,46,23.93,27.28]
["Miniflex","Mi",2,2,"Mi22N",null,null,null,"≥ 500V & < 66kV",279.48,318.61,84.67,96.52,45.98,52.42,91.16,103.92,62.75,71.540000000000006,39.81,45.38,21.9,24.97]
["Miniflex","Mi",2,3,"Mi23N",null,null,null,"≥ 66kV & ≤ 132kV",270.63,308.52,81.98,93.46,44.51,50.74,88.27,100.63,60.76,69.27,38.54,43.94,12.35,14.08]
["Miniflex","Mi",2,4,"Mi24N",null,null,null,"> 132kV*",255.08,290.79000000000002,77.260000000000005,88.08,41.97,47.85,83.21,94.86,57.26,65.28,36.340000000000003,41.43,9.14,10.42]
["Miniflex","Mi",3,1,"Mi31N",null,null,"> 900km","< 500V",286.25,326.33,86.74,98.88,47.09,53.68,93.39,106.46,64.260000000000005,73.260000000000005,40.79,46.5,23.95,27.3]
["Miniflex","Mi",3,2,"Mi32N",null,null,null,"≥ 500V & < 66kV",282.26,321.77999999999997,85.5,97.47,46.41,52.91,92.06,104.95,63.35,72.22,40.200000000000003,45.83,21.98,25.06]
["Miniflex","Mi",3,3,"Mi33N",null,null,null,"≥ 66kV & ≤ 132kV",273.33999999999997,311.61,82.8,94.39,44.96,51.25,89.16,101.64,61.37,69.959999999999994,38.93,44.38,12.4,14.14]
["Miniflex","Mi",3,4,"Mi34N",null,null,null,"> 132kV*",257.56,293.62,78.06,88.99,42.41,48.35,84.07,95.84,57.88,65.98,36.74,41.88,9.1999999999999993,10.49]
[null,null,null,null,null,null,null,null,"* 132 kV or Transmission connected"]
[]
[null,null,null,null,null,null,null,"Customer categories",null,"Service charge  [R/account/day]",null,"Administration charge  [R/POD/day]"]
[]
["Tariff","Tariff nameBillcode","Tx zone","Voltage","Billcode",null,null,null,null,null,"VAT incl",null,"VAT incl",null,null,"Ancillary service charge [c/kWh]",null,"Network demand charge [c/kWh]        \n     [Peak & Standard]",null,null,"Urban low voltage subsidy charge [R/kVA/m]"]
["Miniflex","Mi",0,1,{"$f":"B29&C29&D29&IF($A$2=\"Non-municipal\",\"N\",IF($A$2=\"Municiple\",\"Y\",\"error\"))","v":"Mi01N"},null,null,"≤ 100 kVA",null,12.92,{"$f":"ROUND(J29 * (1 + VAT), 2)","v":14.73},2.84,{"$f":"ROUND(L29 * (1 + VAT), 2)","v":3.24},null,"Voltage",null,"VAT incl",null,"VAT incl",null,null,null,"VAT incl"]
["Miniflex","Mi",0,1,{"$f":"B30&C30&D30&IF($A$2=\"Non-municipal\",\"N\",IF($A$2=\"Municiple\",\"Y\",\"error\"))","v":"Mi01N"},null,null,"> 100 kVA & ≤ 500 kVA",null,59.03,{"$f":"ROUND(J30 * (1 + VAT), 2)","v":67.290000000000006},16.55,{"$f":"ROUND(L30 * (1 + VAT), 2)","v":18.87},null,"< 500V",0.37,{"$f":"ROUND(P30 * (1 + VAT), 2)","v":0.42},14.7,{"$f":"ROUND(R30 * (1 + VAT), 2)","v":16.760000000000002},null,"< 500V",0,{"$f":"ROUND(V30 * (1 + VAT), 2)","v":0}]
["Miniflex","Mi",0,1,{"$f":"B31&C31&D31&IF($A$2=\"Non-municipal\",\"N\",IF($A$2=\"Municiple\",\"Y\",\"error\"))","v":"Mi01N"},null,null,"> 500 kVA & ≤ 1 MVA",null,181.66,{"$f":"ROUND(J31 * (1 + VAT), 2)","v":207.09},32.880000000000003,{"$f":"ROUND(L31 * (1 + VAT), 2)","v":37.479999999999997},null,"≥ 500V & < 66kV",0.36,{"$f":"ROUND(P31 * (1 + VAT), 2)","v":0.41},6.16,{"$f":"ROUND(R31 * (1 + VAT), 2)","v":7.02},null,"≥ 500V & < 66kV",0,{"$f":"ROUND(V31 * (1 + VAT), 2)","v":0}]
["Miniflex","Mi",0,1,{"$f":"B32&C32&D32&IF($A$2=\"Non-municipal\",\"N\",IF($A$2=\"Municiple\",\"Y\",\"error\"))","v":"Mi01N"},null,null,"> 1 MVA",null,181.66,{"$f":"ROUND(J32 * (1 + VAT), 2)","v":207.09},81.87,{"$f":"ROUND(L32 * (1 + VAT), 2)","v":93.33},null,"≥ 66kV & ≤ 132kV",0.34,{"$f":"ROUND(P32 * (1 + VAT), 2)","v":0.39},2.15,{"$f":"ROUND(R32 * (1 + VAT), 2)","v":2.4500000000000002},null,"≥ 66kV & ≤ 132kV",12.78,{"$f":"ROUND(V32 * (1 + VAT), 2)","v":14.57}]
["Miniflex","Mi",0,1,{"$f":"B33&C33&D33&IF($A$2=\"Non-municipal\",\"N\",IF($A$2=\"Municiple\",\"Y\",\"error\"))","v":"Mi01N"},null,null,"Key customers",null,3559.79,{"$f":"ROUND(J33 * (1 + VAT), 2)","v":4058.16},113.69,{"$f":"ROUND(L33 * (1 + VAT), 2)","v":129.61000000000001},null,"> 132kV*",0.32,{"$f":"ROUND(P33 * (1 + VAT), 2)","v":0.36},0,{"$f":"ROUND(R33 * (1 + VAT), 2)","v":0},null,"> 132kV*",12.78,{"$f":"ROUND(V33 * (1 + VAT), 2)","v":14.57}]
[null,null,null,null,null,null,null,null,null,null,null,null,null,null,"* 132 kV or Transmission connected",null,null,null,null,null,"* 132 kV or Transmission connected"]
[]
[null,null,null,null,null,null,null,"Electrification and rural network subsidy charge  [c/kWh]",null,"Affordability subsidy charge [c/kWh] \nOnly payable by non-local authority tariffs",null,null,null,null,"Reactive energy charge  [c/kVArh]"]
[]
[null,null,null,null,null,null,null,null,null,null,null,null,null,null,"High season",null,"Low season"]
["Tariff","Tariff nameBillcode","Tx zone","Voltage","Billcode",null,null,null,"VAT incl",null,"VAT incl",null,null,null,null,"VAT incl",null,"VAT incl"]
["Miniflex","Mi",0,1,{"$f":"B40&C40&D40&IF($A$2=\"Non-municipal\",\"N\",IF($A$2=\"Municiple\",\"Y\",\"error\"))","v":"Mi01N"},null,null,7.08,{"$f":"ROUND(H40 * (1 + VAT), 2)","v":8.07},2.87,{"$f":"ROUND(J40 * (1 + VAT), 2)","v":3.27},null,null,null,5.58,{"$f":"ROUND(O40 * (1 + VAT), 2)","v":6.36},0,{"$f":"ROUND(Q40 * (1 + VAT), 2)","v":0}]
[]
["Miniflex","Mi",0,1,{"$f":"B42&C42&D42&IF($A$2=\"Non-municipal\",\"N\",IF($A$2=\"Municiple\",\"Y\",\"error\"))","v":"Mi01N"}]
["Miniflex","Mi",1,2,{"$f":"B43&C43&D43&IF($A$2=\"Non-municipal\",\"N\",IF($A$2=\"Municiple\",\"Y\",\"error\"))","v":"Mi12N"}]
["Miniflex","Mi",2,3,"Mi23N"]
["Miniflex","Mi",3,4,"Mi34N"]

{"sheet":"Miniflex Munic inc ","index":11,"n_rows":45,"n_cols":23,"rows_kept":45,"cut":false,"hidden":false,"merged":[[3,21,5,22],[7,7,10,7],[1,6,1,16],[1,17,1,18],[1,19,1,22],[3,9,3,20],[4,7,6,7],[4,9,4,14],[4,15,4,20],[5,9,5,10],[5,11,5,12],[5,13,5,14],[5,15,5,16],[5,17,5,18],[5,19,5,20],[27,17,27,18],[27,20,27,22],[28,7,28,8],[29,7,29,8],[11,7,14,7],[15,7,18,7],[19,7,22,7],[25,9,26,10],[25,11,26,12],[25,7,25,8],[37,11,37,12],[37,13,37,14],[27,7,27,8],[27,15,27,16],[30,7,30,8],[31,7,31,8],[32,7,32,8],[35,11,36,14],[35,7,37,8]]}
[null,null,null,null,null,null,"Back to menu"]
["Municiple",null,null,null,null,null,"Miniflex tariff",null,null,null,null,null,null,null,null,null,null,null,null,"Local authority"]
[]
[null,null,null,null,null,null,null,null,null,"Active energy charge [c/kWh]",null,null,null,null,null,null,null,null,null,null,null,"Network capacity charge [R/kVA/m]"]
[null,null,null,null,null,null,null,"Transmission zone",null,"High demand season [Jun - Aug]",null,null,null,null,null,"Low demand season [Sep - May]"]
[null,null,null,null,null,null,null,null,"Voltage","Peak",null,"Standard",null,"Off Peak",null,"Peak",null,"Standard",null,"Off Peak"]
["Tariff","Tariff nameBillcode","Tx zone","Voltage","Billcode",null,null,null,null,"","VAT incl",null,"VAT incl",null,"VAT incl",null,"VAT incl",null,"VAT incl",null,"VAT incl",null,"VAT incl"]
["Miniflex","Mi",0,1,{"$f":"B8&C8&D8&IF($A$2=\"Non-municipal\",\"N\",IF($A$2=\"Municiple\",\"Y\",\"error\"))","v":"Mi01Y"},null,null,"≤ 300km","< 500V",279.70999999999998,{"$f":"ROUND(J8 * (1 + VAT), 2)","v":318.87},85.11,{"$f":"ROUND(L8 * (1 + VAT), 2)","v":97.03},46.44,{"$f":"ROUND(N8 * (1 + VAT), 2)","v":52.94},91.58,{"$f":"ROUND(P8 * (1 + VAT), 2)","v":104.4},63.2,{"$f":"ROUND(R8 * (1 + VAT), 2)","v":72.05},40.28,{"$f":"ROUND(T8 * (1 + VAT), 2)","v":45.92},23.32,{"$f":"ROUND(V8 * (1 + VAT), 2)","v":26.58}]
["Miniflex","Mi",0,2,{"$f":"B9&C9&D9&IF($A$2=\"Non-municipal\",\"N\",IF($A$2=\"Municiple\",\"Y\",\"error\"))","v":"Mi02Y"},null,null,null,"≥ 500V & < 66kV",275.3,313.83999999999997,83.41,95.09,45.29,51.63,89.81,102.38,61.81,70.459999999999994,39.22,44.71,21.37,24.36]
["Miniflex","Mi",0,3,"Mi03Y",null,null,null,"≥ 66kV & ≤ 132kV",266.61,303.94,80.760000000000005,92.07,43.86,50,86.97,99.15,59.87,68.25,37.97,43.29,12,13.68]
["Miniflex","Mi",0,4,"Mi04Y",null,null,null,"> 132kV*",251.27,286.45,76.12,86.78,41.33,47.12,81.96,93.43,56.41,64.31,35.79,40.799999999999997,8.76,9.99]
["Miniflex","Mi",1,1,"Mi11Y",null,null,"> 300km and \n≤ 600km","< 500V",281.99,321.47000000000003,85.43,97.39,46.38,52.87,91.99,104.87,63.33,72.2,40.17,45.79,23.37,26.64]
["Miniflex","Mi",1,2,"Mi12Y",null,null,null,"≥ 500V & < 66kV",278.05,316.98,84.23,96.02,45.74,52.14,90.71,103.41,62.43,71.17,39.6,45.14,21.44,24.44]
["Miniflex","Mi",1,3,"Mi13Y",null,null,null,"≥ 66kV & ≤ 132kV",269.22000000000003,306.91000000000003,81.55,92.97,44.28,50.48,87.82,100.11,60.44,68.900000000000006,38.33,43.7,12.07,13.76]
["Miniflex","Mi",1,4,"Mi14Y",null,null,null,"> 132kV*",253.77,289.3,76.89,87.65,41.74,47.58,82.77,94.36,56.98,64.959999999999994,36.14,41.2,8.84,10.08]
["Miniflex","Mi",2,1,"Mi21Y",null,null,"> 600km and \n≤ 900km","< 500V",284.8,324.67,86.28,98.36,46.84,53.4,92.9,105.91,63.95,72.900000000000006,40.57,46.25,23.49,26.78]
["Miniflex","Mi",2,2,"Mi22Y",null,null,null,"≥ 500V & < 66kV",280.85000000000002,320.17,85.07,96.98,46.2,52.67,91.63,104.46,63.03,71.849999999999994,40,45.6,21.5,24.51]
["Miniflex","Mi",2,3,"Mi23Y",null,null,null,"≥ 66kV & ≤ 132kV",271.95999999999998,310.02999999999997,82.37,93.9,44.73,50.99,88.69,101.11,61.04,69.59,38.72,44.14,12.12,13.82]
["Miniflex","Mi",2,4,"Mi24Y",null,null,null,"> 132kV*",256.32,292.2,77.66,88.53,42.16,48.06,83.62,95.33,57.55,65.61,36.51,41.62,8.9600000000000009,10.210000000000001]
["Miniflex","Mi",3,1,"Mi31Y",null,null,"> 900km","< 500V",287.66000000000003,327.93,87.15,99.35,47.33,53.96,93.84,106.98,64.58,73.62,40.98,46.72,23.51,26.8]
["Miniflex","Mi",3,2,"Mi32Y",null,null,null,"≥ 500V & < 66kV",283.66000000000003,323.37,85.92,97.95,46.66,53.19,92.52,105.47,63.68,72.599999999999994,40.380000000000003,46.03,21.59,24.61]
["Miniflex","Mi",3,3,"Mi33Y",null,null,null,"≥ 66kV & ≤ 132kV",274.7,313.16000000000003,83.22,94.87,45.19,51.52,89.6,102.14,61.66,70.290000000000006,39.119999999999997,44.6,12.16,13.86]
["Miniflex","Mi",3,4,"Mi34Y",null,null,null,"> 132kV*",258.83999999999997,295.08,78.45,89.43,42.63,48.6,84.48,96.31,58.15,66.290000000000006,36.909999999999997,42.08,9.0299999999999994,10.29]
[null,null,null,null,null,null,null,null,"* 132 kV or Transmission connected"]
[]
[null,null,null,null,null,null,null,"Customer categories",null,"Service charge  [R/account/day]",null,"Administration charge  [R/POD/day]"]
[]
["Tariff","Tariff nameBillcode","Tx zone","Voltage","Billcode",null,null,null,null,null,"VAT incl",null,"VAT incl",null,null,"Ancillary service charge [c/kWh]",null,"Network demand charge [c/kWh]        \n     [Peak & Standard]",null,null,"Urban low voltage subsidy charge [R/kVA/m]"]
["Miniflex","Mi",0,1,{"$f":"B29&C29&D29&IF($A$2=\"Non-municipal\",\"N\",IF($A$2=\"Municiple\",\"Y\",\"error\"))","v":"Mi01Y"},null,null,"≤ 100 kVA",null,12.62,{"$f":"ROUND(J29 * (1 + VAT), 2)","v":14.39},2.77,{"$f":"ROUND(L29 * (1 + VAT), 2)","v":3.16},null,"Voltage",null,"VAT incl",null,"VAT incl",null,null,null,"VAT incl"]
["Miniflex","Mi",0,1,{"$f":"B30&C30&D30&IF($A$2=\"Non-municipal\",\"N\",IF($A$2=\"Municiple\",\"Y\",\"error\"))","v":"Mi01Y"},null,null,"> 100 kVA & ≤ 500 kVA",null,57.67,{"$f":"ROUND(J30 * (1 + VAT), 2)","v":65.739999999999995},16.16,{"$f":"ROUND(L30 * (1 + VAT), 2)","v":18.420000000000002},null,"< 500V",0.36,{"$f":"ROUND(P30 * (1 + VAT), 2)","v":0.41},14.42,{"$f":"ROUND(R30 * (1 + VAT), 2)","v":16.440000000000001},null,"< 500V",0,{"$f":"ROUND(V30 * (1 + VAT), 2)","v":0}]
["Miniflex","Mi",0,1,{"$f":"B31&C31&D31&IF($A$2=\"Non-municipal\",\"N\",IF($A$2=\"Municiple\",\"Y\",\"error\"))","v":"Mi01Y"},null,null,"> 500 kVA & ≤ 1 MVA",null,177.48,{"$f":"ROUND(J31 * (1 + VAT), 2)","v":202.33},32.130000000000003,{"$f":"ROUND(L31 * (1 + VAT), 2)","v":36.630000000000003},null,"≥ 500V & < 66kV",0.35,{"$f":"ROUND(P31 * (1 + VAT), 2)","v":0.4},6.06,{"$f":"ROUND(R31 * (1 + VAT), 2)","v":6.91},null,"≥ 500V & < 66kV",0,{"$f":"ROUND(V31 * (1 + VAT), 2)","v":0}]
["Miniflex","Mi",0,1,{"$f":"B32&C32&D32&IF($A$2=\"Non-municipal\",\"N\",IF($A$2=\"Municiple\",\"Y\",\"error\"))","v":"Mi01Y"},null,null,"> 1 MVA",null,177.48,{"$f":"ROUND(J32 * (1 + VAT), 2)","v":202.33},80,{"$f":"ROUND(L32 * (1 + VAT), 2)","v":91.2},null,"≥ 66kV & ≤ 132kV",0.33,{"$f":"ROUND(P32 * (1 + VAT), 2)","v":0.38},2.1,{"$f":"ROUND(R32 * (1 + VAT), 2)","v":2.39},null,"≥ 66kV & ≤ 132kV",12.48,{"$f":"ROUND(V32 * (1 + VAT), 2)","v":14.23}]
["Miniflex","Mi",0,1,{"$f":"B33&C33&D33&IF($A$2=\"Non-municipal\",\"N\",IF($A$2=\"Municiple\",\"Y\",\"error\"))","v":"Mi01Y"},null,null,"Key customers",null,3477.93,{"$f":"ROUND(J33 * (1 + VAT), 2)","v":3964.84},111.07,{"$f":"ROUND(L33 * (1 + VAT), 2)","v":126.62},null,"> 132kV*",0.31,{"$f":"ROUND(P33 * (1 + VAT), 2)","v":0.35},0,{"$f":"ROUND(R33 * (1 + VAT), 2)","v":0},null,"> 132kV*",12.48,{"$f":"ROUND(V33 * (1 + VAT), 2)","v":14.23}]
[null,null,null,null,null,null,null,null,null,null,null,null,null,null,"* 132 kV or Transmission connected",null,null,null,null,null,"* 132 kV or Transmission connected"]
[]
[null,null,null,null,null,null,null,"Electrification and rural network subsidy charge  [c/kWh]",null,null,null,"Reactive energy charge  [c/kVArh]"]
[]
[null,null,null,null,null,null,null,null,null,null,null,"High season",null,"Low season"]
["Tariff","Tariff nameBillcode","Tx zone","Voltage","Billcode",null,null,null,"VAT incl",null,null,null,"VAT incl",null,"VAT incl"]
["Miniflex","Mi",0,1,{"$f":"B40&C40&D40&IF($A$2=\"Non-municipal\",\"N\",IF($A$2=\"Municiple\",\"Y\",\"error\"))","v":"Mi01Y"},null,null,6.91,{"$f":"ROUND(H40 * (1 + VAT), 2)","v":7.88},null,null,5.47,{"$f":"ROUND(L40 * (1 + VAT), 2)","v":6.24},0,{"$f":"ROUND(N40 * (1 + VAT), 2)","v":0}]
[]
["Miniflex","Mi",0,1,{"$f":"B42&C42&D42&IF($A$2=\"Non-municipal\",\"N\",IF($A$2=\"Municiple\",\"Y\",\"error\"))","v":"Mi01Y"}]
["Miniflex","Mi",1,2,{"$f":"B43&C43&D43&IF($A$2=\"Non-municipal\",\"N\",IF($A$2=\"Municiple\",\"Y\",\"error\"))","v":"Mi12Y"}]
["Miniflex","Mi",2,3,"Mi23Y"]
["Miniflex","Mi",3,4,"Mi34Y"]

{"sheet":"Businessrate inc","index":12,"n_rows":11,"n_cols":29,"rows_kept":11,"cut":false,"hidden":false,"merged":[[1,15,1,18],[3,9,4,10],[3,11,4,12],[3,13,4,14],[3,15,4,16],[3,17,3,18],[8,7,8,8],[9,7,9,8],[10,7,10,8],[3,25,4,26],[3,27,4,28],[4,17,4,18],[5,25,5,26],[5,27,5,28],[7,7,7,8]]}
[null,null,null,null,null,null,null,"Back to menu"]
["Non-municipal",null,null,null,null,null,null,"Businessrate tariffs",null,null,null,null,null,null,null,"Non-local authority"]
[]
[null,null,null,null,null,null,null,null,null,"Energy charge [c/kWh]",null,"Ancillary service charge \n[c/kWh]",null,"Network demand charge \n [c/kWh]",null,"Network capacity charge\n [R/POD/day]",null,"Service and administration charge  \n[R/POD/day]",null,null,null,null,null,null,null,"Electrification and rural network subsidy charge  [c/kWh]",null,"Affordability subsidy charge [c/kWh] payable by non-local authority tariffs"]
[]
[null,null,null,null,null,null,null,null,null,null,null,null,null,null,null,null,null,null,null,null,null,null,null,null,null,"All seasons",null,"All seasons"]
["Tariff","Tariff nameBillcode","Tx zone","Voltage","Billcode",null,null,null,null,null,"VAT incl",null,"VAT incl",null,"VAT incl",null,"VAT incl",null,"VAT incl",null,null,null,null,null,null,null,"VAT incl",null,"VAT incl"]
["Businessrate 1","B1",0,1,{"$f":"B8&C8&D8&IF($A$2=\"Non-municipal\",\"N\",IF($A$2=\"Municiple\",\"Y\",\"error\"))","v":"B101N"},null,null,"Businessrate 1",null,95.3,{"$f":"ROUND(J8 * (1 + VAT), 2)","v":108.64},0.37,{"$f":"ROUND(L8 * (1 + VAT), 2)","v":0.42},13.46,{"$f":"ROUND(N8 * (1 + VAT), 2)","v":15.34},19.32,{"$f":"ROUND(P8 * (1 + VAT), 2)","v":22.02},16.690000000000001,{"$f":"ROUND(R8 * (1 + VAT), 2)","v":19.03},null,null,null,null,null,null,0,{"$f":"ROUND(Z8 * (1 + VAT), 2)","v":0},0,{"$f":"ROUND(AB8 * (1 + VAT), 2)","v":0}]
["Businessrate 2","B2",0,1,{"$f":"B9&C9&D9&IF($A$2=\"Non-municipal\",\"N\",IF($A$2=\"Municiple\",\"Y\",\"error\"))","v":"B201N"},null,null,"Businessrate 2",null,95.3,{"$f":"ROUND(J9 * (1 + VAT), 2)","v":108.64},0.37,{"$f":"ROUND(L9 * (1 + VAT), 2)","v":0.42},13.46,{"$f":"ROUND(N9 * (1 + VAT), 2)","v":15.34},32.549999999999997,{"$f":"ROUND(P9 * (1 + VAT), 2)","v":37.11},16.690000000000001,{"$f":"ROUND(R9 * (1 + VAT), 2)","v":19.03},null,null,null,null,null,null,{"$f":"Z8","v":0},{"$f":"ROUND(Z9 * (1 + VAT), 2)","v":0},{"$f":"AB8","v":0},{"$f":"ROUND(AB9 * (1 + VAT), 2)","v":0}]
["Businessrate 3","B3",0,1,"B301N",null,null,"Businessrate 3",null,95.3,{"$f":"ROUND(J10 * (1 + VAT), 2)","v":108.64},0.37,{"$f":"ROUND(L10 * (1 + VAT), 2)","v":0.42},13.46,{"$f":"ROUND(N10 * (1 + VAT), 2)","v":15.34},56.24,{"$f":"ROUND(P10 * (1 + VAT), 2)","v":64.11},16.690000000000001,{"$f":"ROUND(R10 * (1 + VAT), 2)","v":19.03},null,null,null,null,null,null,{"$f":"Z8","v":0},{"$f":"ROUND(Z10 * (1 + VAT), 2)","v":0},{"$f":"AB8","v":0},{"$f":"ROUND(AB10 * (1 + VAT), 2)","v":0}]
["Businessrate 4","B4",0,1,"B401N",null,null,"Businessrate 4",null,256.45,{"$f":"ROUND(J11 * (1 + VAT), 2)","v":292.35000000000002},0.37,{"$f":"ROUND(L11 * (1 + VAT), 2)","v":0.42},13.46,{"$f":"ROUND(N11 * (1 + VAT), 2)","v":15.34},null,null,null,null,null,null,null,null,null,null,{"$f":"Z9","v":0},{"$f":"ROUND(Z11 * (1 + VAT), 2)","v":0},{"$f":"AB9","v":0},{"$f":"ROUND(AB11 * (1 + VAT), 2)","v":0}]

{"sheet":"Businessrate Munic inc","index":13,"n_rows":11,"n_cols":29,"rows_kept":11,"cut":false,"hidden":false,"merged":[[1,15,1,18],[3,9,4,10],[3,11,4,12],[3,13,4,14],[3,15,4,16],[3,17,3,18],[8,7,8,8],[9,7,9,8],[10,7,10,8],[3,25,4,26],[3,27,4,28],[4,17,4,18],[5,25,5,26],[5,27,5,28],[7,7,7,8]]}
[null,null,null,null,null,null,null,"Back to menu"]
["Municiple",null,null,null,null,null,null,"Businessrate tariffs",null,null,null,null,null,null,null,"Local authority"]
[]
[null,null,null,null,null,null,null,null,null,"Energy charge [c/kWh]",null,"Ancillary service charge \n[c/kWh]",null,"Network demand charge \n [c/kWh]",null,"Network capacity charge\n [R/POD/day]",null,"Service and administration charge  \n[R/POD/day]",null,null,null,null,null,null,null,"Electrification and rural network subsidy charge  [c/kWh]",null,"Affordability subsidy charge [c/kWh] payable by non-local authority tariffs"]
[]
[null,null,null,null,null,null,null,null,null,null,null,null,null,null,null,null,null,null,null,null,null,null,null,null,null,"All seasons",null,"All seasons"]
["Tariff","Tariff nameBillcode","Tx zone","Voltage","Billcode",null,null,null,null,null,"VAT incl",null,"VAT incl",null,"VAT incl",null,"VAT incl",null,"VAT incl",null,null,null,null,null,null,null,"VAT incl",null,"VAT incl"]
["Businessrate 1","B1",0,1,{"$f":"B8&C8&D8&IF($A$2=\"Non-municipal\",\"N\",IF($A$2=\"Municiple\",\"Y\",\"error\"))","v":"B101Y"},null,null,"Businessrate 1",null,95.77,{"$f":"ROUND(J8 * (1 + VAT), 2)","v":109.18},0.36,{"$f":"ROUND(L8 * (1 + VAT), 2)","v":0.41},13.27,{"$f":"ROUND(N8 * (1 + VAT), 2)","v":15.13},19.04,{"$f":"ROUND(P8 * (1 + VAT), 2)","v":21.71},16.3,{"$f":"ROUND(R8 * (1 + VAT), 2)","v":18.579999999999998},null,null,null,null,null,null,0,{"$f":"ROUND(Z8 * (1 + VAT), 2)","v":0},0,{"$f":"ROUND(AB8 * (1 + VAT), 2)","v":0}]
["Businessrate 2","B2",0,1,{"$f":"B9&C9&D9&IF($A$2=\"Non-municipal\",\"N\",IF($A$2=\"Municiple\",\"Y\",\"error\"))","v":"B201Y"},null,null,"Businessrate 2",null,95.77,{"$f":"ROUND(J9 * (1 + VAT), 2)","v":109.18},0.36,{"$f":"ROUND(L9 * (1 + VAT), 2)","v":0.41},13.27,{"$f":"ROUND(N9 * (1 + VAT), 2)","v":15.13},32.1,{"$f":"ROUND(P9 * (1 + VAT), 2)","v":36.590000000000003},16.3,{"$f":"ROUND(R9 * (1 + VAT), 2)","v":18.579999999999998},null,null,null,null,null,null,{"$f":"Z8","v":0},{"$f":"ROUND(Z9 * (1 + VAT), 2)","v":0},{"$f":"AB8","v":0},{"$f":"ROUND(AB9 * (1 + VAT), 2)","v":0}]
["Businessrate 3","B3",0,1,"B301Y",null,null,"Businessrate 3",null,95.77,{"$f":"ROUND(J10 * (1 + VAT), 2)","v":109.18},0.36,{"$f":"ROUND(L10 * (1 + VAT), 2)","v":0.41},13.27,{"$f":"ROUND(N10 * (1 + VAT), 2)","v":15.13},55.47,{"$f":"ROUND(P10 * (1 + VAT), 2)","v":63.24},16.3,{"$f":"ROUND(R10 * (1 + VAT), 2)","v":18.579999999999998},null,null,null,null,null,null,{"$f":"Z8","v":0},{"$f":"ROUND(Z10 * (1 + VAT), 2)","v":0},{"$f":"AB8","v":0},{"$f":"ROUND(AB10 * (1 + VAT), 2)","v":0}]
["Businessrate 4","B4",0,1,"B401Y",null,null,"Businessrate 4",null,257.70999999999998,{"$f":"ROUND(J11 * (1 + VAT), 2)","v":293.79000000000002},0.36,{"$f":"ROUND(L11 * (1 + VAT), 2)","v":0.41},13.27,{"$f":"ROUND(N11 * (1 + VAT), 2)","v":15.13},null,null,null,null,null,null,null,null,null,null,{"$f":"Z9","v":0},{"$f":"ROUND(Z11 * (1 + VAT), 2)","v":0},{"$f":"AB9","v":0},{"$f":"ROUND(AB11 * (1 + VAT), 2)","v":0}]

{"sheet":"Public Lighting inc","index":14,"n_rows":14,"n_cols":14,"rows_kept":14,"cut":false,"hidden":false,"merged":[[8,8,8,9],[8,12,8,13],[10,7,11,9],[10,10,10,11],[1,7,1,13],[3,10,3,11],[3,12,3,13],[5,7,6,7],[5,8,5,9],[6,8,6,9]]}
[null,null,null,null,null,null,null,"Back to menu"]
["Non-municipal",null,null,null,null,null,null,"Public Lighting tariffs                                                    Non-local authority"]
[]
[null,null,null,null,null,null,null,null,null,null,"All Night ",null,"24 Hours "]
["Tariff","Tariff nameBillcode","Tx zone","Voltage","Billcode",null,null,null,null,null,"","VAT incl","","VAT incl"]
["Public lighting 24 hours","Pu",0,1,{"$f":"B6&C6&D6&IF($A$2=\"Non-municipal\",\"N\",IF($A$2=\"Municiple\",\"Y\",\"error\"))","v":"Pu01N"},null,null,"Public Lighting","Energy charge [c/kWh]",null,75.83,{"$f":"ROUND(K6 * (1 + VAT), 2)","v":86.45},101.54,{"$f":"ROUND(M6 * (1 + VAT), 2)","v":115.76}]
["Public lighting All Night","Pa",0,1,{"$f":"B7&C7&D7&IF($A$2=\"Non-municipal\",\"N\",IF($A$2=\"Municiple\",\"Y\",\"error\"))","v":"Pa01N"},null,null,null,"Energy charge [R/100W/month]",null,23.73,{"$f":"ROUND(K7 * (1 + VAT), 2)","v":27.05},68.39,{"$f":"ROUND(M7 * (1 + VAT), 2)","v":77.959999999999994}]
[]
["Public lighting Urban fixed","Pt",0,1,{"$f":"B9&C9&D9&IF($A$2=\"Non-municipal\",\"N\",IF($A$2=\"Municiple\",\"Y\",\"error\"))","v":"Pt01N"},null,null,"Public Lighting - Urban Fixed","Fixed charge [R/POD/day]",null,4.99,{"$f":"ROUND(K9 * (1 + VAT), 2)","v":5.69}]
[]
[null,null,null,null,null,null,null,"Maintenance charges",null,null,"R/month"]
[null,null,null,null,null,null,null,null,null,null,"","VAT incl"]
["Public Lighting - Maintenance charge - per lumanaire","Plu",0,1,{"$f":"B13&C13&D13&IF($A$2=\"Non-municipal\",\"N\",IF($A$2=\"Municiple\",\"Y\",\"error\"))","v":"Plu01N"},null,null,null,null,"Per lumanaire",40.22,{"$f":"ROUND(K13 * (1 + VAT), 2)","v":45.85}]
["Public Lighting - Maintenance charge - per high-mast lumanaire","Plhm",0,1,{"$f":"B14&C14&D14&IF($A$2=\"Non-municipal\",\"N\",IF($A$2=\"Municiple\",\"Y\",\"error\"))","v":"Plhm01N"},null,null,null,null,"Per high-mast lumanaire",936.11,{"$f":"ROUND(K14 * (1 + VAT), 2)","v":1067.17}]

{"sheet":"Public Lighting Munic inc","index":15,"n_rows":14,"n_cols":29,"rows_kept":14,"cut":false,"hidden":false,"merged":[[8,8,8,9],[8,12,8,13],[10,7,11,9],[10,10,10,11],[1,7,1,13],[3,10,3,11],[3,12,3,13],[5,7,6,7],[5,8,5,9],[6,8,6,9]]}
[null,null,null,null,null,null,null,"Back to menu"]
["Municipal",null,null,null,null,null,null,"Public Lighting tariffs                                           Local authority",null,null,null,null,null,null,null,null,null,null,null,null,null,null,null,null,null,null,null,{"$f":"SUM(#REF!)","v":{"$error":"#REF!"}},"check value"]
[]
[null,null,null,null,null,null,null,null,null,null,"All Night ",null,"24 Hours "]
["Tariff","Tariff nameBillcode","Tx zone","Voltage","Billcode",null,null,null,null,null,"","VAT incl","","VAT incl"]
["Public lighting 24 hours","Pu",0,1,{"$f":"B6&C6&D6&IF($A$2=\"Non-municipal\",\"N\",IF($A$2=\"Municipal\",\"Y\",\"error\"))","v":"Pu01Y"},null,null,"Public Lighting","Energy charge [c/kWh]",null,77.3,{"$f":"ROUND(K6 * (1 + VAT), 2)","v":88.12},103.51,{"$f":"ROUND(M6 * (1 + VAT), 2)","v":118}]
["Public lighting All Night","Pa",0,1,{"$f":"B7&C7&D7&IF($A$2=\"Non-municipal\",\"N\",IF($A$2=\"Municipal\",\"Y\",\"error\"))","v":"Pa01Y"},null,null,null,"Energy charge [R/100W/month]",null,23.61,{"$f":"ROUND(K7 * (1 + VAT), 2)","v":26.92},68.05,{"$f":"ROUND(M7 * (1 + VAT), 2)","v":77.58}]
[]
["Public lighting Urban fixed","Pt",0,1,{"$f":"B9&C9&D9&IF($A$2=\"Non-municipal\",\"N\",IF($A$2=\"Municipal\",\"Y\",\"error\"))","v":"Pt01Y"},null,null,"Public Lighting - Urban Fixed ","Fixed charge [R/POD/day]",null,5.0827341559077741,{"$f":"ROUND(K9 * (1 + VAT), 2)","v":5.79}]
[]
[null,null,null,null,null,null,null,"Maintenance charges",null,null,"R/month"]
[null,null,null,null,null,null,null,null,null,null,"","VAT incl"]
["Public Lighting - Maintenance charge - per lumanaire","Plu",0,1,{"$f":"B13&C13&D13&IF($A$2=\"Non-municipal\",\"N\",IF($A$2=\"Municipal\",\"Y\",\"error\"))","v":"Plu01Y"},null,null,null,null,"Per lumanaire",40.79,{"$f":"ROUND(K13 * (1 + VAT), 2)","v":46.5}]
["Public Lighting - Maintenance charge - per high-mast lumanaire","Plhm",0,1,{"$f":"B14&C14&D14&IF($A$2=\"Non-municipal\",\"N\",IF($A$2=\"Municipal\",\"Y\",\"error\"))","v":"Plhm01Y"},null,null,null,null,"Per high-mast lumanaire",952.62,{"$f":"ROUND(K14 * (1 + VAT), 2)","v":1085.99}]

{"sheet":"Homepower inc","index":16,"n_rows":15,"n_cols":15,"rows_kept":15,"cut":false,"hidden":false,"merged":[[11,9,11,10],[11,11,11,12],[13,7,13,8],[4,13,4,14],[6,7,6,8],[7,7,7,8],[8,7,8,8],[9,7,9,8],[4,9,4,12]]}
[null,null,null,null,null,null,null,"Back to menu"]
["Non-municipal",null,null,null,null,null,null,"Homepower tariffs",null,null,null,null,null,null,"Non-local authority"]
[]
[]
[null,null,null,null,null,null,null,null,null,"Energy charge\n[c/kWh]",null,null,null,"Network capacity charge \n[R/POD/day]"]
["Tariff","Tariff nameBillcode","Tx zone","Voltage","Billcode",null,null,null,null,"Block 1   \n[>0 - 600 kWh]","VAT incl","Block 2   \n[>600 kWh]","VAT incl",null,"VAT incl"]
["Homepower 1","H1",0,1,{"$f":"B7&C7&D7&IF($A$2=\"Non-municipal\",\"N\",IF($A$2=\"Municiple\",\"Y\",\"error\"))","v":"H101N"},null,null,"Homepower 1",null,111.69,{"$f":"ROUND(J7 * (1 + VAT), 2)","v":127.33},176.36,{"$f":"ROUND(L7 * (1 + VAT), 2)","v":201.05},4.78,{"$f":"ROUND(N7 * (1 + VAT), 2)","v":5.45}]
["Homepower 2","H2",0,1,{"$f":"B8&C8&D8&IF($A$2=\"Non-municipal\",\"N\",IF($A$2=\"Municiple\",\"Y\",\"error\"))","v":"H201N"},null,null,"Homepower 2",null,111.69,{"$f":"ROUND(J8 * (1 + VAT), 2)","v":127.33},171.95,{"$f":"ROUND(L8 * (1 + VAT), 2)","v":196.02},8.9600000000000009,{"$f":"ROUND(N8 * (1 + VAT), 2)","v":10.210000000000001}]
["Homepower 3","H3",0,1,"H301N",null,null,"Homepower 3",null,111.69,{"$f":"ROUND(J9 * (1 + VAT), 2)","v":127.33},171.95,{"$f":"ROUND(L9 * (1 + VAT), 2)","v":196.02},18.510000000000002,{"$f":"ROUND(N9 * (1 + VAT), 2)","v":21.1}]
["Homepower 4","H4",0,1,"H401N",null,null,"Homepower 4",null,111.69,{"$f":"ROUND(J10 * (1 + VAT), 2)","v":127.33},179.61,{"$f":"ROUND(L10 * (1 + VAT), 2)","v":204.76},2.92,{"$f":"ROUND(N10 * (1 + VAT), 2)","v":3.33}]
[]
[null,null,null,null,null,null,null,null,null,"Energy charge  \n[c/kWh]",null,"Network capacity charge [R/kVA]"]
[null,null,null,null,null,null,null,null,null,null,"VAT incl",null,"VAT incl"]
["Homepower Bulk < 500V","HB",0,1,{"$f":"B14&C14&D14&IF($A$2=\"Non-municipal\",\"N\",IF($A$2=\"Municiple\",\"Y\",\"error\"))","v":"HB01N"},null,null,"Homepower Bulk  \n",null,146.63999999999999,{"$f":"ROUND(J14 * (1 + VAT), 2)","v":167.17},30.34,{"$f":"ROUND(L14 * (1 + VAT), 2)","v":34.590000000000003}]
[null,null,null,null,null,null,null,"* The Network capacity charge is based on the NMD or on the maximum demand if measured."]

{"sheet":"Homepower Munic inc","index":17,"n_rows":9,"n_cols":15,"rows_kept":9,"cut":false,"hidden":false,"merged":[[7,7,7,8],[8,7,8,8],[1,13,1,14],[3,9,3,10],[3,11,3,12],[3,13,3,14],[5,7,5,8],[6,7,6,8]]}
[null,null,null,null,null,null,null,"Back to menu"]
["Municiple",null,null,null,null,null,null,"Homepower tariffs",null,null,null,null,null,"Local authority"]
[]
[null,null,null,null,null,null,null,null,null,"Energy charge\n[c/kWh]",null,"Energy charge\n[c/kWh]",null,"Network capacity charge [R/POD/day]"]
["Tariff","Tariff nameBillcode","Tx zone","Voltage","Billcode",null,null,null,null,"Block 1   \n[>0 - 600 kWh]","VAT incl","Block 2   \n[>600 kWh]","VAT incl",null,"VAT incl"]
["Homepower 1","H1",0,1,{"$f":"B6&C6&D6&IF($A$2=\"Non-municipal\",\"N\",IF($A$2=\"Municiple\",\"Y\",\"error\"))","v":"H101Y"},null,null,"Homepower 1",null,109.63,{"$f":"ROUND(J6 * (1 + VAT), 2)","v":124.98},173.1,{"$f":"ROUND(L6 * (1 + VAT), 2)","v":197.33},4.6900000000000004,{"$f":"ROUND(N6 * (1 + VAT), 2)","v":5.35}]
["Homepower 2","H2",0,1,{"$f":"B7&C7&D7&IF($A$2=\"Non-municipal\",\"N\",IF($A$2=\"Municiple\",\"Y\",\"error\"))","v":"H201Y"},null,null,"Homepower 2",null,109.63,{"$f":"ROUND(J7 * (1 + VAT), 2)","v":124.98},168.76,{"$f":"ROUND(L7 * (1 + VAT), 2)","v":192.39},8.8000000000000007,{"$f":"ROUND(N7 * (1 + VAT), 2)","v":10.029999999999999}]
["Homepower 3","H3",0,1,"H301Y",null,null,"Homepower 3",null,109.63,{"$f":"ROUND(J8 * (1 + VAT), 2)","v":124.98},168.76,{"$f":"ROUND(L8 * (1 + VAT), 2)","v":192.39},18.170000000000002,{"$f":"ROUND(N8 * (1 + VAT), 2)","v":20.71}]
["Homepower 4","H4",0,1,"H401Y",null,null,"Homepower 4",null,109.63,{"$f":"ROUND(J9 * (1 + VAT), 2)","v":124.98},176.29,{"$f":"ROUND(L9 * (1 + VAT), 2)","v":200.97},2.87,{"$f":"ROUND(N9 * (1 + VAT), 2)","v":3.27}]

{"sheet":"Homelight inc","index":18,"n_rows":13,"n_cols":11,"rows_kept":13,"cut":false,"hidden":false,"merged":[[1,7,1,10],[11,7,11,8],[12,7,12,8],[3,7,4,8],[3,9,3,10],[5,7,5,8],[6,7,6,8],[9,7,10,8],[9,9,9,10]]}
[null,null,null,null,null,null,null,"Back to menu"]
["Non-municipal",null,null,null,null,null,null,"Homelight tariffs  \nNon-local authority"]
[]
[null,null,null,null,null,null,null,"Homelight 60A",null,"Energy charge [c/kWh]"]
["Tariff","Tariff nameBillcode","Tx zone","Voltage","Billcode",null,null,null,null,null,"VAT incl"]
["Homelight 1 60A","HL16",0,1,{"$f":"B6&C6&D6&IF($A$2=\"Non-municipal\",\"N\",IF($A$2=\"Municiple\",\"Y\",\"error\"))","v":"HL1601N"},null,null,"Block 1   [> 0 - 600 kWh]",null,105.66,{"$f":"ROUND(J6 * (1 + VAT), 2)","v":120.45}]
["Homelight 2 60A","HL26",0,1,{"$f":"B7&C7&D7&IF($A$2=\"Non-municipal\",\"N\",IF($A$2=\"Municiple\",\"Y\",\"error\"))","v":"HL2601N"},null,null,"Block 2   [>600 kWh]",null,179.61,{"$f":"ROUND(J7 * (1 + VAT), 2)","v":204.76}]
[]
[]
[null,null,null,null,null,null,null,"Homelight 20A",null,"Energy charge [c/kWh]"]
[null,null,null,null,null,null,null,null,null,null,"VAT incl"]
["Homelight 1 20A","HL12",0,1,{"$f":"B12&C12&D12&IF($A$2=\"Non-municipal\",\"N\",IF($A$2=\"Municiple\",\"Y\",\"error\"))","v":"HL1201N"},null,null,"Block 1   [> 0 - 350 kWh]",null,93.47,{"$f":"ROUND(J12 * (1 + VAT), 2)","v":106.56}]
["Homelight 2 20A","HL22",0,1,{"$f":"B13&C13&D13&IF($A$2=\"Non-municipal\",\"N\",IF($A$2=\"Municiple\",\"Y\",\"error\"))","v":"HL2201N"},null,null,"Block 2   [>350 kWh]",null,105.79,{"$f":"ROUND(J13 * (1 + VAT), 2)","v":120.6}]

{"sheet":"Nightsave Rural inc","index":19,"n_rows":34,"n_cols":33,"rows_kept":34,"cut":false,"hidden":false,"merged":[[1,6,1,16],[1,17,1,18],[3,9,3,12],[3,13,3,16],[3,17,5,18],[4,7,6,7],[4,9,5,10],[4,11,5,12],[4,13,5,14],[4,15,5,16],[29,15,29,16],[29,17,29,18],[30,7,30,8],[7,7,10,7],[11,7,14,7],[15,7,18,7],[19,7,22,7],[25,7,26,8],[25,9,26,10],[25,11,26,12],[31,7,31,8],[32,7,32,8],[27,7,27,8],[28,7,28,8],[29,7,29,8]]}
[null,null,null,null,null,null,"Back to menu",null,null,null,null,null,null,null,null,null,null,null,{"$error":"#REF!"}]
["Non-municipal",null,null,null,null,null,"Nightsave Rural tariff",null,null,null,null,null,null,null,null,null,null,"Non-local authority",null,null,null,null,null,null,null,null,null,null,null,null,null,{"$f":"SUM(#REF!,#REF!,#REF!,#REF!,#REF!,#REF!,#REF!,#REF!,#REF!,#REF!,#REF!,#REF!,#REF!,#REF!,#REF!)","v":{"$error":"#REF!"}},"check value"]
[]
[null,null,null,null,null,null,null,null,null,"Active energy charge [c/kWh]",null,null,null,"Energy demand charges [R/kVA/m]",null,null,null,"Network capacity charges [R/kVA/m]"]
[null,null,null,null,null,null,null,"Transmission zone",null,"High demand season \n[Jun - Aug]",null,"Low demand season \n[Sep - May]",null,"High demand season \n[Jun - Aug]",null,"Low demand season \n[Sep - May]"]
[null,null,null,null,null,null,null,null,"Voltage"]
["Tariff","Tariff nameBillcode","Tx zone","Voltage","Billcode",null,null,null,null,"","VAT incl",null,"VAT incl","","VAT incl",null,"VAT incl",null,"VAT incl"]
["Nightsave Rural","NR",0,1,{"$f":"B8&C8&D8&IF($A$2=\"Non-municipal\",\"N\",IF($A$2=\"Municiple\",\"Y\",\"error\"))","v":"NR01N"},null,null,"≤ 300km","< 500V",70.290000000000006,{"$f":"ROUND(J8 * (1 + VAT), 2)","v":80.13},54.62,{"$f":"ROUND(L8 * (1 + VAT), 2)","v":62.27},235.53,{"$f":"ROUND(N8 * (1 + VAT), 2)","v":268.5},124.66,{"$f":"ROUND(P8 * (1 + VAT), 2)","v":142.11000000000001},11.91,{"$f":"ROUND(R8 * (1 + VAT), 2)","v":13.58}]
["Nightsave Rural","NR",0,2,{"$f":"B9&C9&D9&IF($A$2=\"Non-municipal\",\"N\",IF($A$2=\"Municiple\",\"Y\",\"error\"))","v":"NR02N"},null,null,null,"≥ 500V & ≤ 22kV",69.47,79.2,54.01,61.57,228.23,260.18,120.23,137.06,10.94,12.47]
["Nightsave Rural","NR",null,null,"NRN",null,null,null,null,0,null,0,null,0,0,0,0,0]
["Nightsave Rural","NR",null,null,"NRN",null,null,null,null,0,null,0,null,0,0,0,0,0]
["Nightsave Rural","NR",1,1,"NR11N",null,null,"> 300km and \n≤ 600km","< 500V",70.989999999999995,80.930000000000007,55.17,62.89,238.37,271.74,126.39,144.08000000000001,11.94,13.61]
["Nightsave Rural","NR",1,2,"NR12N",null,null,null,"≥ 500V & ≤ 22kV",70.180000000000007,80.010000000000005,54.55,62.19,231.02,263.36,121.9,138.97,10.99,12.53]
["Nightsave Rural","NR",null,null,"NRN",null,null,null,null,0,null,0,null,0,0,0,0,0]
["Nightsave Rural","NR",null,null,"NRN",null,null,null,null,0,null,0,null,0,0,0,0,0]
["Nightsave Rural","NR",2,1,"NR21N",null,null,"> 600km and \n≤ 900km","< 500V",71.7,81.739999999999995,55.71,63.51,241.23,275,128.09,146.02000000000001,12.05,13.74]
["Nightsave Rural","NR",2,2,"NR22N",null,null,null,"≥ 500V & ≤ 22kV",70.87,80.790000000000006,55.1,62.81,233.79,266.52,123.59,140.88999999999999,11.06,12.61]
["Nightsave Rural","NR",null,null,"NRN",null,null,null,null,0,null,0,null,0,0,0,0,0]
["Nightsave Rural","NR",null,null,"NRN",null,null,null,null,0,null,0,null,0,0,0,0,0]
["Nightsave Rural","NR",3,1,"NR31N",null,null,"> 900km","< 500V",72.41,82.55,56.27,64.150000000000006,244.16,{"$f":"ROUND(N20 * (1 + VAT), 2)","v":278.33999999999997},129.86000000000001,{"$f":"ROUND(P20 * (1 + VAT), 2)","v":148.04},12.08,13.77]
["Nightsave Rural","NR",3,2,"NR32N",null,null,null,"≥ 500V & ≤ 22kV",71.56,81.58,55.63,63.42,236.64,269.77,125.32,142.86000000000001,11.08,12.63]
[]
[]
[]
[]
[null,null,null,null,null,null,null,"Customer categories",null,"Service charge  \n[R/account/day]",null,"Administration charge  [R/POD/day]"]
[]
["Tariff","Tariff nameBillcode","Tx zone","Voltage","Billcode",null,null,null,null,null,"VAT incl",null,"VAT incl"]
["Nightsave Rural","NR",0,1,{"$f":"B29&C29&D29&IF($A$2=\"Non-municipal\",\"N\",IF($A$2=\"Municiple\",\"Y\",\"error\"))","v":"NR01N"},null,null,"≤ 100 kVA",null,16.37,{"$f":"ROUND(J29 * (1 + VAT), 2)","v":18.66},4.6500000000000004,{"$f":"ROUND(L29 * (1 + VAT), 2)","v":5.3}]
["Nightsave Rural","NR",0,1,"NR01N",null,null,"> 100 kVA & ≤ 500 kVA",null,55.83,{"$f":"ROUND(J30 * (1 + VAT), 2)","v":63.65},25.89,{"$f":"ROUND(L30 * (1 + VAT), 2)","v":29.51},null,null,"Ancillary service charge [c/kWh]",null,"Network demand charge [c/kWh]  in all time-of-use periods"]
["Nightsave Rural","NR",0,1,"NR01N",null,null,"> 500 kVA & ≤ 1 MVA",null,171.77,{"$f":"ROUND(J31 * (1 + VAT), 2)","v":195.82},39.729999999999997,{"$f":"ROUND(L31 * (1 + VAT), 2)","v":45.29},null,"Voltage",null,"VAT incl",null,"VAT incl"]
["Nightsave Rural","NR",0,1,"NR01N",null,null,"> 1 MVA",null,171.77,{"$f":"ROUND(J32 * (1 + VAT), 2)","v":195.82},73.72,{"$f":"ROUND(L32 * (1 + VAT), 2)","v":84.04},null,"< 500V",0.37,{"$f":"ROUND(P32 * (1 + VAT), 2)","v":0.42},23.69,{"$f":"ROUND(R32 * (1 + VAT), 2)","v":27.01}]
["Nightsave Rural","NR",0,1,"NR01N",null,null,"Key customers",null,3366.46,{"$f":"ROUND(J33 * (1 + VAT), 2)","v":3837.76},73.72,{"$f":"ROUND(L33 * (1 + VAT), 2)","v":84.04},null,"≥ 500V & ≤ 22kV",0.37,{"$f":"ROUND(P33 * (1 + VAT), 2)","v":0.42},20.77,{"$f":"ROUND(R33 * (1 + VAT), 2)","v":23.68}]
["Nightsave Rural","NR",0,2,"NR02N"]

{"sheet":"Nightsave Rural Munic inc ","index":20,"n_rows":33,"n_cols":33,"rows_kept":33,"cut":false,"hidden":false,"merged":[[1,6,1,16],[1,17,1,18],[3,9,3,12],[3,13,3,16],[3,17,5,18],[4,7,6,7],[4,9,5,10],[4,11,5,12],[4,13,5,14],[4,15,5,16],[29,15,29,16],[29,17,29,18],[30,7,30,8],[7,7,10,7],[11,7,14,7],[15,7,18,7],[19,7,22,7],[25,7,26,8],[25,9,26,10],[25,11,26,12],[31,7,31,8],[32,7,32,8],[27,7,27,8],[28,7,28,8],[29,7,29,8]]}
[null,null,null,null,null,null,"Back to menu",null,null,null,null,null,null,null,null,null,null,null,{"$error":"#REF!"}]
["Municiple",null,null,null,null,null,"Nightsave Rural tariff",null,null,null,null,null,null,null,null,null,null,"Local authority",null,null,null,null,null,null,null,null,null,null,null,null,null,{"$f":"SUM(#REF!,#REF!,#REF!,#REF!,#REF!,#REF!,#REF!,#REF!,#REF!,#REF!,#REF!,#REF!,#REF!,#REF!,#REF!)","v":{"$error":"#REF!"}},"check value"]
[]
[null,null,null,null,null,null,null,null,null,"Active energy charge [c/kWh]",null,null,null,"Energy demand charges [R/kVA/m]",null,null,null,"Network capacity charges [R/kVA/m]"]
[null,null,null,null,null,null,null,"Transmission zone",null,"High demand season \n[Jun - Aug]",null,"Low demand season \n[Sep - May]",null,"High demand season \n[Jun - Aug]",null,"Low demand season \n[Sep - May]"]
[null,null,null,null,null,null,null,null,"Voltage"]
["Tariff","Tariff nameBillcode","Tx zone","Voltage","Billcode",null,null,null,null,"","VAT incl",null,"VAT incl","","VAT incl",null,"VAT incl",null,"VAT incl"]
["Nightsave Rural","NR",0,1,{"$f":"B8&C8&D8&IF($A$2=\"Non-municipal\",\"N\",IF($A$2=\"Municiple\",\"Y\",\"error\"))","v":"NR01Y"},null,null,"≤ 300km","< 500V",70.64,{"$f":"ROUND(J8 * (1 + VAT), 2)","v":80.53},54.89,{"$f":"ROUND(L8 * (1 + VAT), 2)","v":62.57},231.17,{"$f":"ROUND(N8 * (1 + VAT), 2)","v":263.52999999999997},122.36,{"$f":"ROUND(P8 * (1 + VAT), 2)","v":139.49},11.81,{"$f":"ROUND(R8 * (1 + VAT), 2)","v":13.46}]
["Nightsave Rural","NR",0,2,{"$f":"B9&C9&D9&IF($A$2=\"Non-municipal\",\"N\",IF($A$2=\"Municiple\",\"Y\",\"error\"))","v":"NR02Y"},null,null,null,"≥ 500V & ≤ 22kV",69.81,79.58,54.28,61.88,224.01,255.37,117.99,134.51,10.84,12.36]
["Nightsave Rural","NR",null,null,"NRY",null,null,null,null,0,null,0,null,0,0,0,0,0]
["Nightsave Rural","NR",null,null,"NRY",null,null,null,null,0,null,0,null,0,0,0,0,0]
["Nightsave Rural","NR",1,1,"NR11Y",null,null,"> 300km and \n≤ 600km","< 500V",71.349999999999994,81.34,55.45,63.21,233.98,266.74,124.05,141.41999999999999,11.83,13.49]
["Nightsave Rural","NR",1,2,"NR12Y",null,null,null,"≥ 500V & ≤ 22kV",70.5,80.37,54.82,62.49,226.75,258.5,119.64,136.38999999999999,10.88,12.4]
["Nightsave Rural","NR",null,null,"NRY",null,null,null,null,0,null,0,null,0,0,0,0,0]
["Nightsave Rural","NR",null,null,"NRY",null,null,null,null,0,null,0,null,0,0,0,0,0]
["Nightsave Rural","NR",2,1,"NR21Y",null,null,"> 600km and \n≤ 900km","< 500V",72.040000000000006,82.13,55.98,63.82,236.78,269.93,125.72,143.32,11.95,13.62]
["Nightsave Rural","NR",2,2,"NR22Y",null,null,null,"≥ 500V & ≤ 22kV",71.2,81.17,55.36,63.11,229.48,261.61,121.3,138.28,10.95,12.48]
["Nightsave Rural","NR",null,null,"NRY",null,null,null,null,0,null,0,null,0,0,0,0,0]
["Nightsave Rural","NR",null,null,"NRY",null,null,null,null,0,null,0,null,0,0,0,0,0]
["Nightsave Rural","NR",3,1,"NR31Y",null,null,"> 900km","< 500V",72.760000000000005,82.95,56.53,64.44,239.65,273.2,127.45,145.29,11.96,13.63]
["Nightsave Rural","NR",3,2,"NR32Y",null,null,null,"≥ 500V & ≤ 22kV",71.900000000000006,81.97,55.89,63.71,232.28,264.8,123,140.22,10.96,12.49]
[]
[]
[]
[]
[null,null,null,null,null,null,null,"Customer categories",null,"Service charge  \n[R/account/day]",null,"Administration charge  [R/POD/day]"]
[]
["Tariff","Tariff nameBillcode","Tx zone","Voltage","Billcode",null,null,null,null,null,"VAT incl",null,"VAT incl"]
["Nightsave Rural","NR",0,1,{"$f":"B29&C29&D29&IF($A$2=\"Non-municipal\",\"N\",IF($A$2=\"Municiple\",\"Y\",\"error\"))","v":"NR01Y"},null,null,"≤ 100 kVA",null,16,{"$f":"ROUND(J29 * (1 + VAT), 2)","v":18.239999999999998},4.54,{"$f":"ROUND(L29 * (1 + VAT), 2)","v":5.18}]
["Nightsave Rural","NR",0,1,{"$f":"B30&C30&D30&IF($A$2=\"Non-municipal\",\"N\",IF($A$2=\"Municiple\",\"Y\",\"error\"))","v":"NR01Y"},null,null,"> 100 kVA & ≤ 500 kVA",null,54.56,{"$f":"ROUND(J30 * (1 + VAT), 2)","v":62.2},25.29,{"$f":"ROUND(L30 * (1 + VAT), 2)","v":28.83},null,null,"Ancillary service charge [c/kWh]",null,"Network demand charge [c/kWh]  in all time-of-use periods"]
["Nightsave Rural","NR",0,1,{"$f":"B31&C31&D31&IF($A$2=\"Non-municipal\",\"N\",IF($A$2=\"Municiple\",\"Y\",\"error\"))","v":"NR01Y"},null,null,"> 500 kVA & ≤ 1 MVA",null,167.83,{"$f":"ROUND(J31 * (1 + VAT), 2)","v":191.33},38.81,{"$f":"ROUND(L31 * (1 + VAT), 2)","v":44.24},null,"Voltage",null,"VAT incl",null,"VAT incl"]
["Nightsave Rural","NR",0,1,{"$f":"B32&C32&D32&IF($A$2=\"Non-municipal\",\"N\",IF($A$2=\"Municiple\",\"Y\",\"error\"))","v":"NR01Y"},null,null,"> 1 MVA",null,167.83,{"$f":"ROUND(J32 * (1 + VAT), 2)","v":191.33},72.03,{"$f":"ROUND(L32 * (1 + VAT), 2)","v":82.11},null,"< 500V",0.36,{"$f":"ROUND(P32 * (1 + VAT), 2)","v":0.41},23.49,{"$f":"ROUND(R32 * (1 + VAT), 2)","v":26.78}]
["Nightsave Rural","NR",0,1,{"$f":"B33&C33&D33&IF($A$2=\"Non-municipal\",\"N\",IF($A$2=\"Municiple\",\"Y\",\"error\"))","v":"NR01Y"},null,null,"Key customers",null,3289.03,{"$f":"ROUND(J33 * (1 + VAT), 2)","v":3749.49},72.03,{"$f":"ROUND(L33 * (1 + VAT), 2)","v":82.11},null,"≥ 500V & ≤ 22kV",0.36,{"$f":"ROUND(P33 * (1 + VAT), 2)","v":0.41},20.56,{"$f":"ROUND(R33 * (1 + VAT), 2)","v":23.44}]

{"sheet":"Ruraflex inc","index":21,"n_rows":34,"n_cols":33,"rows_kept":34,"cut":false,"hidden":false,"merged":[[3,21,5,22],[7,7,10,7],[1,6,1,16],[1,17,1,18],[1,19,1,22],[3,9,3,20],[4,7,6,7],[4,9,4,14],[4,15,4,20],[5,9,5,10],[5,11,5,12],[5,13,5,14],[5,15,5,16],[5,17,5,18],[5,19,5,20],[28,7,28,8],[28,14,28,15],[11,7,14,7],[15,7,18,7],[19,7,22,7],[25,7,26,8],[25,9,26,10],[25,11,26,12],[25,16,25,17],[25,18,25,19],[26,14,26,15],[27,7,27,8],[27,14,27,15],[32,7,32,8],[29,7,29,8],[30,7,30,8],[30,14,30,17],[31,7,31,8],[31,14,31,15],[31,16,31,17]]}
[null,null,null,null,null,null,"Back to menu"]
["Non-municipal",null,null,null,null,null,"Ruraflex tariff",null,null,null,null,null,null,null,null,null,null,null,null,"Non-local authority",null,null,null,null,null,null,null,null,null,null,null,{"$f":"SUM(#REF!,#REF!,#REF!,#REF!,#REF!,#REF!,#REF!,#REF!,#REF!,#REF!,#REF!,#REF!)","v":{"$error":"#REF!"}},"check value"]
[]
[null,null,null,null,null,null,null,null,null,"Active energy charge [c/kWh]",null,null,null,null,null,null,null,null,null,null,null,"Network capacity charges [R/kVA/m]"]
[null,null,null,null,null,null,null,"Transmission zone",null,"High demand season [Jun - Aug]",null,null,null,null,null,"Low demand season [Sep - May]"]
[null,null,null,null,null,null,null,null,"Voltage","Peak",null,"Standard",null,"Off Peak",null,"Peak",null,"Standard",null,"Off Peak"]
["Tariff","Tariff nameBillcode","Tx zone","Voltage","Billcode",null,null,null,null,"","VAT incl",null,"VAT incl",null,"VAT incl",null,"VAT incl",null,"VAT incl",null,"VAT incl",null,"VAT incl"]
["Ruraflex","Ru",0,1,{"$f":"B8&C8&D8&IF($A$2=\"Non-municipal\",\"N\",IF($A$2=\"Municiple\",\"Y\",\"error\"))","v":"Ru01N"},null,null,"≤ 300km","< 500V",288.2,{"$f":"ROUND(J8 * (1 + VAT), 2)","v":328.55},87.31,{"$f":"ROUND(L8 * (1 + VAT), 2)","v":99.53},47.42,{"$f":"ROUND(N8 * (1 + VAT), 2)","v":54.06},94.01,{"$f":"ROUND(P8 * (1 + VAT), 2)","v":107.17},64.7,{"$f":"ROUND(R8 * (1 + VAT), 2)","v":73.760000000000005},41.04,{"$f":"ROUND(T8 * (1 + VAT), 2)","v":46.79},16.64,{"$f":"ROUND(V8 * (1 + VAT), 2)","v":18.97}]
["Ruraflex","Ru",0,2,{"$f":"B9&C9&D9&IF($A$2=\"Non-municipal\",\"N\",IF($A$2=\"Municiple\",\"Y\",\"error\"))","v":"Ru02N"},null,null,null,"≥ 500V & ≤ 22kV",285.35000000000002,325.3,86.45,98.55,46.94,53.51,93.09,106.12,64.06,73.03,40.630000000000003,46.32,15.25,17.39]
["Ruraflex","Ru",null,null,"RuN",null,null,null,null,0,null,0,null,0,null,0,null,0,null,0,null,0]
["Ruraflex","Ru",null,null,"RuN",null,null,null,null,0,null,0,null,0,null,0,null,0,null,0,null,0]
["Ruraflex","Ru",1,1,"Ru11N",null,null,"> 300km and \n≤ 600km","< 500V",291.08999999999997,331.84,88.18,100.53,47.89,54.59,94.94,108.23,65.349999999999994,74.5,41.47,47.28,16.690000000000001,19.03]
["Ruraflex","Ru",1,2,"Ru12N",null,null,null,"≥ 500V & ≤ 22kV",288.19,328.54,87.3,99.52,47.42,54.06,94.01,107.17,64.69,73.75,41.04,46.79,15.35,17.5]
["Ruraflex","Ru",null,null,"RuN",null,null,null,null,0,null,0,null,0,null,0,null,0,null,0,null,0]
["Ruraflex","Ru",null,null,"RuN",null,null,null,null,0,null,0,null,0,null,0,null,0,null,0,null,0]
["Ruraflex","Ru",2,1,"Ru21N",null,null,"> 600km and \n≤ 900km","< 500V",294,335.16,89.07,101.54,48.36,55.13,95.9,109.33,66,75.239999999999995,41.88,47.74,16.78,19.13]
["Ruraflex","Ru",2,2,"Ru22N",null,null,null,"≥ 500V & ≤ 22kV",291.08,331.83,88.17,100.51,47.89,54.59,94.94,108.23,65.349999999999994,74.5,41.47,47.28,15.41,17.57]
["Ruraflex","Ru",null,null,"RuN",null,null,null,null,0,null,0,null,0,null,0,null,0,null,0,null,0]
["Ruraflex","Ru",null,null,"RuN",null,null,null,null,0,null,0,null,0,null,0,null,0,null,0,null,0]
["Ruraflex","Ru",3,1,"Ru31N",null,null,"> 900km","< 500V",296.93,338.5,89.96,102.55,48.84,55.68,96.84,110.4,66.650000000000006,75.98,42.3,48.22,16.850000000000001,19.21]
["Ruraflex","Ru",3,2,"Ru32N",null,null,null,"≥ 500V & ≤ 22kV",293.99,335.15,89.07,101.54,48.36,55.13,95.9,109.33,66,75.239999999999995,41.88,47.74,15.42,17.579999999999998]
[null,null,null,null,null,null,null,null,null,null,null,null,null,0]
[null,null,null,null,null,null,null,null,null,null,null,null,null,0]
[]
[]
[null,null,null,null,null,null,null,"Customer categories",null,"Service charge  [R/account/day]",null,"Administration charge  [R/POD/day]",null,null,null,null,"Ancillary service charge [c/kWh]",null,"Network demand charge [c/kWh]  in all time-of-use periods"]
[null,null,null,null,null,null,null,null,null,null,null,null,null,null,"Voltage",null,null,"VAT incl",null,"VAT incl"]
["Tariff","Tariff nameBillcode","Tx zone","Voltage","Billcode",null,null,null,null,null,"VAT incl",null,"VAT incl",null,"< 500V",null,0.37,{"$f":"ROUND(Q28 * (1 + VAT), 2)","v":0.42},23.69,{"$f":"ROUND(S28 * (1 + VAT), 2)","v":27.01}]
["Ruraflex","Ru",0,1,{"$f":"B29&C29&D29&IF($A$2=\"Non-municipal\",\"N\",IF($A$2=\"Municiple\",\"Y\",\"error\"))","v":"Ru01N"},null,null,"≤ 100 kVA",null,16.37,{"$f":"ROUND(J29 * (1 + VAT), 2)","v":18.66},4.6500000000000004,{"$f":"ROUND(L29 * (1 + VAT), 2)","v":5.3},null,"≥ 500V & < 22kV",null,0.37,{"$f":"ROUND(Q29 * (1 + VAT), 2)","v":0.42},20.77,{"$f":"ROUND(S29 * (1 + VAT), 2)","v":23.68}]
["Ruraflex","Ru",0,1,{"$f":"B30&C30&D30&IF($A$2=\"Non-municipal\",\"N\",IF($A$2=\"Municiple\",\"Y\",\"error\"))","v":"Ru01N"},null,null,"> 100 kVA & ≤ 500 kVA",null,55.83,{"$f":"ROUND(J30 * (1 + VAT), 2)","v":63.65},25.89,{"$f":"ROUND(L30 * (1 + VAT), 2)","v":29.51}]
["Ruraflex","Ru",0,1,{"$f":"B31&C31&D31&IF($A$2=\"Non-municipal\",\"N\",IF($A$2=\"Municiple\",\"Y\",\"error\"))","v":"Ru01N"},null,null,"> 500 kVA & ≤ 1 MVA",null,171.77,{"$f":"ROUND(J31 * (1 + VAT), 2)","v":195.82},39.729999999999997,{"$f":"ROUND(L31 * (1 + VAT), 2)","v":45.29},null,"Reactive energy charge  [c/kVArh]"]
["Ruraflex","Ru",0,1,{"$f":"B32&C32&D32&IF($A$2=\"Non-municipal\",\"N\",IF($A$2=\"Municiple\",\"Y\",\"error\"))","v":"Ru01N"},null,null,"> 1 MVA",null,171.77,{"$f":"ROUND(J32 * (1 + VAT), 2)","v":195.82},73.72,{"$f":"ROUND(L32 * (1 + VAT), 2)","v":84.04},null,"High season",null,"Low season"]
["Ruraflex","Ru",0,1,{"$f":"B33&C33&D33&IF($A$2=\"Non-municipal\",\"N\",IF($A$2=\"Municiple\",\"Y\",\"error\"))","v":"Ru01N"},null,null,"Key customers",null,3366.46,{"$f":"ROUND(J33 * (1 + VAT), 2)","v":3837.76},73.72,{"$f":"ROUND(L33 * (1 + VAT), 2)","v":84.04},null,null,"VAT incl",null,"VAT incl"]
[null,null,null,null,null,null,null,null,null,null,null,null,null,null,8,{"$f":"ROUND(O34 * (1 + VAT), 2)","v":9.1199999999999992},0,{"$f":"ROUND(Q34 * (1 + VAT), 2)","v":0}]

{"sheet":"Ruraflex Munic inc","index":22,"n_rows":34,"n_cols":33,"rows_kept":34,"cut":false,"hidden":false,"merged":[[3,21,5,22],[7,7,10,7],[1,6,1,16],[1,17,1,18],[1,19,1,22],[3,9,3,20],[4,7,6,7],[4,9,4,14],[4,15,4,20],[5,9,5,10],[5,11,5,12],[5,13,5,14],[5,15,5,16],[5,17,5,18],[5,19,5,20],[28,7,28,8],[28,14,28,15],[11,7,14,7],[15,7,18,7],[19,7,22,7],[25,7,26,8],[25,9,26,10],[25,11,26,12],[25,16,25,17],[25,18,25,19],[26,14,26,15],[27,7,27,8],[27,14,27,15],[32,7,32,8],[29,7,29,8],[30,7,30,8],[30,14,30,17],[31,7,31,8],[31,14,31,15],[31,16,31,17]]}
[null,null,null,null,null,null,"Back to menu"]
["Municiple",null,null,null,null,null,"Ruraflex tariff",null,null,null,null,null,null,null,null,null,null,null,null,"Local authority",null,null,null,null,null,null,null,null,null,null,null,{"$f":"SUM(#REF!,#REF!,#REF!,#REF!,#REF!,#REF!,#REF!,#REF!,#REF!,#REF!,#REF!,#REF!)","v":{"$error":"#REF!"}},"check value"]
[]
[null,null,null,null,null,null,null,null,null,"Active energy charge [c/kWh]",null,null,null,null,null,null,null,null,null,null,null,"Network capacity charges [R/kVA/m]"]
[null,null,null,null,null,null,null,"Transmission zone",null,"High demand season [Jun - Aug]",null,null,null,null,null,"Low demand season [Sep - May]"]
[null,null,null,null,null,null,null,null,"Voltage","Peak",null,"Standard",null,"Off Peak",null,"Peak",null,"Standard",null,"Off Peak"]
["Tariff","Tariff nameBillcode","Tx zone","Voltage","Billcode",null,null,null,null,"","VAT incl",null,"VAT incl",null,"VAT incl",null,"VAT incl",null,"VAT incl",null,"VAT incl",null,"VAT incl"]
["Ruraflex","Ru",0,1,{"$f":"B8&C8&D8&IF($A$2=\"Non-municipal\",\"N\",IF($A$2=\"Municiple\",\"Y\",\"error\"))","v":"Ru01Y"},null,null,"≤ 300km","< 500V",289.63,{"$f":"ROUND(J8 * (1 + VAT), 2)","v":330.18},87.73,{"$f":"ROUND(L8 * (1 + VAT), 2)","v":100.01},47.65,{"$f":"ROUND(N8 * (1 + VAT), 2)","v":54.32},94.48,{"$f":"ROUND(P8 * (1 + VAT), 2)","v":107.71},65.02,{"$f":"ROUND(R8 * (1 + VAT), 2)","v":74.12},41.25,{"$f":"ROUND(T8 * (1 + VAT), 2)","v":47.03},16.47,{"$f":"ROUND(V8 * (1 + VAT), 2)","v":18.78}]
["Ruraflex","Ru",0,2,{"$f":"B9&C9&D9&IF($A$2=\"Non-municipal\",\"N\",IF($A$2=\"Municiple\",\"Y\",\"error\"))","v":"Ru02Y"},null,null,null,"≥ 500V & ≤ 22kV",286.75,326.89999999999998,86.87,99.03,47.17,53.77,93.56,106.66,64.36,73.37,40.83,46.55,15.11,17.23]
["Ruraflex","Ru",null,null,"RuY",null,null,null,null,0,null,0,null,0,null,0,null,0,null,0,null,0]
["Ruraflex","Ru",null,null,"RuY",null,null,null,null,0,null,0,null,0,null,0,null,0,null,0,null,0]
["Ruraflex","Ru",1,1,"Ru11Y",null,null,"> 300km and \n≤ 600km","< 500V",292.51,333.46,88.62,101.03,48.1,54.83,95.41,108.77,65.67,74.86,41.67,47.5,16.54,18.86]
["Ruraflex","Ru",1,2,"Ru12Y",null,null,null,"≥ 500V & ≤ 22kV",289.62,330.17,87.72,100,47.65,54.32,94.48,107.71,65.010000000000005,74.11,41.25,47.03,15.2,17.329999999999998]
["Ruraflex","Ru",null,null,"RuY",null,null,null,null,0,null,0,null,0,null,0,null,0,null,0,null,0]
["Ruraflex","Ru",null,null,"RuY",null,null,null,null,0,null,0,null,0,null,0,null,0,null,0,null,0]
["Ruraflex","Ru",2,1,"Ru21Y",null,null,"> 600km and \n≤ 900km","< 500V",295.44,336.8,89.49,102.02,48.6,55.4,96.37,109.86,66.31,75.59,42.09,47.98,16.63,18.96]
["Ruraflex","Ru",2,2,"Ru22Y",null,null,null,"≥ 500V & ≤ 22kV",292.5,333.45,88.61,101.02,48.1,54.83,95.41,108.77,65.67,74.86,41.67,47.5,15.27,17.41]
["Ruraflex","Ru",null,null,"RuY",null,null,null,null,0,null,0,null,0,null,0,null,0,null,0,null,0]
["Ruraflex","Ru",null,null,"RuY",null,null,null,null,0,null,0,null,0,null,0,null,0,null,0,null,0]
["Ruraflex","Ru",3,1,"Ru31Y",null,null,"> 900km","< 500V",298.39999999999998,340.18,90.41,103.07,49.06,55.93,97.32,110.94,67,76.38,42.5,48.45,16.68,19.02]
["Ruraflex","Ru",3,2,"Ru32Y",null,null,null,"≥ 500V & ≤ 22kV",295.43,336.79,89.49,102.02,48.6,55.4,96.37,109.86,66.31,75.59,42.09,47.98,15.28,17.420000000000002]
[null,null,null,null,null,null,null,null,null,null,null,null,null,0]
[null,null,null,null,null,null,null,null,null,null,null,null,null,0]
[]
[]
[null,null,null,null,null,null,null,"Customer categories",null,"Service charge  [R/account/day]",null,"Administration charge  [R/POD/day]",null,null,null,null,"Ancillary service charge [c/kWh]",null,"Network demand charge [c/kWh]  in all time-of-use periods"]
[null,null,null,null,null,null,null,null,null,null,null,null,null,null,"Voltage",null,null,"VAT incl",null,"VAT incl"]
["Tariff","Tariff nameBillcode","Tx zone","Voltage","Billcode",null,null,null,null,null,"VAT incl",null,"VAT incl",null,"< 500V",null,0.36,{"$f":"ROUND(Q28 * (1 + VAT), 2)","v":0.41},23.49,{"$f":"ROUND(S28 * (1 + VAT), 2)","v":26.78}]
["Ruraflex","Ru",0,1,{"$f":"B29&C29&D29&IF($A$2=\"Non-municipal\",\"N\",IF($A$2=\"Municiple\",\"Y\",\"error\"))","v":"Ru01Y"},null,null,"≤ 100 kVA",null,16,{"$f":"ROUND(J29 * (1 + VAT), 2)","v":18.239999999999998},4.54,{"$f":"ROUND(L29 * (1 + VAT), 2)","v":5.18},null,"≥ 500V & < 22kV",null,0.36,{"$f":"ROUND(Q29 * (1 + VAT), 2)","v":0.41},20.56,{"$f":"ROUND(S29 * (1 + VAT), 2)","v":23.44}]
["Ruraflex","Ru",0,1,{"$f":"B30&C30&D30&IF($A$2=\"Non-municipal\",\"N\",IF($A$2=\"Municiple\",\"Y\",\"error\"))","v":"Ru01Y"},null,null,"> 100 kVA & ≤ 500 kVA",null,54.56,{"$f":"ROUND(J30 * (1 + VAT), 2)","v":62.2},25.29,{"$f":"ROUND(L30 * (1 + VAT), 2)","v":28.83}]
["Ruraflex","Ru",0,1,{"$f":"B31&C31&D31&IF($A$2=\"Non-municipal\",\"N\",IF($A$2=\"Municiple\",\"Y\",\"error\"))","v":"Ru01Y"},null,null,"> 500 kVA & ≤ 1 MVA",null,167.83,{"$f":"ROUND(J31 * (1 + VAT), 2)","v":191.33},38.81,{"$f":"ROUND(L31 * (1 + VAT), 2)","v":44.24},null,"Reactive energy charge  [c/kVArh]"]
["Ruraflex","Ru",0,1,{"$f":"B32&C32&D32&IF($A$2=\"Non-municipal\",\"N\",IF($A$2=\"Municiple\",\"Y\",\"error\"))","v":"Ru01Y"},null,null,"> 1 MVA",null,167.83,{"$f":"ROUND(J32 * (1 + VAT), 2)","v":191.33},72.03,{"$f":"ROUND(L32 * (1 + VAT), 2)","v":82.11},null,"High season",null,"Low season"]
["Ruraflex","Ru",0,1,{"$f":"B33&C33&D33&IF($A$2=\"Non-municipal\",\"N\",IF($A$2=\"Municiple\",\"Y\",\"error\"))","v":"Ru01Y"},null,null,"Key customers",null,3289.03,{"$f":"ROUND(J33 * (1 + VAT), 2)","v":3749.49},72.03,{"$f":"ROUND(L33 * (1 + VAT), 2)","v":82.11},null,null,"VAT incl",null,"VAT incl"]
[null,null,null,null,null,null,null,null,null,null,null,null,null,null,7.81,{"$f":"ROUND(O34 * (1 + VAT), 2)","v":8.9},0,{"$f":"ROUND(Q34 * (1 + VAT), 2)","v":0}]

{"sheet":"Ruraflex Gen inc","index":23,"n_rows":36,"n_cols":33,"rows_kept":36,"cut":false,"hidden":false,"merged":[[32,18,32,19],[29,7,29,8],[29,14,29,15],[34,7,34,8],[31,7,31,8],[32,7,32,8],[32,14,32,17],[33,7,33,8],[33,14,33,15],[33,16,33,17],[5,19,5,20],[30,7,30,8],[30,14,30,15],[11,7,14,7],[15,7,18,7],[19,7,22,7],[27,9,28,10],[27,11,28,12],[27,16,27,17],[25,16,26,17],[23,7,23,8],[27,7,27,8],[28,7,28,8],[1,19,1,23],[27,14,28,15],[7,7,10,7],[1,6,1,16],[1,17,1,18],[3,9,3,20],[3,21,3,22],[4,7,6,7],[4,9,4,14],[4,15,4,20],[4,21,5,22],[5,9,5,10],[5,11,5,12],[5,13,5,14],[5,15,5,16],[5,17,5,18]]}
[null,null,null,null,null,null,"Back to menu",null,null,null,null,null,null,null,null,null,null,null,null,null,null,null,{"$error":"#REF!"}]
["Non-municipal",null,null,null,null,null,"Ruraflex Gen tariff",null,null,null,null,null,null,null,null,null,null,null,null,"Non-local authority",null,null,null,null,null,null,null,null,null,null,null,{"$f":"SUM(#REF!,#REF!,#REF!,#REF!,#REF!,#REF!,#REF!,#REF!,#REF!,#REF!,#REF!,#REF!)","v":{"$error":"#REF!"}},"check value"]
[]
[null,null,null,null,null,null,null,null,null,"Active energy charge for loads [c/kWh]",null,null,null,null,null,null,null,null,null,null,null,"Network capacity charges [R/kVA/m]"]
[null,null,null,null,null,null,null,"Transmission zone",null,"High demand season [Jun - Aug]",null,null,null,null,null,"Low demand season [Sep - May]"]
[null,null,null,null,null,null,null,null,"Voltage","Peak",null,"Standard",null,"Off Peak",null,"Peak",null,"Standard",null,"Off Peak"]
["Tariff","Tariff nameBillcode","Tx zone","Voltage","Billcode",null,null,null,null,"","VAT incl",null,"VAT incl",null,"VAT incl",null,"VAT incl",null,"VAT incl",null,"VAT incl",null,"VAT incl"]
["Genflex rural","GR",0,1,{"$f":"B8&C8&D8&IF($A$2=\"Non-municipal\",\"N\",IF($A$2=\"Municiple\",\"Y\",\"error\"))","v":"GR01N"},null,null,"≤ 300km","< 500V",288.2,{"$f":"ROUND(J8 * (1 + VAT), 2)","v":328.55},87.31,{"$f":"ROUND(L8 * (1 + VAT), 2)","v":99.53},47.42,{"$f":"ROUND(N8 * (1 + VAT), 2)","v":54.06},94.01,{"$f":"ROUND(P8 * (1 + VAT), 2)","v":107.17},64.7,{"$f":"ROUND(R8 * (1 + VAT), 2)","v":73.760000000000005},41.04,{"$f":"ROUND(T8 * (1 + VAT), 2)","v":46.79},16.64,{"$f":"ROUND(V8 * (1 + VAT), 2)","v":18.97}]
["Genflex rural","GR",0,2,{"$f":"B9&C9&D9&IF($A$2=\"Non-municipal\",\"N\",IF($A$2=\"Municiple\",\"Y\",\"error\"))","v":"GR02N"},null,null,null,"≥ 500V & ≤ 22kV",285.35000000000002,325.3,86.45,98.55,46.94,53.51,93.09,106.12,64.06,73.03,40.630000000000003,46.32,15.25,17.39]
["Genflex rural","GR",null,null,"GRN",null,null,null,null,0,null,0,null,0,null,0,null,0,null,0,null,0]
["Genflex rural","GR",null,null,"GRN",null,null,null,null,0,null,0,null,0,null,0,null,0,null,0,null,0]
["Genflex rural","GR",1,1,"GR11N",null,null,"> 300km and \n≤ 600km","< 500V",291.08999999999997,331.84,88.18,100.53,47.89,54.59,94.94,108.23,65.349999999999994,74.5,41.47,47.28,16.690000000000001,19.03]
["Genflex rural","GR",1,2,"GR12N",null,null,null,"≥ 500V & ≤ 22kV",288.19,328.54,87.3,99.52,47.42,54.06,94.01,107.17,64.69,73.75,41.04,46.79,15.35,17.5]
["Genflex rural","GR",null,null,"GRN",null,null,null,null,0,null,0,null,0,null,0,null,0,null,0,null,0]
["Genflex rural","GR",null,null,"GRN",null,null,null,null,0,null,0,null,0,null,0,null,0,null,0,null,0]
["Genflex rural","GR",2,1,"GR21N",null,null,"> 600km and \n≤ 900km","< 500V",294,335.16,89.07,101.54,48.36,55.13,95.9,109.33,66,75.239999999999995,41.88,47.74,16.78,19.13]
["Genflex rural","GR",2,2,"GR22N",null,null,null,"≥ 500V & ≤ 22kV",291.08,331.83,88.17,100.51,47.89,54.59,94.94,108.23,65.349999999999994,74.5,41.47,47.28,15.41,17.57]
["Genflex rural","GR",null,null,"GRN",null,null,null,null,0,null,0,null,0,null,0,null,0,null,0,null,0]
["Genflex rural","GR",null,null,"GRN",null,null,null,null,0,null,0,null,0,null,0,null,0,null,0,null,0]
["Genflex rural","GR",3,1,"GR31N",null,null,"> 900km","< 500V",296.93,338.5,89.96,102.55,48.84,55.68,96.84,110.4,66.650000000000006,75.98,42.3,48.22,16.850000000000001,19.21]
["Genflex rural","GR",3,2,"GR32N",null,null,null,"≥ 500V & ≤ 22kV",293.99,335.15,89.07,101.54,48.36,55.13,95.9,109.33,66,75.239999999999995,41.88,47.74,15.42,17.579999999999998]
[null,null,null,null,null,null,null,null,null,null,null,null,null,0]
[null,null,null,null,null,null,null,null,null,null,null,null,null,0]
["Gen-purchase","NLPurchADJ",0,4,{"$f":"B24&C24&D24&IF($A$2=\"Non-municipal\",\"N\",IF($A$2=\"Municiple\",\"Y\",\"error\"))","v":"NLPurchADJ04N"}]
[]
[null,null,null,null,null,null,null,null,null,null,null,null,null,null,null,null,"Ancillary service charge for loads and generators"]
[]
[null,null,null,null,null,null,null,"Customer categories",null,"Service charge  [R/account/day]",null,"Administration charge  [R/POD/day]",null,null,"Voltage",null,"Ancillary service charge [c/kWh]"]
[null,null,null,null,null,null,null,"[kVA or MVA = loads]",null,null,null,null,null,null,null,null,null,"VAT incl"]
["Tariff","Tariff nameBillcode","Tx zone","Voltage","Billcode",null,null,"[kW or MW = generators]",null,null,"VAT incl",null,"VAT incl",null,"< 500V",null,0.37,{"$f":"ROUND(Q30 * (1 + VAT), 2)","v":0.42}]
["Genflex rural","GR",0,1,{"$f":"B31&C31&D31&IF($A$2=\"Non-municipal\",\"N\",IF($A$2=\"Municiple\",\"Y\",\"error\"))","v":"GR01N"},null,null,"≤ 100 kVA/kW",null,16.37,{"$f":"ROUND(J31 * (1 + VAT), 2)","v":18.66},4.6500000000000004,{"$f":"ROUND(L31 * (1 + VAT), 2)","v":5.3},null,"≥ 500V & < 22kV",null,0.37,{"$f":"ROUND(Q31 * (1 + VAT), 2)","v":0.42}]
["Genflex rural","GR",0,1,{"$f":"B32&C32&D32&IF($A$2=\"Non-municipal\",\"N\",IF($A$2=\"Municiple\",\"Y\",\"error\"))","v":"GR01N"},null,null,"> 100 KVA/kW & ≤ 500 kVA/kW",null,55.83,{"$f":"ROUND(J32 * (1 + VAT), 2)","v":63.65},25.89,{"$f":"ROUND(L32 * (1 + VAT), 2)","v":29.51}]
["Genflex rural","GR",0,1,{"$f":"B33&C33&D33&IF($A$2=\"Non-municipal\",\"N\",IF($A$2=\"Municiple\",\"Y\",\"error\"))","v":"GR01N"},null,null,"> 500 kVA/kW & ≤ 1 MVA/MW",null,171.77,{"$f":"ROUND(J33 * (1 + VAT), 2)","v":195.82},39.729999999999997,{"$f":"ROUND(L33 * (1 + VAT), 2)","v":45.29},null,"Reactive energy charge  [c/kVArh]",null,null,null,"Network demand charge [c/kWh] for loads  in all time-of-use periods\n"]
["Genflex rural","GR",0,1,{"$f":"B34&C34&D34&IF($A$2=\"Non-municipal\",\"N\",IF($A$2=\"Municiple\",\"Y\",\"error\"))","v":"GR01N"},null,null,"> 1 MVA/MW",null,171.77,{"$f":"ROUND(J34 * (1 + VAT), 2)","v":195.82},73.72,{"$f":"ROUND(L34 * (1 + VAT), 2)","v":84.04},null,"High season",null,"Low season",null,null,"VAT incl"]
["Genflex rural","GR",0,1,{"$f":"B35&C35&D35&IF($A$2=\"Non-municipal\",\"N\",IF($A$2=\"Municiple\",\"Y\",\"error\"))","v":"GR01N"},null,null,"Key customers",null,3366.46,{"$f":"ROUND(J35 * (1 + VAT), 2)","v":3837.76},73.72,{"$f":"ROUND(L35 * (1 + VAT), 2)","v":84.04},null,null,"VAT incl",null,"VAT incl",23.69,{"$f":"ROUND(S35 * (1 + VAT), 2)","v":27.01}]
[null,null,null,null,null,null,null,null,null,null,null,null,null,null,8,{"$f":"ROUND(O36 * (1 + VAT), 2)","v":9.1199999999999992},0,{"$f":"ROUND(Q36 * (1 + VAT), 2)","v":0},20.77,{"$f":"ROUND(S36 * (1 + VAT), 2)","v":23.68}]

{"sheet":"Landrate inc","index":24,"n_rows":14,"n_cols":19,"rows_kept":14,"cut":false,"hidden":false,"merged":[[3,17,3,18],[11,7,11,8],[3,9,3,10],[3,11,3,12],[3,13,3,14],[3,15,3,16],[5,7,5,8],[6,7,6,8],[7,7,7,8],[8,7,8,8],[9,7,9,8],[10,7,10,8]]}
[null,null,null,null,null,null,null,"Back to menu"]
["Non-municipal",null,null,null,null,null,null,"Landrate tariffs",null,null,null,null,null,null,null,null,null,"Non-local authority"]
[]
[null,null,null,null,null,null,null,null,null,"Energy charge [c/kWh]",null,"Ancillary service charge [c/kWh]",null,"Network demand charge [c/kWh]",null,"Network capacity charge \n[R/POD/day]",null,"Service charge  \n[R/POD/day]"]
["Tariff","Tariff nameBillcode","Tx zone","Voltage","Billcode",null,null,null,null,null,"VAT incl",null,"VAT incl",null,"VAT incl",null,"VAT incl",null,"VAT incl"]
["Landrate 1","L1",0,1,{"$f":"B6&C6&D6&IF($A$2=\"Non-municipal\",\"N\",IF($A$2=\"Municiple\",\"Y\",\"error\"))","v":"L101N"},null,null,"Landrate 1",null,94.83,{"$f":"ROUND(J6 * (1 + VAT), 2)","v":108.11},0.37,{"$f":"ROUND(L6 * (1 + VAT), 2)","v":0.42},23.69,{"$f":"ROUND(N6 * (1 + VAT), 2)","v":27.01},25.33,{"$f":"ROUND(P6 * (1 + VAT), 2)","v":28.88},21.03,{"$f":"ROUND(R6 * (1 + VAT), 2)","v":23.97}]
["Landrate 2","L2",0,1,{"$f":"B7&C7&D7&IF($A$2=\"Non-municipal\",\"N\",IF($A$2=\"Municiple\",\"Y\",\"error\"))","v":"L201N"},null,null,"Landrate 2",null,94.83,108.11,0.37,{"$f":"ROUND(L7 * (1 + VAT), 2)","v":0.42},23.69,{"$f":"ROUND(N7 * (1 + VAT), 2)","v":27.01},38.93,{"$f":"ROUND(P7 * (1 + VAT), 2)","v":44.38},21.03,{"$f":"ROUND(R7 * (1 + VAT), 2)","v":23.97}]
["Landrate 3","L3",0,1,"L301N",null,null,"Landrate 3",null,94.83,108.11,0.37,{"$f":"ROUND(L8 * (1 + VAT), 2)","v":0.42},23.69,{"$f":"ROUND(N8 * (1 + VAT), 2)","v":27.01},62.24,{"$f":"ROUND(P8 * (1 + VAT), 2)","v":70.95},21.03,{"$f":"ROUND(R8 * (1 + VAT), 2)","v":23.97}]
["Landrate 4","L4",0,1,"L401N",null,null,"Landrate 4",null,204.82,233.49,0.37,{"$f":"ROUND(L9 * (1 + VAT), 2)","v":0.42},23.69,{"$f":"ROUND(N9 * (1 + VAT), 2)","v":27.01},20.170000000000002,{"$f":"ROUND(P9 * (1 + VAT), 2)","v":22.99},0,{"$f":"ROUND(R9 * (1 + VAT), 2)","v":0}]
["Landlight","Lt",0,1,{"$f":"B10&C10&D10&IF($A$2=\"Non-municipal\",\"N\",IF($A$2=\"Municiple\",\"Y\",\"error\"))","v":"Lt01N"},null,null,"Landlight 20A",null,272.67,310.83999999999997]
[null,"Lt60",0,1,{"$f":"B11&C11&D11&IF($A$2=\"Non-municipal\",\"N\",IF($A$2=\"Municiple\",\"Y\",\"error\"))","v":"Lt6001N"},null,null,"Landlight 60A",null,351.51,400.72]
["Landrate Dx","Ld",0,1,"Ld01N",null,null,"Landrate Dx*",null,null,null,null,null,null,null,null,null,45.108699999999999,{"$f":"ROUND(R12 * (1 + VAT), 2)","v":51.42}]
[]
[null,null,null,null,null,null,null,"*R/day fixed charge inclusive of the following charges; energy, anciallary service, network demand, betwork capacity and service charge."]

{"sheet":"Landrate Munic inc","index":25,"n_rows":10,"n_cols":19,"rows_kept":10,"cut":false,"hidden":false,"merged":[[3,9,3,10],[3,11,3,12],[3,13,3,14],[3,15,3,16],[3,17,3,18],[5,7,5,8],[6,7,6,8],[7,7,7,8],[8,7,8,8],[9,7,9,8]]}
[null,null,null,null,null,null,null,"Back to menu"]
["Municiple",null,null,null,null,null,null,"Landrate tariffs",null,null,null,null,null,null,null,null,null,null,"Local authority"]
[]
[null,null,null,null,null,null,null,null,null,"Energy charge [c/kWh]",null,"Ancillary service charge [c/kWh]",null,"Network demand charge [c/kWh]",null,"Network capacity charge [R/POD/day]",null,"Service charge  [R/POD/day]"]
["Tariff","Tariff nameBillcode","Tx zone","Voltage","Billcode",null,null,null,null,null,"VAT incl",null,"VAT incl",null,"VAT incl",null,"VAT incl",null,"VAT incl"]
["Landrate 1","L1",0,1,{"$f":"B6&C6&D6&IF($A$2=\"Non-municipal\",\"N\",IF($A$2=\"Municiple\",\"Y\",\"error\"))","v":"L101Y"},null,null,"Landrate 1",null,95.29,{"$f":"ROUND(J6 * (1 + VAT), 2)","v":108.63},0.36,{"$f":"ROUND(L6 * (1 + VAT), 2)","v":0.41},23.49,{"$f":"ROUND(N6 * (1 + VAT), 2)","v":26.78},25.08,{"$f":"ROUND(P6 * (1 + VAT), 2)","v":28.59},20.54,{"$f":"ROUND(R6 * (1 + VAT), 2)","v":23.42}]
["Landrate 2","L2",0,1,{"$f":"B7&C7&D7&IF($A$2=\"Non-municipal\",\"N\",IF($A$2=\"Municiple\",\"Y\",\"error\"))","v":"L201Y"},null,null,"Landrate 2",null,95.29,{"$f":"ROUND(J7 * (1 + VAT), 2)","v":108.63},0.36,{"$f":"ROUND(L7 * (1 + VAT), 2)","v":0.41},23.49,{"$f":"ROUND(N7 * (1 + VAT), 2)","v":26.78},38.56,{"$f":"ROUND(P7 * (1 + VAT), 2)","v":43.96},20.54,{"$f":"ROUND(R7 * (1 + VAT), 2)","v":23.42}]
["Landrate 3","L3",0,1,"L301Y",null,null,"Landrate 3",null,95.29,{"$f":"ROUND(J8 * (1 + VAT), 2)","v":108.63},0.36,{"$f":"ROUND(L8 * (1 + VAT), 2)","v":0.41},23.49,{"$f":"ROUND(N8 * (1 + VAT), 2)","v":26.78},61.66,{"$f":"ROUND(P8 * (1 + VAT), 2)","v":70.290000000000006},20.54,{"$f":"ROUND(R8 * (1 + VAT), 2)","v":23.42}]
["Landrate 4","L4",0,1,"L401Y",null,null,"Landrate 4",null,205.82,{"$f":"ROUND(J9 * (1 + VAT), 2)","v":234.63},0.36,{"$f":"ROUND(L9 * (1 + VAT), 2)","v":0.41},23.49,{"$f":"ROUND(N9 * (1 + VAT), 2)","v":26.78},19.98,{"$f":"ROUND(P9 * (1 + VAT), 2)","v":22.78}]
["Landrate Dx","Ld",0,1,{"$f":"B10&C10&D10&IF($A$2=\"Non-municipal\",\"N\",IF($A$2=\"Municiple\",\"Y\",\"error\"))","v":"Ld01Y"},null,null,"Landrate Dx",null,null,null,null,null,null,null,null,null,44.436900000000001,{"$f":"ROUND(R10 * (1 + VAT), 2)","v":50.66}]

{"sheet":"Homeflex inc","index":26,"n_rows":14,"n_cols":30,"rows_kept":14,"cut":false,"hidden":false,"merged":[[3,9,3,10],[3,11,3,12],[3,13,3,14],[3,7,3,8],[5,3,6,3],[7,3,8,3],[9,3,10,3],[11,3,12,3],[1,1,1,8],[3,5,3,6]]}
[null,null,"Back to menu"]
[null,"Homeflex",null,null,null,null,null,null,null,null,null,null,null,null,"Non-local authority",null,null,null,null,null,null,null,null,null,null,null,null,null,{"$f":"SUM(F6,J6:J16,L6:N16)","v":429.95999999999992},"check value"]
[]
[null,null,null,null,null,"Peak energy charge [c/kWh]",null,"Off peak energy charge [c/kWh]",null,"Service & administration charge  [c/kWh]",null,"Network demand charge [c/kWh]",null,"Network capacity charge [R/POD/day]*"]
[null,null,null,null,null,null,"VAT incl",null,"VAT incl",null,"VAT incl",null,"VAT incl",null,"VAT incl"]
[null,null,null,"Homeflex 1","High Demand",293.52,{"$f":"ROUND(F6 * (1 + VAT), 2)","v":334.61},96.01,{"$f":"ROUND(H6 * (1 + VAT), 2)","v":109.45},4.8899999999999997,5.57,0,0,6.07,6.92]
[null,null,null,null,"Low Demand",113.75,{"$f":"ROUND(F7 * (1 + VAT), 2)","v":129.68},77.53,88.38,4.8899999999999997,5.57,0,0,6.07,6.92]
[null,null,null,"Homeflex 2","High Demand",293.52,334.61,96.01,109.45,4.8899999999999997,5.57,0,0,13.1,14.93]
[null,null,null,null,"Low Demand",113.75,129.68,77.53,88.38,4.8899999999999997,5.57,0,0,13.1,14.93]
[null,null,null,"Homeflex 3","High Demand",293.52,334.61,96.01,109.45,4.8899999999999997,5.57,0,0,26.39,30.08]
[null,null,null,null,"Low Demand",113.75,129.68,77.53,88.38,4.8899999999999997,5.57,0,0,26.39,30.08]
[null,null,null,"Homeflex 4","High Demand",293.52,334.61,96.01,109.45,4.8899999999999997,5.57,0,0,3.1,3.53]
[null,null,null,null,"Low Demand",113.75,129.68,77.53,88.38,4.8899999999999997,5.57,0,0,3.1,3.53]
[null,null,null,null,null,"*The Network capacity charge  is based on the Notified Maximum Demand (NMD)."]

{"sheet":"TOuS Original","index":27,"n_rows":109,"n_cols":14,"rows_kept":109,"cut":false,"hidden":true,"merged":[[103,12,103,13],[89,1,89,2],[90,1,90,2],[91,1,91,2],[93,1,93,3],[93,5,93,7],[103,10,104,11],[88,1,88,2],[73,3,74,4],[73,5,74,6],[73,7,74,8],[75,1,75,2],[76,1,79,2],[82,1,82,6],[83,1,85,2],[83,3,84,4],[83,5,84,6],[86,1,86,2],[87,1,87,2],[72,1,72,8],[56,3,57,4],[56,5,57,6],[58,1,58,2],[59,1,59,2],[60,1,60,2],[63,1,63,4],[64,3,65,4],[66,1,66,2],[67,1,67,2],[68,1,68,2],[69,1,69,2],[55,1,55,6],[35,1,42,1],[41,2,42,2],[45,1,45,8],[46,3,47,4],[46,5,47,6],[46,7,47,8],[48,1,48,2],[49,1,49,2],[50,1,50,2],[51,1,51,2],[52,1,52,2],[3,1,4,2],[3,3,3,4],[11,1,12,2],[11,3,11,4],[19,1,30,1],[28,2,30,2]]}
[]
[]
[]
[null,"Reliability service charge urban",null,"Charge\n[c/kWh]"]
[null,null,null,null,"VAT incl"]
[null,"< 500V",null,0.27,{"$f":"ROUND(D6 * (1 + VAT), 2)","v":0.31}]
[null,"≥ 500V & < 66kV",null,0.26,{"$f":"ROUND(D7 * (1 + VAT), 2)","v":0.3}]
[null,"≥ 66kV & ≤ 132kV",null,0.25,{"$f":"ROUND(D8 * (1 + VAT), 2)","v":0.28999999999999998}]
[null,"> 132kV",null,0.23,{"$f":"ROUND(D9 * (1 + VAT), 2)","v":0.26}]
[]
[]
[null,"Reliability service charge rural",null,"Charge                                           [c/kWh]"]
[null,null,null,null,"VAT incl"]
[null,"< 500V",null,0.27,{"$f":"ROUND(D14 * (1 + VAT), 2)","v":0.31}]
[null,"≥ 500V & ≤ 22kV",null,0.27,{"$f":"ROUND(D15 * (1 + VAT), 2)","v":0.31}]
[]
[]
[null,null,"Transmission zone","Voltage","R/kVA"]
[null,null,null,null,null,"VAT incl"]
[null,"ETUoS\nurban","≤ 300km","< 500V",11.364385961984476,{"$f":"ROUND(E20 * (1 + VAT), 2)","v":12.96}]
[null,null,null,"≥ 500V & < 66kV",11.194005362854275,12.76]
[null,null,null,"≥ 66kV & ≤ 132kV",10.836206104680851,12.35]
[null,null,"> 300km & ≤ 600km","< 500V",11.466614321462599,13.07]
[null,null,null,"≥ 500V & < 66kV",11.313271782245415,12.9]
[null,null,null,"≥ 66kV & ≤ 132kV",10.955472524071991,12.49]
[null,null,"> 600km & ≤ 900km","< 500V",11.585880740853739,13.21]
[null,null,null,"≥ 500V & < 66kV",11.432538201636557,13.03]
[null,null,null,"≥ 66kV & ≤ 132kV",11.057700883550114,12.61]
[null,null,"> 900km","< 500V",11.705147160244881,13.34]
[null,null,null,"≥ 500V & < 66kV",11.551804621027699,13.17]
[null,null,null,"≥ 66kV & ≤ 132kV",11.176967302941254,12.74]
[]
[]
[null,null,"Transmission zone","Voltage","R/kVA"]
[null,null,null,null,null,"VAT incl"]
[null,"ETUoS\nrural","≤ 300km","< 500V",11.773299399896962,{"$f":"ROUND(E36 * (1 + VAT), 2)","v":13.42}]
[null,null,null,"≥ 500V & < 66kV",11.671071040418839,13.31]
[null,null,"> 300km & ≤ 600km","< 500V",11.892565819288103,13.56]
[null,null,null,"≥ 500V & < 66kV",11.790337459809981,13.44]
[null,null,"> 600km & ≤ 900km","< 500V",12.011832238679244,13.69]
[null,null,null,"≥ 500V & < 66kV",11.909603879201123,13.58]
[null,null,"> 900km","< 500V",12.131098658070385,13.83]
[null,null,null,"≥ 500V & < 66kV",12.028870298592263,13.71]
[]
[]
[null,"Distribution network charges urban"]
[null,null,null,"Network access charge    [R/kVA/m]",null,"Network demand charge [R/kVA/m]",null,"Urban low voltage subsidy charge [R/kVA/m]"]
[]
[null,"Voltage ",null,null,"VAT incl",null,"VAT incl",null,"VAT incl"]
[null,"< 500V",null,{"$f":"#REF!","v":{"$error":"#REF!"}},{"$f":"ROUND(D50 * (1 + VAT), 2)","v":{"$error":"#REF!"}},{"$f":"#REF!","v":{"$error":"#REF!"}},{"$f":"ROUND(F50 * (1 + VAT), 2)","v":{"$error":"#REF!"}},{"$f":"#REF!","v":{"$error":"#REF!"}},{"$f":"ROUND(H50 * (1 + VAT), 2)","v":{"$error":"#REF!"}}]
[null,"≥ 500V & < 66kV",null,{"$f":"#REF!","v":{"$error":"#REF!"}},{"$f":"ROUND(D51 * (1 + VAT), 2)","v":{"$error":"#REF!"}},{"$f":"#REF!","v":{"$error":"#REF!"}},{"$f":"ROUND(F51 * (1 + VAT), 2)","v":{"$error":"#REF!"}},{"$f":"#REF!","v":{"$error":"#REF!"}},{"$f":"ROUND(H51 * (1 + VAT), 2)","v":{"$error":"#REF!"}}]
[null,"≥ 66kV & ≤ 132kV",null,{"$f":"#REF!","v":{"$error":"#REF!"}},{"$f":"ROUND(D52 * (1 + VAT), 2)","v":{"$error":"#REF!"}},{"$f":"#REF!","v":{"$error":"#REF!"}},{"$f":"ROUND(F52 * (1 + VAT), 2)","v":{"$error":"#REF!"}},{"$f":"#REF!","v":{"$error":"#REF!"}},{"$f":"ROUND(H52 * (1 + VAT), 2)","v":{"$error":"#REF!"}}]
[null,"> 132kV",null,{"$f":"#REF!","v":{"$error":"#REF!"}},{"$f":"ROUND(D53 * (1 + VAT), 2)","v":{"$error":"#REF!"}},{"$f":"#REF!","v":{"$error":"#REF!"}},{"$f":"ROUND(F53 * (1 + VAT), 2)","v":{"$error":"#REF!"}},{"$f":"#REF!","v":{"$error":"#REF!"}},{"$f":"ROUND(H53 * (1 + VAT), 2)","v":{"$error":"#REF!"}}]
[]
[]
[null,"Distribution network charges rural"]
[null,null,null,"Network access charge [R/kVA/m]",null,"Network demand charge [c/kWh]"]
[]
[null,"Voltage",null,null,"VAT incl",null,"VAT incl"]
[null,"< 500V",null,6.2016647953894406,{"$f":"ROUND(D60 * (1 + VAT), 2)","v":7.07},19.673247251813724,{"$f":"ROUND(F60 * (1 + VAT), 2)","v":22.43}]
[null,"≥ 500V & ≤ 22kV",null,2.2975559127207621,{"$f":"ROUND(D61 * (1 + VAT), 2)","v":2.62},17.238867254434076,{"$f":"ROUND(F61 * (1 + VAT), 2)","v":19.649999999999999}]
[]
[]
[null,"Distribution network charges for Generators"]
[null,null,null,"Network access charge    [R/MW/m]"]
[]
[null,"Voltage ",null,null,"VAT incl"]
[null,"< 500V"]
[null,"≥ 500V & < 66kV"]
[null,"≥ 66kV & ≤ 132kV",null,9.4,{"$f":"ROUND(D70 * (1 + VAT), 2)","v":10.72}]
[]
[]
[null,"Electrification and rural network subsidy charge [c/kWh]"]
[null,null,null,"Rural network subsidy charge            [c/kWh]",null,"Electrification networks subsidy charge  [c/kWh]",null,"Total electrification and rural network subsidy charge [c/kWh]"]
[]
[null,"Tariff",null,null,"VAT incl",null,"VAT incl",null,"VAT incl"]
[null,"Megaflex, Miniflex, Nightsave Urban Large, Nightsave Urban Small, Businessrate \n"]
[null,null,null,2.68,{"$f":"ROUND(D78 * (1 + VAT), 2)","v":3.06},0.91,{"$f":"ROUND(F78 * (1 + VAT), 2)","v":1.04},3.59,{"$f":" ROUND(H78 * (1 + VAT), 2)","v":4.09}]
[]
[]
[]
[]
[null,"Service and admin charges"]
[null,"Customer categories",null,"Service charge  [R/account/day]",null,"Administration charge  [R/POD/day]"]
[]
[null,null,null,null,"VAT incl",null,"VAT incl"]
[null,"≤ 100 kVA",null,9.49,{"$f":"ROUND(D87 * (1 + VAT), 2)","v":10.82},2.08,{"$f":"ROUND(F87 * (1 + VAT), 2)","v":2.37}]
[null,"> 100 kVA & ≤ 500 kVA",null,43.38,{"$f":"ROUND(D88 * (1 + VAT), 2)","v":49.45},12.16,{"$f":"ROUND(F88 * (1 + VAT), 2)","v":13.86}]
[null,"> 500 kVA & ≤ 1 MVA",null,133.5,{"$f":"ROUND(D89 * (1 + VAT), 2)","v":152.19},24.17,{"$f":"ROUND(F89 * (1 + VAT), 2)","v":27.55}]
[null,"> 1 MVA",null,133.5,{"$f":"ROUND(D90 * (1 + VAT), 2)","v":152.19},60.17,{"$f":"ROUND(F90 * (1 + VAT), 2)","v":68.59}]
[null,"Key customers",null,2616.06,{"$f":"ROUND(D91 * (1 + VAT), 2)","v":2982.31},83.55,{"$f":"ROUND(F91 * (1 + VAT), 2)","v":95.25}]
[]
[]
[null,"Distribution loss factors",null,null,null,"Transmission loss factors for loads"]
[null,"Voltage","Urban\nloss factor","Rural\nloss factor",null,"Distance from\nJohannesburg","Zone","Loss\nfactor"]
[null,"< 500V",{"$f":"'Loss Factors'!O6","v":1.1111},{"$f":"'Loss Factors'!P6","v":1.1527000000000001},null,"0 to 300 km",0,{"$f":"'Loss Factors'!T6","v":1.0106999999999999}]
[null,"≥ 500V & < 66kV",{"$f":"'Loss Factors'!O7","v":1.0956999999999999},{"$f":"'Loss Factors'!P7","v":1.1412},null,"301 to 600 km",1,{"$f":"'Loss Factors'!T7","v":1.0207999999999999}]
[null,"≥ 66kV & ≤ 132kV",{"$f":"'Loss Factors'!O8","v":1.0610999999999999},null,null,"601 to 900 km",2,{"$f":"'Loss Factors'!T8","v":1.0309999999999999}]
[null,"> 132kV",{"$f":"'Loss Factors'!O9","v":1},null,null,"> 900 km",3,{"$f":"'Loss Factors'!T9","v":1.0412999999999999}]
[]
[]
[]
[]
[null,null,null,null,null,null,null,null,null,null,"TUoS  [ > 132kV]",null,"Charge\nR/kVA"]
[null,null,null,null,null,null,null,null,null,null,null,null,null,"VAT incl"]
[null,null,null,null,null,null,null,null,null,null,null,"≤ 300km",{"$f":"#REF!","v":{"$error":"#REF!"}},{"$f":"ROUND(M106 * (1 + VAT), 2)","v":{"$error":"#REF!"}}]
[null,null,null,null,null,null,null,null,null,null,null,"> 300km & ≤ 600km",{"$f":"#REF!","v":{"$error":"#REF!"}},{"$f":"ROUND(M107 * (1 + VAT), 2)","v":{"$error":"#REF!"}}]
[null,null,null,null,null,null,null,null,null,null,null,"> 600km & ≤ 900km",{"$f":"#REF!","v":{"$error":"#REF!"}},{"$f":"ROUND(M108 * (1 + VAT), 2)","v":{"$error":"#REF!"}}]
[null,null,null,null,null,null,null,null,null,null,null,"> 900km",{"$f":"#REF!","v":{"$error":"#REF!"}},{"$f":"ROUND(M109 * (1 + VAT), 2)","v":{"$error":"#REF!"}}]

{"sheet":"TUoS","index":28,"n_rows":68,"n_cols":13,"rows_kept":68,"cut":false,"hidden":false,"merged":[[2,7,2,13],[53,7,54,8],[53,9,53,10],[66,7,66,8],[15,9,17,10],[15,11,17,12],[45,9,45,10],[45,7,46,8],[5,7,5,10],[27,7,27,9],[24,7,24,8],[25,7,25,8],[22,7,22,8],[6,9,7,10],[8,7,8,8],[9,7,11,8],[14,7,14,12],[15,7,17,8],[18,7,18,8],[19,7,19,8],[20,7,20,8],[21,7,21,8],[23,7,23,8],[35,7,36,8],[35,9,36,9],[67,7,67,8],[63,9,63,10],[63,7,65,8]]}
[null,null,null,null,null,null,null,"Back to menu"]
["Non-municipal"]
[null,null,null,null,null,null,null," TUoS (Transmission use of system) charges\n(> 132 KV or direct Transmission connected) network charge for loads"]
[]
[]
[null,null,null,null,null,null,null,"Electrification and rural network subsidy charge\n [c/kWh]"]
[null,null,null,null,null,null,null,null,null,"Electrification and rural network subsidy charge [c/kWh]"]
[]
["Tariff","Tariff nameBillcode","Tx zone","Voltage","Billcode",null,null,"Tariff",null,null,"VAT incl"]
[null,null,null,null,null,null,null,"Megaflex, Miniflex, Nightsave Urban Large, Nightsave Urban Small, Businessrate \n"]
["Megaflex","Me",0,1,{"$f":"B11&C11&D11&IF($A$2=\"Non-municipal\",\"N\",IF($A$2=\"Municiple\",\"Y\",\"error\"))","v":"Me01N"},null,null,null,null,{"$f":"'Megaflex inc'!H46","v":7.08},8.07]
[]
[]
[]
[null,null,null,null,null,null,null,"Service and admin charges"]
[null,null,null,null,null,null,null,"Utilised capacity/maximum export capacity",null,"Service charge\n[R/account/day]",null,"Administration charge\n[R/POD/day]"]
[]
[]
[null,null,null,null,null,null,null,"[kVA/MVA = loads]"]
["Tariff","Tariff nameBillcode","Tx zone","Voltage","Billcode",null,null,"[kW/MW = generators]",null,null,"VAT incl",null,"VAT incl"]
["Miniflex","Mi",0,1,{"$f":"B21&C21&D21&IF($B$28=\"Non-municipal\",\"N\",IF($B$28=\"Municiple\",\"Y\",\"error\"))","v":"Mi01N"},null,null,"≤ 100 kVA/kW",null,12.92,14.73,2.84,3.24]
["Miniflex","Mi",0,1,{"$f":"B22&C22&D22&IF($B$28=\"Non-municipal\",\"N\",IF($B$28=\"Municiple\",\"Y\",\"error\"))","v":"Mi01N"},null,null,"> 100 kVA/kW & ≤ 500 kVA/kW",null,59.03,67.290000000000006,16.55,18.87]
["Miniflex","Mi",0,1,"Mi01N",null,null,"> 500 kVA/kW & ≤ 1 MVA/MW",null,181.66,207.09,32.880000000000003,37.479999999999997]
["Miniflex","Mi",0,1,"Mi01N",null,null,"> 1 MVA/MW",null,181.66,207.09,81.87,93.33]
["Miniflex","Mi",0,1,"Mi01N",null,null,"Key customers or Transmission connected generators",null,3559.79,4058.16,113.69,129.61000000000001]
[]
[]
[null,"Non-municipal",null,null,null,null,null,"Transmission loss factors for loads"]
["Tariff","Tariff nameBillcode","Tx zone","Voltage","Billcode",null,null,"Distance from\nJohannesburg","Zone","Loss\nfactor"]
["Transmission loss factor","TxLoss",0,4,{"$f":"B30&C30&D30&IF($B$28=\"Non-municipal\",\"N\",IF($B$28=\"Municiple\",\"Y\",\"error\"))","v":"TxLoss04N"},null,null,"≤ 300km",0,1.0106999999999999]
["Transmission loss factor","TxLoss",1,4,{"$f":"B31&C31&D31&IF($B$28=\"Non-municipal\",\"N\",IF($B$28=\"Municiple\",\"Y\",\"error\"))","v":"TxLoss14N"},null,null,"> 300km & ≤ 600km",1,1.0207999999999999]
["Transmission loss factor","TxLoss",2,4,{"$f":"B32&C32&D32&IF($B$28=\"Non-municipal\",\"N\",IF($B$28=\"Municiple\",\"Y\",\"error\"))","v":"TxLoss24N"},null,null,"> 600km & ≤ 900km",2,1.0309999999999999]
["Transmission loss factor","TxLoss",3,4,{"$f":"B33&C33&D33&IF($B$28=\"Non-municipal\",\"N\",IF($B$28=\"Municiple\",\"Y\",\"error\"))","v":"TxLoss34N"},null,null,"> 900km",3,1.0412999999999999]
[]
[]
[null,null,null,null,null,null,null,"Loss factors for Transmission connected generators",null,"Loss factor"]
["Tariff","Tariff nameBillcode","Tx zone","Voltage","Billcode"]
["TUoS network charges for Transmission connected generators","GenTUOS","Cape",4,{"$f":"B38&C38&D38&IF($A$2=\"Non-municipal\",\"N\",IF($A$2=\"Municiple\",\"Y\",\"error\"))","v":"GenTUOSCape4N"},null,null,null,"Cape",{"$f":"'Loss Factors'!P14","v":0.97099999999999997}]
["TUoS network charges for Transmission connected generators","GenTUOS","Karoo",4,"GenTUOSKaroo4N",null,null,null,"Karoo",{"$f":"'Loss Factors'!P15","v":0.995}]
["TUoS network charges for Transmission connected generators","GenTUOS","Kwazulu-Natal",4,"GenTUOSKwazulu-Natal4N",null,null,null,"Kwazulu-Natal",{"$f":"'Loss Factors'!P16","v":1.004}]
["TUoS network charges for Transmission connected generators","GenTUOS","Vaal",4,"GenTUOSVaal4N",null,null,null,"Vaal",{"$f":"'Loss Factors'!P17","v":1.02}]
["TUoS network charges for Transmission connected generators","GenTUOS","Waterburg",4,"GenTUOSWaterburg4N",null,null,null,"Waterberg",{"$f":"'Loss Factors'!P18","v":1.0229999999999999}]
["TUoS network charges for Transmission connected generators","GenTUOS","Mpumalanga",4,"GenTUOSMpumalanga4N",null,null,null,"Mpumalanga",{"$f":"'Loss Factors'!P19","v":1.0209999999999999}]
[]
[]
[null,null,null,null,null,null,null,"TUoS network charge for Transmission connected loads",null,"Network capacity charge\n[R/kVA]"]
["Tariff","Tariff nameBillcode","Tx zone","Voltage","Billcode",null,null,null,null,null,"VAT incl"]
["WEPS","We",0,1,{"$f":"B48&C48&D48&IF($A$2=\"Non-municipal\",\"N\",IF($A$2=\"Municiple\",\"Y\",\"error\"))","v":"We01N"},null,null,null,"≤ 300km",{"$f":"'WEPS inc'!V11","v":8.9499999999999993},10.199999999999999]
["WEPS","We",0,2,"We02N",null,null,null,"> 300km & ≤ 600km",{"$f":"'WEPS inc'!V15","v":9.0399999999999991},10.31]
["WEPS","We",0,3,"We03N",null,null,null,"> 600km & ≤ 900km",{"$f":"'WEPS inc'!V19","v":9.17},10.45]
["WEPS","We",0,4,"We04N",null,null,null,"> 900km",{"$f":"'WEPS inc'!V23","v":9.24},10.53]
[]
[]
[null,null,null,null,null,null,null,"TUoS network charges for Transmission connected generators",null,"Network charge\n[R/kW]"]
["Tariff","Tariff nameBillcode","Tx zone","Voltage","Billcode",null,null,null,null,null,"VAT incl"]
["TUoS network charges for Transmission connected generators","GenTUOS","Cape",4,{"$f":"B56&C56&D56&IF($A$2=\"Non-municipal\",\"N\",IF($A$2=\"Municiple\",\"Y\",\"error\"))","v":"GenTUOSCape4N"},null,null,null,"Cape",0,0]
["TUoS network charges for Transmission connected generators","GenTUOS","Karoo",4,"GenTUOSKaroo4N",null,null,null,"Karoo",0,0]
["TUoS network charges for Transmission connected generators","GenTUOS","Kwazulu-Natal",4,"GenTUOSKwazulu-Natal4N",null,null,null,"Kwazulu-Natal",1.88,2.14]
["TUoS network charges for Transmission connected generators","GenTUOS","Vaal",4,"GenTUOSVaal4N",null,null,null,"Vaal",6.26,7.14]
["TUoS network charges for Transmission connected generators","GenTUOS","Waterburg",4,"GenTUOSWaterburg4N",null,null,null,"Waterberg",8.02,9.14]
["TUoS network charges for Transmission connected generators","GenTUOS","Mpumalanga",4,"GenTUOSMpumalanga4N",null,null,null,"Mpumalanga",7.44,8.48]
[]
[]
[null,null,null,null,null,null,null,"TUoS ancillary service charge for Transmission connected loads and generators",null,"Ancillary service charge\n[c/kWh]"]
[]
["Tariff","Tariff nameBillcode","Tx zone","Voltage","Billcode",null,null,null,null,null,"VAT incl"]
["TUoS network charges for Transmission connected generators","GenTUOS","Cape",4,{"$f":"B67&C67&D67&IF($A$2=\"Non-municipal\",\"N\",IF($A$2=\"Municiple\",\"Y\",\"error\"))","v":"GenTUOSCape4N"},null,null,"Generators",null,0.32,0.36]
["TUoS network charges for Transmission connected generators","GenTUOS","Cape",4,{"$f":"B68&C68&D68&IF($A$2=\"Non-municipal\",\"N\",IF($A$2=\"Municiple\",\"Y\",\"error\"))","v":"GenTUOSCape4N"},null,null,"Loads",null,0.32,0.36]

{"sheet":"DUoS","index":29,"n_rows":125,"n_cols":21,"rows_kept":125,"cut":false,"hidden":false,"merged":[[99,11,101,12],[102,7,102,8],[108,7,108,8],[103,7,103,8],[104,7,104,8],[105,7,105,8],[106,7,106,8],[107,7,107,8],[66,7,66,10],[69,7,69,8],[70,7,70,8],[71,7,71,8],[72,7,72,8],[67,9,68,10],[49,9,50,10],[61,7,61,8],[59,11,60,12],[58,7,58,12],[59,9,60,10],[49,11,50,12],[51,7,51,8],[31,8,33,8],[22,7,33,7],[62,7,62,8],[63,7,63,8],[55,7,55,8],[54,7,54,8],[110,7,110,9],[110,11,110,13],[76,13,77,14],[79,17,82,18],[76,19,77,20],[79,7,82,8],[96,7,96,8],[86,7,88,8],[92,7,92,8],[93,7,93,8],[85,7,85,12],[78,7,78,8],[90,7,90,8],[98,7,98,12],[99,7,101,8],[99,9,101,10],[94,7,94,8],[95,7,95,8],[91,7,91,8],[89,7,89,8],[76,11,77,12],[76,9,77,10],[76,17,78,18],[74,17,75,20],[74,7,75,14],[3,7,3,13],[86,9,88,10],[86,11,88,12],[48,7,48,14],[38,7,45,7],[44,8,45,8],[52,7,52,8],[53,7,53,8],[49,13,50,14],[6,9,6,10],[6,7,7,8],[14,7,15,8],[14,9,14,10]]}
[]
["Non-Municipal",null,null,null,null,null,null,"Back to menu"]
[]
[null,null,null,null,null,null,null,"DUoS (Distribution use of system) charges"]
[]
[]
[null,null,null,null,null,null,null,"DuoS ancillary service charge Urbanp",null,"Charge\n[c/kWh]"]
["Tariff","Tariff nameBillcode","Tx zone","Voltage","Billcode",null,null,null,null,null,"VAT incl"]
["Gen-DUoS urban","NEGenDUoSU",0,1,{"$f":"B9&C9&D9&IF($A$2=\"Non-municipal\",\"N\",IF($A$2=\"Municiple\",\"Y\",\"error\"))","v":"NEGenDUoSU01N"},null,null,"< 500V",null,0.37,{"$f":"ROUND(J9 * (1 + VAT), 2)","v":0.42}]
["Gen-DUoS urban","NEGenDUoSU",0,2,{"$f":"B10&C10&D10&IF($A$2=\"Non-municipal\",\"N\",IF($A$2=\"Municiple\",\"Y\",\"error\"))","v":"NEGenDUoSU02N"},null,null,"≥ 500V & < 66kV",null,0.36,{"$f":"ROUND(J10 * (1 + VAT), 2)","v":0.41}]
["Gen-DUoS urban","NEGenDUoSU",0,3,"NEGenDUoSU03N",null,null,"≥ 66kV & ≤ 132kV",null,0.34,{"$f":"ROUND(J11 * (1 + VAT), 2)","v":0.39}]
[]
[]
[]
[null,null,null,null,null,null,null,"DUoS ancillary service charge Ruralp",null,"Charge                                           [c/kWh]"]
["Tariff","Tariff nameBillcode","Tx zone","Voltage","Billcode",null,null,null,null,null,"VAT incl"]
["Gen-DUoS rural","NEGenDUoSR",0,1,{"$f":"B17&C17&D17&IF($A$2=\"Non-municipal\",\"N\",IF($A$2=\"Municiple\",\"Y\",\"error\"))","v":"NEGenDUoSR01N"},null,null,"< 500V",null,0.37,{"$f":"ROUND(J17 * (1 + VAT), 2)","v":0.42}]
["Gen-DUoS rural","NEGenDUoSR",0,2,{"$f":"B18&C18&D18&IF($A$2=\"Non-municipal\",\"N\",IF($A$2=\"Municiple\",\"Y\",\"error\"))","v":"NEGenDUoSR02N"},null,null,"≥ 500V & ≤ 22kV",null,0.37,{"$f":"ROUND(J18 * (1 + VAT), 2)","v":0.42}]
[]
[]
[null,null,null,null,null,null,null,null,"Transmission zone","Voltage","[R/kVA]"]
["Tariff","Tariff nameBillcode","Tx zone","Voltage","Billcode",null,null,null,null,null,null,"VAT incl"]
[null,null,null,null,null,null,null,"ETUoS\nurban","≤ 300km","< 500V",{"$f":"'Megaflex inc'!V8","v":7.96},{"$f":"ROUND(K23 * (1 + VAT), 2)","v":9.07}]
[null,null,null,null,null,null,null,null,null,"≥ 500V & < 66kV",{"$f":"'Megaflex inc'!V9","v":7.28},8.3000000000000007]
[null,null,null,null,null,null,null,null,null,"≥ 66kV & ≤ 132kV",{"$f":"'Megaflex inc'!V10","v":7.09},8.08]
[null,null,null,null,null,null,null,null,"> 300km & ≤ 600km","< 500V",{"$f":"'Megaflex inc'!V12","v":8.02},9.14]
[null,null,null,null,null,null,null,null,null,"≥ 500V & < 66kV",{"$f":"'Megaflex inc'!V13","v":7.35},8.3800000000000008]
[null,null,null,null,null,null,null,null,null,"≥ 66kV & ≤ 132kV",{"$f":"'Megaflex inc'!V14","v":7.14},8.14]
[null,null,null,null,null,null,null,null,"> 600km & ≤ 900km","< 500V",{"$f":"'Megaflex inc'!V16","v":8.1199999999999992},9.26]
[null,null,null,null,null,null,null,null,null,"≥ 500V & < 66kV",{"$f":"'Megaflex inc'!V17","v":7.41},8.4499999999999993]
[null,null,null,null,null,null,null,null,null,"≥ 66kV & ≤ 132kV",{"$f":"'Megaflex inc'!V18","v":7.18},8.19]
[null,null,null,null,null,null,null,null,"> 900km","< 500V",{"$f":"'Megaflex inc'!V20","v":8.16},9.3000000000000007]
[null,null,null,null,null,null,null,null,null,"≥ 500V & < 66kV",{"$f":"'Megaflex inc'!V21","v":7.5},8.5500000000000007]
[null,null,null,null,null,null,null,null,null,"≥ 66kV & ≤ 132kV",{"$f":"'Megaflex inc'!V22","v":7.25},8.27]
[]
[]
[null,null,null,null,null,null,null,null,"Transmission zone","Voltage","[R/kVA]"]
["Tariff","Tariff nameBillcode","Tx zone","Voltage","Billcode",null,null,null,null,null,null,"VAT incl"]
[null,null,null,null,null,null,null,"ETUoS\nrural","≤ 300km","< 500V",{"$f":"'Ruraflex inc'!V8","v":16.64},{"$f":"ROUND(K39 * (1 + VAT), 2)","v":18.97}]
[null,null,null,null,null,null,null,null,null,"≥ 500V & < 66kV",{"$f":"'Ruraflex inc'!V9","v":15.25},17.39]
[null,null,null,null,null,null,null,null,"> 300km & ≤ 600km","< 500V",{"$f":"'Ruraflex inc'!V12","v":16.690000000000001},19.03]
[null,null,null,null,null,null,null,null,null,"≥ 500V & < 66kV",{"$f":"'Ruraflex inc'!V13","v":15.35},17.5]
[null,null,null,null,null,null,null,null,"> 600km & ≤ 900km","< 500V",{"$f":"'Ruraflex inc'!V16","v":16.78},19.13]
[null,null,null,null,null,null,null,null,null,"≥ 500V & < 66kV",{"$f":"'Ruraflex inc'!V17","v":15.41},17.57]
[null,null,null,null,null,null,null,null,"> 900km","< 500V",{"$f":"'Ruraflex inc'!V20","v":16.850000000000001},19.21]
[null,null,null,null,null,null,null,null,null,"≥ 500V & < 66kV",{"$f":"'Ruraflex inc'!V21","v":15.42},17.579999999999998]
[]
[]
[null,null,null,null,null,null,null,"DUoS network charges for urbanp loads"]
[null,null,null,null,null,null,null,null,null,"Network capacity charge    [R/kVA/m]",null,"Network demand charge \n[R/kVA/m]",null,"Urban low voltage subsidy charge [R/kVA/m]"]
[]
["Tariff","Tariff nameBillcode","Tx zone","Voltage","Billcode",null,null,"Voltage ",null,null,"VAT incl",null,"VAT incl",null,"VAT incl"]
["Gen-DUoS urban","NEGenDUoSU",0,1,{"$f":"B53&C53&D53&IF($A$2=\"Non-municipal\",\"N\",IF($A$2=\"Municiple\",\"Y\",\"error\"))","v":"NEGenDUoSU01N"},null,null,"< 500V",null,{"$f":"'Megaflex inc'!J30","v":15.82},{"$f":"ROUND(J53 * (1 + VAT), 2)","v":18.03},{"$f":"'Megaflex inc'!L30","v":30},{"$f":"ROUND(L53 * (1 + VAT), 2)","v":34.200000000000003},{"$f":"'Megaflex inc'!N30","v":0},{"$f":"ROUND(N53 * (1 + VAT), 2)","v":0}]
["Gen-DUoS urban","NEGenDUoSU",0,2,{"$f":"B54&C54&D54&IF($A$2=\"Non-municipal\",\"N\",IF($A$2=\"Municiple\",\"Y\",\"error\"))","v":"NEGenDUoSU02N"},null,null,"≥ 500V & < 66kV",null,{"$f":"'Megaflex inc'!J31","v":14.51},{"$f":"ROUND(J54 * (1 + VAT), 2)","v":16.54},{"$f":"'Megaflex inc'!L31","v":27.52},{"$f":"ROUND(L54 * (1 + VAT), 2)","v":31.37},{"$f":"'Megaflex inc'!N31","v":0},{"$f":"ROUND(N54 * (1 + VAT), 2)","v":0}]
["Gen-DUoS urban","NEGenDUoSU",0,3,"NEGenDUoSU03N",null,null,"≥ 66kV & ≤ 132kV",null,{"$f":"'Megaflex inc'!J32","v":5.18},{"$f":"ROUND(J55 * (1 + VAT), 2)","v":5.91},{"$f":"'Megaflex inc'!L32","v":9.6},{"$f":"ROUND(L55 * (1 + VAT), 2)","v":10.94},{"$f":"'Megaflex inc'!N32","v":12.78},{"$f":"ROUND(N55 * (1 + VAT), 2)","v":14.57}]
["Gen-DUoS urban","NEGenDUoSU",0,4,{"$f":"B56&C56&D56&IF($A$2=\"Non-municipal\",\"N\",IF($A$2=\"Municiple\",\"Y\",\"error\"))","v":"NEGenDUoSU04N"},null,null,"> 132kV",null,{"$f":"'Megaflex inc'!J33","v":0},{"$f":"ROUND(J56 * (1 + VAT), 2)","v":0},{"$f":"'Megaflex inc'!L33","v":0},{"$f":"ROUND(L56 * (1 + VAT), 2)","v":0},{"$f":"'Megaflex inc'!N33","v":12.78},{"$f":"ROUND(N56 * (1 + VAT), 2)","v":14.57}]
[]
[]
[null,null,null,null,null,null,null,"DUoS network charges ruralp loads"]
[null,null,null,null,null,null,null,null,null,"Network capacity charge [R/kVA/m]",null,"Network demand charge [c/kWh]"]
[]
["Tariff","Tariff nameBillcode","Tx zone","Voltage","Billcode",null,null,"Voltage",null,null,"VAT incl",null,"VAT incl"]
["Gen-DUoS rural","NEGenDUoSR",0,1,{"$f":"B63&C63&D63&IF($A$2=\"Non-municipal\",\"N\",IF($A$2=\"Municiple\",\"Y\",\"error\"))","v":"NEGenDUoSR01N"},null,null,"< 500V",null,{"$f":"'Ruraflex inc'!V8","v":16.64},{"$f":"ROUND(J63 * (1 + VAT), 2)","v":18.97},{"$f":"'Ruraflex inc'!S28","v":23.69},{"$f":"ROUND(L63 * (1 + VAT), 2)","v":27.01}]
["Gen-DUoS rural","NEGenDUoSR",0,2,{"$f":"B64&C64&D64&IF($A$2=\"Non-municipal\",\"N\",IF($A$2=\"Municiple\",\"Y\",\"error\"))","v":"NEGenDUoSR02N"},null,null,"≥ 500V & ≤ 22kV",null,{"$f":"'Ruraflex inc'!V9","v":15.25},{"$f":"ROUND(J64 * (1 + VAT), 2)","v":17.39},{"$f":"'Ruraflex inc'!S29","v":20.77},{"$f":"ROUND(L64 * (1 + VAT), 2)","v":23.68}]
[]
[]
[null,null,null,null,null,null,null,"DUoS network charges for generators"]
[null,null,null,null,null,null,null,null,null,"Network capacity charge    [R/kW/m]"]
[]
["Tariff","Tariff nameBillcode","Tx zone","Voltage","Billcode",null,null,"Voltage ",null,null,"VAT incl"]
["Gen-DUoS urban","NEGenDUoSU",0,1,{"$f":"B71&C71&D71&IF($A$2=\"Non-municipal\",\"N\",IF($A$2=\"Municiple\",\"Y\",\"error\"))","v":"NEGenDUoSU01N"},null,null,"< 500V"]
["Gen-DUoS urban","NEGenDUoSU",0,2,{"$f":"B72&C72&D72&IF($A$2=\"Non-municipal\",\"N\",IF($A$2=\"Municiple\",\"Y\",\"error\"))","v":"NEGenDUoSU02N"},null,null,"≥ 500V & < 66kV"]
["Gen-DUoS urban","NEGenDUoSU",0,3,"NEGenDUoSU03N",null,null,"≥ 66kV & ≤ 132kV",null,12.8,{"$f":"ROUND(J73 * (1 + VAT), 2)","v":14.59}]
[]
[null,null,null,null,null,null,null,"DUoS electrification and rural network subsidy charge [c/kWh]",null,null,null,null,null,null,null,null,null,"DUoS electrification and rural network subsidy charge [c/kWh]"]
[]
[null,null,null,null,null,null,null,null,null,"Rural network subsidy charge            [c/kWh]",null,"Electrification networks subsidy charge [c/kWh]",null,"Total electrification and rural network subsidy charge [c/kWh]",null,null,null,"Tariff",null,"Electrification and rural network subsidy charge [c/kWh]"]
[]
["Tariff","Tariff nameBillcode","Tx zone","Voltage","Billcode",null,null,"Tariff",null,null,"VAT incl",null,"VAT incl",null,"VAT incl",null,null,null,null,null,"VAT incl"]
[null,null,null,null,null,null,null,"Megaflex, Miniflex, Nightsave Urban Large, Nightsave Urban Small, Businessrate \n",null,null,null,null,null,null,null,null,null,"Megaflex, Miniflex, Nightsave Urban Large, Nightsave Urban Small, Businessrate \n"]
["Megaflex","Me",0,1,{"$f":"B81&C81&D81&IF($A$2=\"Non-municipal\",\"N\",IF($A$2=\"Municiple\",\"Y\",\"error\"))","v":"Me01N"},null,null,null,null,4.7,{"$f":"ROUND(J81 * (1 + VAT), 2)","v":5.36},2.38,{"$f":"ROUND(L81 * (1 + VAT), 2)","v":2.71},{"$f":"SUM(J81, L81)","v":7.08},{"$f":" ROUND(N81 * (1 + VAT), 2)","v":8.07},null,null,null,null,7.08,{"$f":" ROUND(T81 * (1 + VAT), 2)","v":8.07}]
[0.66370106761565839]
[0.33629893238434161]
[]
[]
[null,null,null,null,null,null,null,"DUoS service and administration charges (urbanp )"]
[null,null,null,null,null,null,null,"Customer categories \nutilised capacity / maximum export capacity",null,"Service charge\n[R/account/day]",null,"Administration charge\n[R/POD/day]"]
[]
[]
[null,null,null,null,null,null,null,"[kVA or MVA = loads]"]
["Tariff","Tariff nameBillcode","Tx zone","Voltage","Billcode",null,null,"[kW or MW = generators]",null,null,"VAT incl",null,"VAT incl"]
["Miniflex","Mi",0,1,{"$f":"B92&C92&D92&IF($A$2=\"Non-municipal\",\"N\",IF($A$2=\"Municiple\",\"Y\",\"error\"))","v":"Mi01N"},null,null,"≤ 100 kVA/kW",null,12.92,{"$f":"ROUND(J92 * (1 + VAT), 2)","v":14.73},2.84,{"$f":"ROUND(L92 * (1 + VAT), 2)","v":3.24}]
["Miniflex","Mi",0,1,{"$f":"B93&C93&D93&IF($A$2=\"Non-municipal\",\"N\",IF($A$2=\"Municiple\",\"Y\",\"error\"))","v":"Mi01N"},null,null,"> 100 kVA/kW & ≤ 500 kVA/kW",null,59.03,{"$f":"ROUND(J93 * (1 + VAT), 2)","v":67.290000000000006},16.55,{"$f":"ROUND(L93 * (1 + VAT), 2)","v":18.87}]
["Miniflex","Mi",0,1,"Mi01N",null,null,"> 500 kVA/kW & ≤ 1 MVA/MW",null,181.66,{"$f":"ROUND(J94 * (1 + VAT), 2)","v":207.09},32.880000000000003,{"$f":"ROUND(L94 * (1 + VAT), 2)","v":37.479999999999997}]
["Miniflex","Mi",0,1,"Mi01N",null,null,"> 1 MVA/MW",null,181.66,{"$f":"ROUND(J95 * (1 + VAT), 2)","v":207.09},81.87,{"$f":"ROUND(L95 * (1 + VAT), 2)","v":93.33}]
["Miniflex","Mi",0,1,"Mi01N",null,null,"Key customers or Transmission connected",null,3559.79,{"$f":"ROUND(J96 * (1 + VAT), 2)","v":4058.16},113.69,{"$f":"ROUND(L96 * (1 + VAT), 2)","v":129.61000000000001}]
[]
[]
[null,null,null,null,null,null,null,"DUoS service and administration charges (ruralp)"]
[null,null,null,null,null,null,null,"Customer categories \nutilised capacity / maximum export capacity",null,"Service charge\n[R/account/day]",null,"Administration charge\n[R/POD/day]"]
[]
[]
[null,null,null,null,null,null,null,"[kVA or MVA = loads]"]
["Tariff","Tariff nameBillcode","Tx zone","Voltage","Billcode",null,null,"[kW or MW = generators]",null,null,"VAT incl",null,"VAT incl"]
["Ruraflex","Ru",0,1,{"$f":"B105&C105&D105&IF($A$2=\"Non-municipal\",\"N\",IF($A$2=\"Municiple\",\"Y\",\"error\"))","v":"Ru01N"},null,null,"≤ 100 kVA/kW",null,16.37,{"$f":"ROUND(J105 * (1 + VAT), 2)","v":18.66},4.6500000000000004,{"$f":"ROUND(L105 * (1 + VAT), 2)","v":5.3}]
["Ruraflex","Ru",0,1,{"$f":"B106&C106&D106&IF($A$2=\"Non-municipal\",\"N\",IF($A$2=\"Municiple\",\"Y\",\"error\"))","v":"Ru01N"},null,null,"> 100 kVA/kW & ≤ 500 kVA/kW",null,55.83,{"$f":"ROUND(J106 * (1 + VAT), 2)","v":63.65},25.89,{"$f":"ROUND(L106 * (1 + VAT), 2)","v":29.51}]
["Ruraflex","Ru",0,1,"Ru01N",null,null,"> 500 kVA/kW & ≤ 1 MVA/MW",null,171.77,{"$f":"ROUND(J107 * (1 + VAT), 2)","v":195.82},39.729999999999997,{"$f":"ROUND(L107 * (1 + VAT), 2)","v":45.29}]
["Ruraflex","Ru",0,1,"Ru01N",null,null,"> 1 MVA/MW",null,171.77,{"$f":"ROUND(J108 * (1 + VAT), 2)","v":195.82},73.72,{"$f":"ROUND(L108 * (1 + VAT), 2)","v":84.04}]
["Ruraflex","Ru",0,1,"Ru01N",null,null,"Key customers",null,3366.46,{"$f":"ROUND(J109 * (1 + VAT), 2)","v":3837.76},73.72,{"$f":"ROUND(L109 * (1 + VAT), 2)","v":84.04}]
[]
[null,null,null,null,null,null,null,"Distribution loss factors",null,null,null,"Transmission loss factors for loads"]
["Tariff","Tariff nameBillcode","Tx zone","Voltage","Billcode",null,null,"Voltage","Urbanp\nloss factor","Ruralp\nloss factor",null,"Distance from\nJohannesburg","Zone","Loss\nfactor"]
["Distribution loss factor - Urban","DxLossUrb",0,1,{"$f":"B113&C113&D113&IF($A$2=\"Non-municipal\",\"N\",IF($A$2=\"Municiple\",\"Y\",\"error\"))","v":"DxLossUrb01N"},null,null,"< 500V",1.1111,1.1527000000000001,null,"≤ 300km",0,1.0106999999999999]
["Distribution loss factor - Urban","DxLossUrb",0,2,{"$f":"B114&C114&D114&IF($A$2=\"Non-municipal\",\"N\",IF($A$2=\"Municiple\",\"Y\",\"error\"))","v":"DxLossUrb02N"},null,null,"≥ 500V & < 66kV",1.0956999999999999,1.1412,null,"> 300km & ≤ 600km",1,1.0207999999999999]
["Distribution loss factor - Urban","DxLossUrb",0,3,"DxLossUrb03N",null,null,"≥ 66kV & ≤ 132kV",1.0610999999999999,null,null,"> 600km & ≤ 900km",2,1.0309999999999999]
["Distribution loss factor - Urban","DxLossUrb",0,4,"DxLossUrb04N",null,null,"> 132kV",1,null,null,"> 900km",3,1.0412999999999999]
[]
["Distribution loss factor - Rural","DxLossRur",0,1,{"$f":"B118&C118&D118&IF($A$2=\"Non-municipal\",\"N\",IF($A$2=\"Municiple\",\"Y\",\"error\"))","v":"DxLossRur01N"}]
["Distribution loss factor - Rural","DxLossRur",0,2,{"$f":"B119&C119&D119&IF($A$2=\"Non-municipal\",\"N\",IF($A$2=\"Municiple\",\"Y\",\"error\"))","v":"DxLossRur02N"}]
[]
[]
["Transmission loss factor","TxLoss",0,4,{"$f":"B122&C122&D122&IF($A$2=\"Non-municipal\",\"N\",IF($A$2=\"Municiple\",\"Y\",\"error\"))","v":"TxLoss04N"}]
["Transmission loss factor","TxLoss",1,4,{"$f":"B123&C123&D123&IF($A$2=\"Non-municipal\",\"N\",IF($A$2=\"Municiple\",\"Y\",\"error\"))","v":"TxLoss14N"}]
["Transmission loss factor","TxLoss",2,4,"TxLoss24N"]
["Transmission loss factor","TxLoss",3,4,"TxLoss34N"]

{"sheet":"Loss Factors","index":30,"n_rows":19,"n_cols":38,"rows_kept":19,"cut":false,"hidden":false,"merged":[[1,13,1,19],[3,13,3,15],[3,17,3,19],[11,13,12,14],[11,15,12,15]]}
[null,null,null,null,null,null,null,null,null,null,null,null,null,"Back to menu",null,null,null,null,null,null,null,null,null,null,null,null,null,null,null,null,null,null,null,null,null,null,null,0.14000000000000001]
[null,null,null,null,null,null,null,null,null,null,null,null,null,"Loss factors"]
["Non-municipal"]
[null,null,null,null,null,null,null,null,null,null,null,null,null,"Distribution loss factors",null,null,null,"Transmission loss factors for loads"]
["Tariff","Tariff nameBillcode","Tx zone","Voltage","Billcode",null,"Tariff","Tariff nameBillcode","Tx zone","Voltage","Billcode",null,null,"Voltage","Urban\nloss factor","Rural\nloss factor",null,"Distance from\nJohannesburg","Zone","Loss\nfactor"]
["Distribution loss factor - Urban","DxLossUrb",0,1,{"$f":"B6&C6&D6&IF($A$3=\"Non-municipal\",\"N\",IF($A$3=\"Municiple\",\"Y\",\"error\"))","v":"DxLossUrb01N"},null,"Transmission loss factor","TxLoss",0,4,{"$f":"H6&I6&J6&IF($A$3=\"Non-municipal\",\"N\",IF($A$3=\"Municiple\",\"Y\",\"error\"))","v":"TxLoss04N"},null,null,"< 500V",1.1111,1.1527000000000001,null,"≤ 300km",0,1.0106999999999999]
["Distribution loss factor - Urban","DxLossUrb",0,2,{"$f":"B7&C7&D7&IF($A$3=\"Non-municipal\",\"N\",IF($A$3=\"Municiple\",\"Y\",\"error\"))","v":"DxLossUrb02N"},null,"Transmission loss factor","TxLoss",1,4,{"$f":"H7&I7&J7&IF($A$3=\"Non-municipal\",\"N\",IF($A$3=\"Municiple\",\"Y\",\"error\"))","v":"TxLoss14N"},null,null,"≥ 500V & < 66kV",1.0956999999999999,1.1412,null,"> 300km & ≤ 600km",1,1.0207999999999999]
["Distribution loss factor - Urban","DxLossUrb",0,3,{"$f":"B8&C8&D8&IF($A$3=\"Non-municipal\",\"N\",IF($A$3=\"Municiple\",\"Y\",\"error\"))","v":"DxLossUrb03N"},null,"Transmission loss factor","TxLoss",2,4,{"$f":"H8&I8&J8&IF($A$3=\"Non-municipal\",\"N\",IF($A$3=\"Municiple\",\"Y\",\"error\"))","v":"TxLoss24N"},null,null,"≥ 66kV & ≤ 132kV",1.0610999999999999,null,null,"> 600km & ≤ 900km",2,1.0309999999999999]
["Distribution loss factor - Urban","DxLossUrb",0,4,{"$f":"B9&C9&D9&IF($A$3=\"Non-municipal\",\"N\",IF($A$3=\"Municiple\",\"Y\",\"error\"))","v":"DxLossUrb04N"},null,"Transmission loss factor","TxLoss",3,4,{"$f":"H9&I9&J9&IF($A$3=\"Non-municipal\",\"N\",IF($A$3=\"Municiple\",\"Y\",\"error\"))","v":"TxLoss34N"},null,null,"> 132kV/Transmission connected",1,null,null,"> 900km",3,1.0412999999999999]
[]
["Distribution loss factor - Rural","DxLossRur",0,1,{"$f":"B11&C11&D11&IF($A$3=\"Non-municipal\",\"N\",IF($A$3=\"Municiple\",\"Y\",\"error\"))","v":"DxLossRur01N"},null,null,null,null,null,null,null,null,null,null,"2012/13"]
["Distribution loss factor - Rural","DxLossRur",0,2,{"$f":"B12&C12&D12&IF($A$3=\"Non-municipal\",\"N\",IF($A$3=\"Municiple\",\"Y\",\"error\"))","v":"DxLossRur02N"},null,null,null,null,null,null,null,null,"Loss factors for Transmission connected generators",null,"Loss factor"]
["Tariff","Tariff nameBillcode","Tx zone","Voltage","Billcode"]
["TUoS network charges for Transmission connected generators","GenTUOS","Cape",4,{"$f":"B14&C14&D14&IF($A$3=\"Non-municipal\",\"N\",IF($A$3=\"Municiple\",\"Y\",\"error\"))","v":"GenTUOSCape4N"},null,null,null,null,null,null,null,null,null,"Cape",0.97099999999999997]
["TUoS network charges for Transmission connected generators","GenTUOS","Karoo",4,"GenTUOSKaroo4N",null,null,null,null,null,null,null,null,null,"Karoo",0.995]
["TUoS network charges for Transmission connected generators","GenTUOS","Kwazulu-Natal",4,"GenTUOSKwazulu-Natal4N",null,null,null,null,null,null,null,null,null,"Kwazulu-Natal",1.004]
["TUoS network charges for Transmission connected generators","GenTUOS","Vaal",4,"GenTUOSVaal4N",null,null,null,null,null,null,null,null,null,"Vaal",1.02]
["TUoS network charges for Transmission connected generators","GenTUOS","Waterburg",4,"GenTUOSWaterburg4N",null,null,null,null,null,null,null,null,null,"Waterburg",1.0229999999999999]
["TUoS network charges for Transmission connected generators","GenTUOS","Mpumalanga",4,"GenTUOSMpumalanga4N",null,null,null,null,null,null,null,null,null,"Mpumalanga",1.0209999999999999]

{"sheet":"Excess NCC or MEC","index":31,"n_rows":59,"n_cols":40,"rows_kept":59,"cut":false,"hidden":false,"merged":[[11,36,14,36],[15,36,18,36],[19,36,22,36],[1,36,1,39],[3,38,3,39],[4,36,6,36],[4,38,5,39],[7,36,10,36],[49,24,49,26],[51,25,51,26],[51,19,51,20],[49,18,49,20],[4,32,5,33],[38,18,41,18],[38,24,41,24],[38,30,41,30],[42,18,45,18],[42,24,45,24],[42,30,45,30],[30,18,33,18],[30,24,33,24],[30,30,33,30],[34,18,37,18],[34,24,37,24],[34,30,37,30],[26,32,26,33],[27,18,29,18],[27,20,28,21],[27,24,29,24],[27,26,28,27],[27,30,29,30],[27,32,28,33],[19,18,22,18],[19,24,22,24],[19,30,22,30],[26,20,26,21],[26,26,26,27],[7,30,10,30],[11,18,14,18],[11,24,14,24],[11,30,14,30],[15,18,18,18],[15,24,18,24],[15,30,18,30],[1,18,1,21],[24,18,24,21],[1,23,1,27],[1,29,1,33],[24,23,24,27],[24,29,24,33],[3,20,3,21],[3,26,3,27],[3,32,3,33],[4,18,6,18],[4,20,5,21],[4,24,6,24],[4,26,5,27],[4,30,6,30],[7,18,10,18],[7,24,10,24]]}
[null,null,null,null,null,null,null,null,null,null,null,null,null,null,null,null,null,null,"Back to menu"]
["Non-municipal",null,null,null,null,null,null,null,null,null,null,null,null,null,null,null,null,null,"Urban - Excess NCC\nMegaflex\n[non local authorities]",null,null,null,null,"Urban - Excess NCC\nNightsave Urban Large\n[non local authorities]",null,null,null,null,null,"Urban - Excess NCC\nMiniflex\n[non local authorities]",null,null,null,null,null,null,"Urban - Excess NCC\nWEPS\n[non local authorities]"]
[]
[null,null,null,null,null,null,null,null,null,null,null,null,null,null,null,null,null,null,null,null,"Excess network charge [R/kVA/m]",null,null,null,null,null,"Excess network charge [R/kVA/m]",null,null,null,null,null,"Excess network charge [R/kVA/m]",null,null,null,null,null,"Excess network charge [R/kVA/m]"]
[null,null,null,null,null,null,null,null,null,null,null,null,null,null,null,null,null,null,"Transmission zone",null,null,null,null,null,"Transmission zone",null,null,null,null,null,"Transmission zone",null,null,null,null,null,"Transmission zone"]
[null,null,null,null,null,null,null,null,null,null,null,null,null,null,null,null,null,null,null,"Voltage",null,null,null,null,null,"Voltage",null,null,null,null,null,"Voltage",null,null,null,null,null,"Voltage"]
["Tariff","Tariff nameBillcode","Tx zone","Voltage","Billcode",null,"Tariff","Tariff nameBillcode","Tx zone","Voltage","Billcode",null,"Tariff","Tariff nameBillcode","Tx zone","Voltage","Billcode",null,null,null,null,"VAT incl",null,null,null,null,null,"VAT incl",null,null,null,null,null,"VAT incl",null,null,null,null,null,"VAT incl"]
["Excess NAC Megaflex","ExNACMe",0,1,{"$f":"B8&C8&D8&IF($A$2=\"Non-municipal\",\"N\",IF($A$2=\"Municiple\",\"Y\",\"error\"))","v":"ExNACMe01N"},null,"Excess NAC Nightsave Large","ExNACNL",0,1,{"$f":"H8&I8&J8&IF($A$2=\"Non-municipal\",\"N\",IF($A$2=\"Municiple\",\"Y\",\"error\"))","v":"ExNACNL01N"},null,"Excess NAC Miniflex","ExNACMi",0,1,{"$f":"N8&O8&P8&IF($A$2=\"Non-municipal\",\"N\",IF($A$2=\"Municiple\",\"Y\",\"error\"))","v":"ExNACMi01N"},null,"≤ 300km","< 500V",23.78,{"$f":"ROUND(U8 * (1 + VAT), 2)","v":27.11},null,null,"≤ 300km","< 500V",23.78,{"$f":"ROUND(AA8 * (1 + VAT), 2)","v":27.11},null,null,"≤ 300km","< 500V",23.76,{"$f":"ROUND(AG8 * (1 + VAT), 2)","v":27.09},null,null,"≤ 300km","< 500V",23.78,{"$f":"ROUND(AM8 * (1 + VAT), 2)","v":27.11}]
["Excess NAC Megaflex","ExNACMe",0,2,{"$f":"B9&C9&D9&IF($A$2=\"Non-municipal\",\"N\",IF($A$2=\"Municiple\",\"Y\",\"error\"))","v":"ExNACMe02N"},null,"Excess NAC Nightsave Large","ExNACNL",0,2,{"$f":"H9&I9&J9&IF($A$2=\"Non-municipal\",\"N\",IF($A$2=\"Municiple\",\"Y\",\"error\"))","v":"ExNACNL02N"},null,"Excess NAC Miniflex","ExNACMi",0,2,{"$f":"N9&O9&P9&IF($A$2=\"Non-municipal\",\"N\",IF($A$2=\"Municiple\",\"Y\",\"error\"))","v":"ExNACMi02N"},null,null,"≥ 500V & < 66kV",21.79,24.84,null,null,null,"≥ 500V & < 66kV",21.79,24.84,null,null,null,"≥ 500V & < 66kV",21.77,24.82,null,null,null,"≥ 500V & < 66kV",21.79,24.84]
["Excess NAC Megaflex","ExNACMe",0,3,"ExNACMe03N",null,"Excess NAC Nightsave Large","ExNACNL",0,3,"ExNACNL03N",null,"Excess NAC Miniflex","ExNACMi",0,3,"ExNACMi03N",null,null,"≥ 66kV & ≤ 132kV",25.05,28.56,null,null,null,"≥ 66kV & ≤ 132kV",25.05,28.56,null,null,null,"≥ 66kV & ≤ 132kV",25.009999999999998,28.51,null,null,null,"≥ 66kV & ≤ 132kV",25.05,28.56]
["Excess NAC Megaflex","ExNACMe",0,4,"ExNACMe04N",null,"Excess NAC Nightsave Large","ExNACNL",0,4,"ExNACNL04N",null,"Excess NAC Miniflex","ExNACMi",0,4,"ExNACMi04N",null,null,"> 132kV*",21.729999999999997,24.77,null,null,null,"> 132kV*",21.729999999999997,24.77,null,null,null,"> 132kV*",21.689999999999998,24.73,null,null,null,"> 132kV*",21.729999999999997,24.77]
["Excess NAC Megaflex","ExNACMe",1,1,"ExNACMe11N",null,"Excess NAC Nightsave Large","ExNACNL",1,1,"ExNACNL11N",null,"Excess NAC Miniflex","ExNACMi",1,1,"ExNACMi11N",null,"> 300km and \n≤ 600km","< 500V",23.84,27.18,null,null,"> 300km and \n≤ 600km","< 500V",23.84,27.18,null,null,"> 300km and \n≤ 600km","< 500V",23.81,27.14,null,null,"> 300km and \n≤ 600km","< 500V",23.84,27.18]
["Excess NAC Megaflex","ExNACMe",1,2,"ExNACMe12N",null,"Excess NAC Nightsave Large","ExNACNL",1,2,"ExNACNL12N",null,"Excess NAC Miniflex","ExNACMi",1,2,"ExNACMi12N",null,null,"≥ 500V & < 66kV",21.86,24.92,null,null,null,"≥ 500V & < 66kV",21.86,24.92,null,null,null,"≥ 500V & < 66kV",21.84,24.9,null,null,null,"≥ 500V & < 66kV",21.86,24.92]
["Excess NAC Megaflex","ExNACMe",1,3,"ExNACMe13N",null,"Excess NAC Nightsave Large","ExNACNL",1,3,"ExNACNL13N",null,"Excess NAC Miniflex","ExNACMi",1,3,"ExNACMi13N",null,null,"≥ 66kV & ≤ 132kV",25.1,28.61,null,null,null,"≥ 66kV & ≤ 132kV",25.1,28.61,null,null,null,"≥ 66kV & ≤ 132kV",25.06,28.57,null,null,null,"≥ 66kV & ≤ 132kV",25.1,28.61]
["Excess NAC Megaflex","ExNACMe",1,4,"ExNACMe14N",null,"Excess NAC Nightsave Large","ExNACNL",1,4,"ExNACNL14N",null,"Excess NAC Miniflex","ExNACMi",1,4,"ExNACMi14N",null,null,"> 132kV*",21.82,24.87,null,null,null,"> 132kV*",21.82,24.87,null,null,null,"> 132kV*",21.79,24.84,null,null,null,"> 132kV*",21.82,24.87]
["Excess NAC Megaflex","ExNACMe",2,1,"ExNACMe21N",null,"Excess NAC Nightsave Large","ExNACNL",2,1,"ExNACNL21N",null,"Excess NAC Miniflex","ExNACMi",2,1,"ExNACMi21N",null,"> 600km and \n≤ 900km","< 500V",23.939999999999998,27.29,null,null,"> 600km and \n≤ 900km","< 500V",23.939999999999998,27.29,null,null,"> 600km and \n≤ 900km","< 500V",23.93,27.28,null,null,"> 600km and \n≤ 900km","< 500V",23.939999999999998,27.29]
["Excess NAC Megaflex","ExNACMe",2,2,"ExNACMe22N",null,"Excess NAC Nightsave Large","ExNACNL",2,2,"ExNACNL22N",null,"Excess NAC Miniflex","ExNACMi",2,2,"ExNACMi22N",null,null,"≥ 500V & < 66kV",21.92,24.99,null,null,null,"≥ 500V & < 66kV",21.92,24.99,null,null,null,"≥ 500V & < 66kV",21.9,24.97,null,null,null,"≥ 500V & < 66kV",21.92,24.99]
["Excess NAC Megaflex","ExNACMe",2,3,"ExNACMe23N",null,"Excess NAC Nightsave Large","ExNACNL",2,3,"ExNACNL23N",null,"Excess NAC Miniflex","ExNACMi",2,3,"ExNACMi23N",null,null,"≥ 66kV & ≤ 132kV",25.14,28.66,null,null,null,"≥ 66kV & ≤ 132kV",25.14,28.66,null,null,null,"≥ 66kV & ≤ 132kV",25.13,28.65,null,null,null,"≥ 66kV & ≤ 132kV",25.14,28.66]
["Excess NAC Megaflex","ExNACMe",2,4,"ExNACMe24N",null,"Excess NAC Nightsave Large","ExNACNL",2,4,"ExNACNL24N",null,"Excess NAC Miniflex","ExNACMi",2,4,"ExNACMi24N",null,null,"> 132kV*",21.95,25.02,null,null,null,"> 132kV*",21.95,25.02,null,null,null,"> 132kV*",21.92,24.99,null,null,null,"> 132kV*",21.95,25.02]
["Excess NAC Megaflex","ExNACMe",3,1,"ExNACMe31N",null,"Excess NAC Nightsave Large","ExNACNL",3,1,"ExNACNL31N",null,"Excess NAC Miniflex","ExNACMi",3,1,"ExNACMi31N",null,"> 900km","< 500V",23.98,27.34,null,null,"> 900km","< 500V",23.98,27.34,null,null,"> 900km","< 500V",23.95,27.3,null,null,"> 900km","< 500V",23.98,27.34]
["Excess NAC Megaflex","ExNACMe",3,2,"ExNACMe32N",null,"Excess NAC Nightsave Large","ExNACNL",3,2,"ExNACNL32N",null,"Excess NAC Miniflex","ExNACMi",3,2,"ExNACMi32N",null,null,"≥ 500V & < 66kV",22.009999999999998,25.09,null,null,null,"≥ 500V & < 66kV",22.009999999999998,25.09,null,null,null,"≥ 500V & < 66kV",21.98,25.06,null,null,null,"≥ 500V & < 66kV",22.009999999999998,25.09]
["Excess NAC Megaflex","ExNACMe",3,3,"ExNACMe33N",null,"Excess NAC Nightsave Large","ExNACNL",3,3,"ExNACNL33N",null,"Excess NAC Miniflex","ExNACMi",3,3,"ExNACMi33N",null,null,"≥ 66kV & ≤ 132kV",25.21,28.74,null,null,null,"≥ 66kV & ≤ 132kV",25.21,28.74,null,null,null,"≥ 66kV & ≤ 132kV",25.18,28.71,null,null,null,"≥ 66kV & ≤ 132kV",25.21,28.74]
["Excess NAC Megaflex","ExNACMe",3,4,"ExNACMe34N",null,"Excess NAC Nightsave Large","ExNACNL",3,4,"ExNACNL34N",null,"Excess NAC Miniflex","ExNACMi",3,4,"ExNACMi34N",null,null,"> 132kV*",22.02,25.1,null,null,null,"> 132kV*",22.02,25.1,null,null,null,"> 132kV*",21.979999999999997,25.06,null,null,null,"> 132kV*",22.02,25.1]
[null,null,null,null,null,null,null,null,null,null,null,null,null,null,null,null,null,null,null,"* 132 kV or Transmission connected",null,null,null,null,null,"* 132 kV or Transmission connected",null,null,null,null,null,"* 132 kV or Transmission connected"]
[null,null,null,null,null,null,null,null,null,null,null,null,null,null,null,null,null,null,"Urban - Excess NCC\nNightsave Urban Small\n[non local authorities]",null,null,null,null,"Rural - Excess NCC\nNightsave Rural\n[non local authorities]",null,null,null,null,null,"Rural - Excess NCC\nRuraflex\n[non local authorities]"]
[]
[null,null,null,null,null,null,null,null,null,null,null,null,null,null,null,null,null,null,null,null,"Excess network charge [R/kVA/m]",null,null,null,null,null,"Excess network charge [R/kVA/m]",null,null,null,null,null,"Excess network charge [R/kVA/m]"]
[null,null,null,null,null,null,null,null,null,null,null,null,null,null,null,null,null,null,"Transmission zone",null,null,null,null,null,"Transmission zone",null,null,null,null,null,"Transmission zone"]
[null,null,null,null,null,null,null,null,null,null,null,null,null,null,null,null,null,null,null,"Voltage",null,null,null,null,null,"Voltage",null,null,null,null,null,"Voltage"]
["Tariff","Tariff nameBillcode","Tx zone","Voltage","Billcode",null,"Tariff","Tariff nameBillcode","Tx zone","Voltage","Billcode",null,"Tariff","Tariff nameBillcode","Tx zone","Voltage","Billcode",null,null,null,null,"VAT incl",null,null,null,null,null,"VAT incl",null,null,null,null,null,"VAT incl"]
["Excess NAC Nightsave Small","ExNACNS",0,1,{"$f":"B31&C31&D31&IF($A$2=\"Non-municipal\",\"N\",IF($A$2=\"Municiple\",\"Y\",\"error\"))","v":"ExNACNS01N"},null,"Excess NAC Nightsave Rural","ExNACNR",0,1,{"$f":"H31&I31&J31&IF($A$2=\"Non-municipal\",\"N\",IF($A$2=\"Municiple\",\"Y\",\"error\"))","v":"ExNACNR01N"},null,"Excess NAC Ruraflex","ExNACRu",0,1,{"$f":"N31&O31&P31&IF($A$2=\"Non-municipal\",\"N\",IF($A$2=\"Municiple\",\"Y\",\"error\"))","v":"ExNACRu01N"},null,"≤ 300km","< 500V",23.78,{"$f":"ROUND(U31 * (1 + VAT), 2)","v":27.11},null,null,"≤ 300km","< 500V",11.91,{"$f":"ROUND(AA31 * (1 + VAT), 2)","v":13.58},null,null,"≤ 300km","< 500V",16.64,{"$f":"ROUND(AG31 * (1 + VAT), 2)","v":18.97}]
["Excess NAC Nightsave Small","ExNACNS",0,2,{"$f":"B32&C32&D32&IF($A$2=\"Non-municipal\",\"N\",IF($A$2=\"Municiple\",\"Y\",\"error\"))","v":"ExNACNS02N"},null,"Excess NAC Nightsave Rural","ExNACNR",0,2,{"$f":"H32&I32&J32&IF($A$2=\"Non-municipal\",\"N\",IF($A$2=\"Municiple\",\"Y\",\"error\"))","v":"ExNACNR02N"},null,"Excess NAC Ruraflex","ExNACRu",0,2,{"$f":"N32&O32&P32&IF($A$2=\"Non-municipal\",\"N\",IF($A$2=\"Municiple\",\"Y\",\"error\"))","v":"ExNACRu02N"},null,null,"≥ 500V & < 66kV",21.79,24.84,null,null,null,"≥ 500V & ≤ 22kV",10.94,12.47,null,null,null,"≥ 500V & ≤ 22kV",15.25,17.39]
["Excess NAC Nightsave Small","ExNACNS",0,3,"ExNACNS03N",null,"Excess NAC Nightsave Rural","ExNACNR",0,3,"ExNACNR03N",null,"Excess NAC Ruraflex","ExNACRu",0,3,"ExNACRu03N",null,null,"≥ 66kV & ≤ 132kV",25.05,28.56]
["Excess NAC Nightsave Small","ExNACNS",0,4,"ExNACNS04N",null,"Excess NAC Nightsave Rural","ExNACNR",0,4,"ExNACNR04N",null,"Excess NAC Ruraflex","ExNACRu",0,4,"ExNACRu04N",null,null,"> 132kV*",21.729999999999997,24.77]
["Excess NAC Nightsave Small","ExNACNS",1,1,"ExNACNS11N",null,"Excess NAC Nightsave Rural","ExNACNR",1,1,"ExNACNR11N",null,"Excess NAC Ruraflex","ExNACRu",1,1,"ExNACRu11N",null,"> 300km and \n≤ 600km","< 500V",23.84,27.18,null,null,"> 300km and \n≤ 600km","< 500V",11.94,{"$f":"ROUND(AA35 * (1 + VAT), 2)","v":13.61},null,null,"> 300km and \n≤ 600km","< 500V",16.690000000000001,{"$f":"ROUND(AG35 * (1 + VAT), 2)","v":19.03}]
["Excess NAC Nightsave Small","ExNACNS",1,2,"ExNACNS12N",null,"Excess NAC Nightsave Rural","ExNACNR",1,2,"ExNACNR12N",null,"Excess NAC Ruraflex","ExNACRu",1,2,"ExNACRu12N",null,null,"≥ 500V & < 66kV",21.86,24.92,null,null,null,"≥ 500V & ≤ 22kV",10.99,12.53,null,null,null,"≥ 500V & ≤ 22kV",15.35,17.5]
["Excess NAC Nightsave Small","ExNACNS",1,3,"ExNACNS13N",null,"Excess NAC Nightsave Rural","ExNACNR",1,3,"ExNACNR13N",null,"Excess NAC Ruraflex","ExNACRu",1,3,"ExNACRu13N",null,null,"≥ 66kV & ≤ 132kV",25.1,28.61]
["Excess NAC Nightsave Small","ExNACNS",1,4,"ExNACNS14N",null,"Excess NAC Nightsave Rural","ExNACNR",1,4,"ExNACNR14N",null,"Excess NAC Ruraflex","ExNACRu",1,4,"ExNACRu14N",null,null,"> 132kV*",21.82,24.87]
["Excess NAC Nightsave Small","ExNACNS",2,1,"ExNACNS21N",null,"Excess NAC Nightsave Rural","ExNACNR",2,1,"ExNACNR21N",null,"Excess NAC Ruraflex","ExNACRu",2,1,"ExNACRu21N",null,"> 600km and \n≤ 900km","< 500V",23.939999999999998,27.29,null,null,"> 600km and \n≤ 900km","< 500V",12.05,{"$f":"ROUND(AA39 * (1 + VAT), 2)","v":13.74},null,null,"> 600km and \n≤ 900km","< 500V",16.78,{"$f":"ROUND(AG39 * (1 + VAT), 2)","v":19.13}]
["Excess NAC Nightsave Small","ExNACNS",2,2,"ExNACNS22N",null,"Excess NAC Nightsave Rural","ExNACNR",2,2,"ExNACNR22N",null,"Excess NAC Ruraflex","ExNACRu",2,2,"ExNACRu22N",null,null,"≥ 500V & < 66kV",21.92,24.99,null,null,null,"≥ 500V & ≤ 22kV",11.06,12.61,null,null,null,"≥ 500V & ≤ 22kV",15.41,17.57]
["Excess NAC Nightsave Small","ExNACNS",2,3,"ExNACNS23N",null,"Excess NAC Nightsave Rural","ExNACNR",2,3,"ExNACNR23N",null,"Excess NAC Ruraflex","ExNACRu",2,3,"ExNACRu23N",null,null,"≥ 66kV & ≤ 132kV",25.14,28.66]
["Excess NAC Nightsave Small","ExNACNS",2,4,"ExNACNS24N",null,"Excess NAC Nightsave Rural","ExNACNR",2,4,"ExNACNR24N",null,"Excess NAC Ruraflex","ExNACRu",2,4,"ExNACRu24N",null,null,"> 132kV*",21.95,25.02]
["Excess NAC Nightsave Small","ExNACNS",3,1,"ExNACNS31N",null,"Excess NAC Nightsave Rural","ExNACNR",3,1,"ExNACNR31N",null,"Excess NAC Ruraflex","ExNACRu",3,1,"ExNACRu31N",null,"> 900km","< 500V",23.98,27.34,null,null,"> 900km","< 500V",12.08,{"$f":"ROUND(AA43 * (1 + VAT), 2)","v":13.77},null,null,"> 900km","< 500V",16.850000000000001,{"$f":"ROUND(AG43 * (1 + VAT), 2)","v":19.21}]
["Excess NAC Nightsave Small","ExNACNS",3,2,"ExNACNS32N",null,"Excess NAC Nightsave Rural","ExNACNR",3,2,"ExNACNR32N",null,"Excess NAC Ruraflex","ExNACRu",3,2,"ExNACRu32N",null,null,"≥ 500V & < 66kV",22.009999999999998,25.09,null,null,null,"≥ 500V & ≤ 22kV",11.08,12.63,null,null,null,"≥ 500V & ≤ 22kV",15.42,17.579999999999998]
["Excess NAC Nightsave Small","ExNACNS",3,3,"ExNACNS33N",null,"Excess NAC Nightsave Rural","ExNACNR",3,3,"ExNACNR33N",null,"Excess NAC Ruraflex","ExNACRu",3,3,"ExNACRu33N",null,null,"≥ 66kV & ≤ 132kV",25.21,28.74]
["Excess NAC Nightsave Small","ExNACNS",3,4,"ExNACNS34N",null,"Excess NAC Nightsave Rural","ExNACNR",3,4,"ExNACNR34N",null,"Excess NAC Ruraflex","ExNACRu",3,4,"ExNACRu34N",null,null,"> 132kV*",22.02,25.1]
[null,null,null,null,null,null,null,null,null,null,null,null,null,null,null,null,null,null,null,"* 132 kV or Transmission connected"]
[]
[]
[null,null,null,null,null,null,null,null,null,null,null,null,null,null,null,null,null,null,"Excess MEC- Transmission connected generators",null,null,null,null,null,"Excess MEC- Distribution connected Generators"]
[]
[null,null,null,null,null,null,null,null,null,null,null,null,null,null,null,null,null,null,null,"Excess Network capacity charge[R/kW/m]",null,null,null,null,null,"Excess Network capacity charge[R/kW/m]"]
[null,null,null,null,null,null,null,null,null,null,null,null,null,null,null,null,null,null,null,null,"VAT incl",null,null,null,null,null,"VAT incl"]
[null,null,null,null,null,null,null,null,null,null,null,null,null,null,null,null,null,null,"Cape",{"$f":"T55","v":1.88},{"$f":"ROUND(T54 * (1 + VAT), 2)","v":2.14},null,null,null,"Voltage "]
[null,null,null,null,null,null,null,null,null,null,null,null,null,null,null,null,null,null,"Karoo",{"$f":"T56","v":1.88},2.14,null,null,null,"< 500V",0,{"$f":"ROUND(Z55 * (1 + VAT), 2)","v":0}]
[null,null,null,null,null,null,null,null,null,null,null,null,null,null,null,null,null,null,"Kwazulu-Natal",{"$f":"TUoS!J58","v":1.88},2.14,null,null,null,"≥ 500V & < 66kV",{"$f":"Z57","v":12.8},14.59]
[null,null,null,null,null,null,null,null,null,null,null,null,null,null,null,null,null,null,"Vaal",{"$f":"TUoS!J59","v":6.26},7.14,null,null,null,"≥ 66kV & ≤ 132kV",{"$f":"DUoS!J73","v":12.8},14.59]
[null,null,null,null,null,null,null,null,null,null,null,null,null,null,null,null,null,null,"Waterberg",{"$f":"TUoS!J60","v":8.02},9.14]
[null,null,null,null,null,null,null,null,null,null,null,null,null,null,null,null,null,null,"Mpumalanga",{"$f":"TUoS!J61","v":7.44},8.48]

{"sheet":"Excess NCC Munic","index":32,"n_rows":47,"n_cols":40,"rows_kept":47,"cut":false,"hidden":false,"merged":[[11,36,14,36],[15,36,18,36],[19,36,22,36],[1,36,1,39],[3,38,3,39],[4,36,6,36],[4,38,5,39],[7,36,10,36],[4,32,5,33],[1,18,1,21],[1,23,1,27],[1,29,1,33],[3,20,3,21],[3,26,3,27],[3,32,3,33],[4,18,6,18],[4,20,5,21],[4,24,6,24],[4,26,5,27],[4,30,6,30],[7,18,10,18],[7,24,10,24],[7,30,10,30],[11,18,14,18],[11,24,14,24],[11,30,14,30],[15,18,18,18],[15,24,18,24],[15,30,18,30],[19,18,22,18],[19,24,22,24],[19,30,22,30],[27,32,28,33],[24,18,24,21],[24,23,24,27],[24,29,24,33],[26,20,26,21],[26,26,26,27],[26,32,26,33],[27,18,29,18],[27,20,28,21],[27,24,29,24],[27,26,28,27],[27,30,29,30],[30,18,33,18],[30,24,33,24],[30,30,33,30],[34,18,37,18],[34,24,37,24],[34,30,37,30],[38,18,41,18],[38,24,41,24],[38,30,41,30],[42,18,45,18],[42,24,45,24],[42,30,45,30]]}
[null,null,null,null,null,null,null,null,null,null,null,null,null,null,null,null,null,null,"Back to menu"]
["Municiple",null,null,null,null,null,null,null,null,null,null,null,null,null,null,null,null,null,"Urban - Excess NCC\nMegaflex\n[Local authorities]",null,null,null,null,"Urban - Excess NCC\nNightsave Urban Large\n[Local authorities]",null,null,null,null,null,"Urban - Excess NCC\nMiniflex\n[Local authorities]",null,null,null,null,null,null,"Urban - Excess NCC\nWEPS\n[Local authorities]"]
[]
[null,null,null,null,null,null,null,null,null,null,null,null,null,null,null,null,null,null,null,null,"Excess network charge [R/kVA/m]",null,null,null,null,null,"Excess network charge [R/kVA/m]",null,null,null,null,null,"Excess network charge [R/kVA/m]",null,null,null,null,null,"Excess network charge [R/kVA/m]"]
[null,null,null,null,null,null,null,null,null,null,null,null,null,null,null,null,null,null,"Transmission zone",null,null,null,null,null,"Transmission zone",null,null,null,null,null,"Transmission zone",null,null,null,null,null,"Transmission zone"]
[null,null,null,null,null,null,null,null,null,null,null,null,null,null,null,null,null,null,null,"Voltage",null,null,null,null,null,"Voltage",null,null,null,null,null,"Voltage",null,null,null,null,null,"Voltage"]
["Tariff","Tariff nameBillcode","Tx zone","Voltage","Billcode",null,"Tariff","Tariff nameBillcode","Tx zone","Voltage","Billcode",null,"Tariff","Tariff nameBillcode","Tx zone","Voltage","Billcode",null,null,null,null,"VAT incl",null,null,null,null,null,"VAT incl",null,null,null,null,null,"VAT incl",null,null,null,null,null,"VAT incl"]
["Excess NAC Megaflex","ExNACMe",0,1,{"$f":"B8&C8&D8&IF($A$2=\"Non-municipal\",\"N\",IF($A$2=\"Municiple\",\"Y\",\"error\"))","v":"ExNACMe01Y"},null,"Excess NAC Nightsave Large","ExNACNL",0,1,{"$f":"H8&I8&J8&IF($A$2=\"Non-municipal\",\"N\",IF($A$2=\"Municiple\",\"Y\",\"error\"))","v":"ExNACNL01Y"},null,"Excess NAC Miniflex","ExNACMi",0,1,{"$f":"N8&O8&P8&IF($A$2=\"Non-municipal\",\"N\",IF($A$2=\"Municiple\",\"Y\",\"error\"))","v":"ExNACMi01Y"},null,"≤ 300km","< 500V",23.33,{"$f":"ROUND(U8 * (1 + VAT), 2)","v":26.6},null,null,"≤ 300km","< 500V",23.33,{"$f":"ROUND(AA8 * (1 + VAT), 2)","v":26.6},null,null,"≤ 300km","< 500V",23.32,{"$f":"ROUND(AG8 * (1 + VAT), 2)","v":26.58},null,null,"≤ 300km","< 500V",23.33,{"$f":"ROUND(AM8 * (1 + VAT), 2)","v":26.6}]
["Excess NAC Megaflex","ExNACMe",0,2,{"$f":"B9&C9&D9&IF($A$2=\"Non-municipal\",\"N\",IF($A$2=\"Municiple\",\"Y\",\"error\"))","v":"ExNACMe02Y"},null,"Excess NAC Nightsave Large","ExNACNL",0,2,{"$f":"H9&I9&J9&IF($A$2=\"Non-municipal\",\"N\",IF($A$2=\"Municiple\",\"Y\",\"error\"))","v":"ExNACNL02Y"},null,"Excess NAC Miniflex","ExNACMi",0,2,{"$f":"N9&O9&P9&IF($A$2=\"Non-municipal\",\"N\",IF($A$2=\"Municiple\",\"Y\",\"error\"))","v":"ExNACMi02Y"},null,null,"≥ 500V & < 66kV",21.36,24.35,null,null,null,"≥ 500V & < 66kV",21.36,24.35,null,null,null,"≥ 500V & < 66kV",21.37,24.36,null,null,null,"≥ 500V & < 66kV",21.36,24.35]
["Excess NAC Megaflex","ExNACMe",0,3,"ExNACMe03Y",null,"Excess NAC Nightsave Large","ExNACNL",0,3,"ExNACNL03Y",null,"Excess NAC Miniflex","ExNACMi",0,3,"ExNACMi03Y",null,null,"≥ 66kV & ≤ 132kV",24.5,27.93,null,null,null,"≥ 66kV & ≤ 132kV",24.5,27.93,null,null,null,"≥ 66kV & ≤ 132kV",24.48,27.91,null,null,null,"≥ 66kV & ≤ 132kV",24.5,27.93]
["Excess NAC Megaflex","ExNACMe",0,4,"ExNACMe04Y",null,"Excess NAC Nightsave Large","ExNACNL",0,4,"ExNACNL04Y",null,"Excess NAC Miniflex","ExNACMi",0,4,"ExNACMi04Y",null,null,"> 132kV*",21.240000000000002,24.21,null,null,null,"> 132kV*",21.240000000000002,24.21,null,null,null,"> 132kV*",21.240000000000002,24.21,null,null,null,"> 132kV*",21.240000000000002,24.21]
["Excess NAC Megaflex","ExNACMe",1,1,"ExNACMe11Y",null,"Excess NAC Nightsave Large","ExNACNL",1,1,"ExNACNL11Y",null,"Excess NAC Miniflex","ExNACMi",1,1,"ExNACMi11Y",null,"> 300km and \n≤ 600km","< 500V",23.369999999999997,26.64,null,null,"> 300km and \n≤ 600km","< 500V",23.369999999999997,26.64,null,null,"> 300km and \n≤ 600km","< 500V",23.37,26.64,null,null,"> 300km and \n≤ 600km","< 500V",23.369999999999997,26.64]
["Excess NAC Megaflex","ExNACMe",1,2,"ExNACMe12Y",null,"Excess NAC Nightsave Large","ExNACNL",1,2,"ExNACNL12Y",null,"Excess NAC Miniflex","ExNACMi",1,2,"ExNACMi12Y",null,null,"≥ 500V & < 66kV",21.43,24.43,null,null,null,"≥ 500V & < 66kV",21.43,24.43,null,null,null,"≥ 500V & < 66kV",21.44,24.44,null,null,null,"≥ 500V & < 66kV",21.43,24.43]
["Excess NAC Megaflex","ExNACMe",1,3,"ExNACMe13Y",null,"Excess NAC Nightsave Large","ExNACNL",1,3,"ExNACNL13Y",null,"Excess NAC Miniflex","ExNACMi",1,3,"ExNACMi13Y",null,null,"≥ 66kV & ≤ 132kV",24.549999999999997,27.99,null,null,null,"≥ 66kV & ≤ 132kV",24.549999999999997,27.99,null,null,null,"≥ 66kV & ≤ 132kV",24.55,27.99,null,null,null,"≥ 66kV & ≤ 132kV",24.549999999999997,27.99]
["Excess NAC Megaflex","ExNACMe",1,4,"ExNACMe14Y",null,"Excess NAC Nightsave Large","ExNACNL",1,4,"ExNACNL14Y",null,"Excess NAC Miniflex","ExNACMi",1,4,"ExNACMi14Y",null,null,"> 132kV*",21.32,24.3,null,null,null,"> 132kV*",21.32,24.3,null,null,null,"> 132kV*",21.32,24.3,null,null,null,"> 132kV*",21.32,24.3]
["Excess NAC Megaflex","ExNACMe",2,1,"ExNACMe21Y",null,"Excess NAC Nightsave Large","ExNACNL",2,1,"ExNACNL21Y",null,"Excess NAC Miniflex","ExNACMi",2,1,"ExNACMi21Y",null,"> 600km and \n≤ 900km","< 500V",23.47,26.76,null,null,"> 600km and \n≤ 900km","< 500V",23.47,26.76,null,null,"> 600km and \n≤ 900km","< 500V",23.49,26.78,null,null,"> 600km and \n≤ 900km","< 500V",23.47,26.76]
["Excess NAC Megaflex","ExNACMe",2,2,"ExNACMe22Y",null,"Excess NAC Nightsave Large","ExNACNL",2,2,"ExNACNL22Y",null,"Excess NAC Miniflex","ExNACMi",2,2,"ExNACMi22Y",null,null,"≥ 500V & < 66kV",21.490000000000002,24.5,null,null,null,"≥ 500V & < 66kV",21.490000000000002,24.5,null,null,null,"≥ 500V & < 66kV",21.5,24.51,null,null,null,"≥ 500V & < 66kV",21.490000000000002,24.5]
["Excess NAC Megaflex","ExNACMe",2,3,"ExNACMe23Y",null,"Excess NAC Nightsave Large","ExNACNL",2,3,"ExNACNL23Y",null,"Excess NAC Miniflex","ExNACMi",2,3,"ExNACMi23Y",null,null,"≥ 66kV & ≤ 132kV",24.61,28.06,null,null,null,"≥ 66kV & ≤ 132kV",24.61,28.06,null,null,null,"≥ 66kV & ≤ 132kV",24.6,28.04,null,null,null,"≥ 66kV & ≤ 132kV",24.61,28.06]
["Excess NAC Megaflex","ExNACMe",2,4,"ExNACMe24Y",null,"Excess NAC Nightsave Large","ExNACNL",2,4,"ExNACNL24Y",null,"Excess NAC Miniflex","ExNACMi",2,4,"ExNACMi24Y",null,null,"> 132kV*",21.44,24.44,null,null,null,"> 132kV*",21.44,24.44,null,null,null,"> 132kV*",21.44,24.44,null,null,null,"> 132kV*",21.44,24.44]
["Excess NAC Megaflex","ExNACMe",3,1,"ExNACMe31Y",null,"Excess NAC Nightsave Large","ExNACNL",3,1,"ExNACNL31Y",null,"Excess NAC Miniflex","ExNACMi",3,1,"ExNACMi31Y",null,"> 900km","< 500V",23.509999999999998,26.8,null,null,"> 900km","< 500V",23.509999999999998,26.8,null,null,"> 900km","< 500V",23.51,26.8,null,null,"> 900km","< 500V",23.509999999999998,26.8]
["Excess NAC Megaflex","ExNACMe",3,2,"ExNACMe32Y",null,"Excess NAC Nightsave Large","ExNACNL",3,2,"ExNACNL32Y",null,"Excess NAC Miniflex","ExNACMi",3,2,"ExNACMi32Y",null,null,"≥ 500V & < 66kV",21.56,24.58,null,null,null,"≥ 500V & < 66kV",21.56,24.58,null,null,null,"≥ 500V & < 66kV",21.59,24.61,null,null,null,"≥ 500V & < 66kV",21.56,24.58]
["Excess NAC Megaflex","ExNACMe",3,3,"ExNACMe33Y",null,"Excess NAC Nightsave Large","ExNACNL",3,3,"ExNACNL33Y",null,"Excess NAC Miniflex","ExNACMi",3,3,"ExNACMi33Y",null,null,"≥ 66kV & ≤ 132kV",24.659999999999997,28.11,null,null,null,"≥ 66kV & ≤ 132kV",24.659999999999997,28.11,null,null,null,"≥ 66kV & ≤ 132kV",24.64,28.09,null,null,null,"≥ 66kV & ≤ 132kV",24.659999999999997,28.11]
["Excess NAC Megaflex","ExNACMe",3,4,"ExNACMe34Y",null,"Excess NAC Nightsave Large","ExNACNL",3,4,"ExNACNL34Y",null,"Excess NAC Miniflex","ExNACMi",3,4,"ExNACMi34Y",null,null,"> 132kV*",21.509999999999998,24.52,null,null,null,"> 132kV*",21.509999999999998,24.52,null,null,null,"> 132kV*",21.509999999999998,24.52,null,null,null,"> 132kV*",21.509999999999998,24.52]
[null,null,null,null,null,null,null,null,null,null,null,null,null,null,null,null,null,null,null,"* 132 kV or Transmission connected",null,null,null,null,null,"* 132 kV or Transmission connected",null,null,null,null,null,"* 132 kV or Transmission connected",null,null,null,null,null,"* 132 kV or Transmission connected"]
[null,null,null,null,null,null,null,null,null,null,null,null,null,null,null,null,null,null,"Urban - Excess NCC\nNightsave Urban Small\n[Local authorities]",null,null,null,null,"Rural - Excess NCC\nNightsave Rural\n[Local authorities]",null,null,null,null,null,"Rural - Excess NCC\nRuraflex\n[Local authorities]"]
[]
[null,null,null,null,null,null,null,null,null,null,null,null,null,null,null,null,null,null,null,null,"Excess network charge [R/kVA/m]",null,null,null,null,null,"Excess network charge [R/kVA/m]",null,null,null,null,null,"Excess network charge [R/kVA/m]"]
[null,null,null,null,null,null,null,null,null,null,null,null,null,null,null,null,null,null,"Transmission zone",null,null,null,null,null,"Transmission zone",null,null,null,null,null,"Transmission zone"]
[null,null,null,null,null,null,null,null,null,null,null,null,null,null,null,null,null,null,null,"Voltage",null,null,null,null,null,"Voltage",null,null,null,null,null,"Voltage"]
["Tariff","Tariff nameBillcode","Tx zone","Voltage","Billcode",null,"Tariff","Tariff nameBillcode","Tx zone","Voltage","Billcode",null,"Tariff","Tariff nameBillcode","Tx zone","Voltage","Billcode",null,null,null,null,"VAT incl",null,null,null,null,null,"VAT incl",null,null,null,null,null,"VAT incl"]
["Excess NAC Nightsave Small","ExNACNS",0,1,{"$f":"B31&C31&D31&IF($A$2=\"Non-municipal\",\"N\",IF($A$2=\"Municiple\",\"Y\",\"error\"))","v":"ExNACNS01Y"},null,"Excess NAC Nightsave Rural","ExNACNR",0,1,{"$f":"H31&I31&J31&IF($A$2=\"Non-municipal\",\"N\",IF($A$2=\"Municiple\",\"Y\",\"error\"))","v":"ExNACNR01Y"},null,"Excess NAC Ruraflex","ExNACRu",0,1,{"$f":"N31&O31&P31&IF($A$2=\"Non-municipal\",\"N\",IF($A$2=\"Municiple\",\"Y\",\"error\"))","v":"ExNACRu01Y"},null,"≤ 300km","< 500V",23.33,{"$f":"ROUND(U31 * (1 + VAT), 2)","v":26.6},null,null,"≤ 300km","< 500V",11.81,{"$f":"ROUND(AA31 * (1 + VAT), 2)","v":13.46},null,null,"≤ 300km","< 500V",16.47,{"$f":"ROUND(AG31 * (1 + VAT), 2)","v":18.78}]
["Excess NAC Nightsave Small","ExNACNS",0,2,{"$f":"B32&C32&D32&IF($A$2=\"Non-municipal\",\"N\",IF($A$2=\"Municiple\",\"Y\",\"error\"))","v":"ExNACNS02Y"},null,"Excess NAC Nightsave Rural","ExNACNR",0,2,{"$f":"H32&I32&J32&IF($A$2=\"Non-municipal\",\"N\",IF($A$2=\"Municiple\",\"Y\",\"error\"))","v":"ExNACNR02Y"},null,"Excess NAC Ruraflex","ExNACRu",0,2,{"$f":"N32&O32&P32&IF($A$2=\"Non-municipal\",\"N\",IF($A$2=\"Municiple\",\"Y\",\"error\"))","v":"ExNACRu02Y"},null,null,"≥ 500V & < 66kV",21.36,24.35,null,null,null,"≥ 500V & ≤ 22kV",10.84,12.36,null,null,null,"≥ 500V & ≤ 22kV",15.11,17.23]
["Excess NAC Nightsave Small","ExNACNS",0,3,"ExNACNS03Y",null,"Excess NAC Nightsave Rural","ExNACNR",0,3,"ExNACNR03Y",null,"Excess NAC Ruraflex","ExNACRu",0,3,"ExNACRu03Y",null,null,"≥ 66kV & ≤ 132kV",24.5,27.93]
["Excess NAC Nightsave Small","ExNACNS",0,4,"ExNACNS04Y",null,"Excess NAC Nightsave Rural","ExNACNR",0,4,"ExNACNR04Y",null,"Excess NAC Ruraflex","ExNACRu",0,4,"ExNACRu04Y",null,null,"> 132kV*",21.240000000000002,24.21]
["Excess NAC Nightsave Small","ExNACNS",1,1,"ExNACNS11Y",null,"Excess NAC Nightsave Rural","ExNACNR",1,1,"ExNACNR11Y",null,"Excess NAC Ruraflex","ExNACRu",1,1,"ExNACRu11Y",null,"> 300km and \n≤ 600km","< 500V",23.369999999999997,26.64,null,null,"> 300km and \n≤ 600km","< 500V",11.83,{"$f":"ROUND(AA35 * (1 + VAT), 2)","v":13.49},null,null,"> 300km and \n≤ 600km","< 500V",16.54,{"$f":"ROUND(AG35 * (1 + VAT), 2)","v":18.86}]
["Excess NAC Nightsave Small","ExNACNS",1,2,"ExNACNS12Y",null,"Excess NAC Nightsave Rural","ExNACNR",1,2,"ExNACNR12Y",null,"Excess NAC Ruraflex","ExNACRu",1,2,"ExNACRu12Y",null,null,"≥ 500V & < 66kV",21.43,24.43,null,null,null,"≥ 500V & ≤ 22kV",10.88,12.4,null,null,null,"≥ 500V & ≤ 22kV",15.2,17.329999999999998]
["Excess NAC Nightsave Small","ExNACNS",1,3,"ExNACNS13Y",null,"Excess NAC Nightsave Rural","ExNACNR",1,3,"ExNACNR13Y",null,"Excess NAC Ruraflex","ExNACRu",1,3,"ExNACRu13Y",null,null,"≥ 66kV & ≤ 132kV",24.549999999999997,27.99]
["Excess NAC Nightsave Small","ExNACNS",1,4,"ExNACNS14Y",null,"Excess NAC Nightsave Rural","ExNACNR",1,4,"ExNACNR14Y",null,"Excess NAC Ruraflex","ExNACRu",1,4,"ExNACRu14Y",null,null,"> 132kV*",21.32,24.3]
["Excess NAC Nightsave Small","ExNACNS",2,1,"ExNACNS21Y",null,"Excess NAC Nightsave Rural","ExNACNR",2,1,"ExNACNR21Y",null,"Excess NAC Ruraflex","ExNACRu",2,1,"ExNACRu21Y",null,"> 600km and \n≤ 900km","< 500V",23.47,26.76,null,null,"> 600km and \n≤ 900km","< 500V",11.95,{"$f":"ROUND(AA39 * (1 + VAT), 2)","v":13.62},null,null,"> 600km and \n≤ 900km","< 500V",16.63,{"$f":"ROUND(AG39 * (1 + VAT), 2)","v":18.96}]
["Excess NAC Nightsave Small","ExNACNS",2,2,"ExNACNS22Y",null,"Excess NAC Nightsave Rural","ExNACNR",2,2,"ExNACNR22Y",null,"Excess NAC Ruraflex","ExNACRu",2,2,"ExNACRu22Y",null,null,"≥ 500V & < 66kV",21.490000000000002,24.5,null,null,null,"≥ 500V & ≤ 22kV",10.95,12.48,null,null,null,"≥ 500V & ≤ 22kV",15.27,17.41]
["Excess NAC Nightsave Small","ExNACNS",2,3,"ExNACNS23Y",null,"Excess NAC Nightsave Rural","ExNACNR",2,3,"ExNACNR23Y",null,"Excess NAC Ruraflex","ExNACRu",2,3,"ExNACRu23Y",null,null,"≥ 66kV & ≤ 132kV",24.61,28.06]
["Excess NAC Nightsave Small","ExNACNS",2,4,"ExNACNS24Y",null,"Excess NAC Nightsave Rural","ExNACNR",2,4,"ExNACNR24Y",null,"Excess NAC Ruraflex","ExNACRu",2,4,"ExNACRu24Y",null,null,"> 132kV*",21.44,24.44]
["Excess NAC Nightsave Small","ExNACNS",3,1,"ExNACNS31Y",null,"Excess NAC Nightsave Rural","ExNACNR",3,1,"ExNACNR31Y",null,"Excess NAC Ruraflex","ExNACRu",3,1,"ExNACRu31Y",null,"> 900km","< 500V",23.509999999999998,26.8,null,null,"> 900km","< 500V",11.96,{"$f":"ROUND(AA43 * (1 + VAT), 2)","v":13.63},null,null,"> 900km","< 500V",16.68,{"$f":"ROUND(AG43 * (1 + VAT), 2)","v":19.02}]
["Excess NAC Nightsave Small","ExNACNS",3,2,"ExNACNS32Y",null,"Excess NAC Nightsave Rural","ExNACNR",3,2,"ExNACNR32Y",null,"Excess NAC Ruraflex","ExNACRu",3,2,"ExNACRu32Y",null,null,"≥ 500V & < 66kV",21.56,24.58,null,null,null,"≥ 500V & ≤ 22kV",10.96,12.49,null,null,null,"≥ 500V & ≤ 22kV",15.28,17.420000000000002]
["Excess NAC Nightsave Small","ExNACNS",3,3,"ExNACNS33Y",null,"Excess NAC Nightsave Rural","ExNACNR",3,3,"ExNACNR33Y",null,"Excess NAC Ruraflex","ExNACRu",3,3,"ExNACRu33Y",null,null,"≥ 66kV & ≤ 132kV",24.659999999999997,28.11]
["Excess NAC Nightsave Small","ExNACNS",3,4,"ExNACNS34Y",null,"Excess NAC Nightsave Rural","ExNACNR",3,4,"ExNACNR34Y",null,"Excess NAC Ruraflex","ExNACRu",3,4,"ExNACRu34Y",null,null,"> 132kV*",21.509999999999998,24.52]
[null,null,null,null,null,null,null,null,null,null,null,null,null,null,null,null,null,null,null,"* 132 kV or Transmission connected"]

{"sheet":"Env levy","index":33,"n_rows":22,"n_cols":7,"rows_kept":22,"cut":false,"hidden":false,"merged":[]}
[]
[null,"Urban"]
[null,"Ave c/kWh","Column Labels"]
[null,"Row Labels",0,1,2,3,"Grand Total"]
[null,1,4.2441734963618041,3.9229221124432589,3.9527382105199051,3.9951826601450668,4.2303256421082995]
[null,2,3.8186059651047737,3.8567920247728718,3.895359945114679,3.9343135444971589,3.8300318858177489]
[null,3,3.6978495999019296,3.7348280958939521,3.7721763768754322,3.8098981406339028,3.7495844042255713]
[null,4,3.4850235973906436,3.5198738333649109,3.5550725710602902,0,3.4978362022439597]
[null,"Grand Total",3.7686931970332931,3.6664747565850311,3.7989660387480506,3.8482092095507561,3.7606121708915037]
[]
[null,"Rural pivot(excluding landrate)"]
[null,"Ave c/kWh","Column Labels"]
[null,"Row Labels",0,1,2,3,"Grand Total"]
[null,1,4.0171258990140295,4.0572971576934416,4.0978701290997126,4.1388488292040293,4.0647717863960162]
[null,2,3.9771598618902106,4.0169314603124926,4.0571007750330903,4.0976717833205187,4.0194221173035647]
[null,"Grand Total",3.9923982478103683,4.037020528594006,4.07597582688377,4.1170298512588177,4.0399027016693312]
[]
[null,"Landrate"]
[null,"Ave c/kWh","Column Labels"]
[null,"Row Labels",0,"Grand Total"]
[null,1,4.6542964835149112,4.6542964835149112]
[null,"Grand Total",4.6542964835149112,4.6542964835149112]

{"sheet":"Sheet2","index":34,"n_rows":30,"n_cols":57,"rows_kept":30,"cut":false,"hidden":true,"merged":[[7,51,7,56]]}
[]
[null,"GENERATOR TARIFF REFERENCE TABLE"]
[]
[null,"Applicability of tariff rates (key)"]
[null,"Code","Description"]
[null,"n/a","Not applicable"]
[null,"Applicable","Rate is applicable"]
[null,null,null,null,null,null,null,null,null,null,null,null,null,null,null,null,null,null,null,null,null,null,null,null,null,null,null,null,null,null,null,null,null,null,null,null,null,null,null,null,null,null,null,null,null,null,null,null,null,null,null,"WEPS"]
[null,"Bill rate matrix (BRM) code","CC&B reference code to BRM \n(showing the first voltage code)","Tariff name","Municipal / non-municipal","Applicability \n(customers or transaction)","Reference tariff \n(rates are the same)","AdminS","AdminM","AdminL","AdminVL","AdminK","ServiceS","ServiceM","ServiceL","ServiceVL","ServiceK","kWhHP","kWhHS","kWhHO","kWhLP","kWhLS","kWhLO","DxNDC Energy","Reliability","Service Energy","kvarh","Enviro Levy","Tx NAC","Dx NAC","Dx NDC","NAC POD","EDC H","EDC L","Days","kWhRBlock1","kWhRBlock2","kWhRBlock3","kWhRBlock4","SubRuralNetwork","SubUrbLowVolt","SubElecNetwork","SubAfford","NAC","ERS","Maint charge","Energy charge\nR/100W/mth","Dx NAC for Generators","Gen Tx Reliab","Tx NAC for Generators","Gen Dx Reliability","kWhHP","kWhHS","kWhHO","kWhLP","kWhLS","kWhLO"]
[null,"GU01","GU01N","Genflex urban","Non-municipal","Eskom urban HV & MV customers consuming and exporting energy","Megaflex, WEPS excluding losses and Gen-TUOS and Gen-DUOS urban","Applicable","Applicable","Applicable","Applicable","Applicable","Applicable","Applicable","Applicable","Applicable","Applicable","Applicable","Applicable","Applicable","Applicable","Applicable","Applicable","n/a","Applicable","n/a","Applicable","n/a","Applicable","Applicable","Applicable","n/a","n/a","n/a","Applicable","n/a","n/a","n/a","n/a","n/a","n/a","n/a","Applicable","n/a","Applicable","n/a","n/a","Applicable","Applicable","Applicable","Applicable","Applicable","Applicable","Applicable","Applicable","Applicable","Applicable"]
[null,"GR01","GR01N","Genflex rural","Non-municipal","Eskom rural HV & MV customers consuming and exporting energy","Ruraflex and Gen DUOS rural","Applicable","Applicable","Applicable","Applicable","Applicable","Applicable","Applicable","Applicable","Applicable","Applicable","Applicable","Applicable","Applicable","Applicable","Applicable","Applicable","Applicable","Applicable","n/a","Applicable","n/a","n/a","Applicable","n/a","n/a","n/a","n/a","Applicable","n/a","n/a","n/a","n/a","n/a","n/a","n/a","n/a","n/a","n/a","n/a","n/a","Applicable","n/a","n/a","Applicable","n/a","n/a","n/a","n/a","n/a","n/a"]
[null,"NLWheelAdj04","NLWheelAdj04N","Gen-wheeling","Non-municipal","Customers receiving energy from a non-Eskom generator located at a  different area from customer's plant","WEPS non-Munic","Applicable","Applicable","Applicable","Applicable","Applicable","Applicable","Applicable","Applicable","Applicable","Applicable","Applicable","Applicable","Applicable","Applicable","Applicable","Applicable","n/a","n/a","n/a","n/a","n/a","n/a","n/a","n/a","n/a","n/a","n/a","Applicable","n/a","n/a","n/a","n/a","n/a","n/a","n/a","Applicable","n/a","n/a","n/a","n/a","n/a","n/a","n/a"]
[null,"NLPurchAdj04","NLPurchAdj04N","Gen-purchase","Non-municipal","Generator selling energy to Eskom but energy does not come into Eskom's network but used by customer on site","WEPS non-Munic","Applicable","Applicable","Applicable","Applicable","Applicable","Applicable","Applicable","Applicable","Applicable","Applicable","Applicable","Applicable","Applicable","Applicable","Applicable","Applicable","n/a","n/a","n/a","n/a","n/a","n/a","n/a","n/a","n/a","n/a","n/a","Applicable","n/a","n/a","n/a","n/a","n/a","n/a","n/a","Applicable","n/a","n/a","n/a","n/a","n/a","n/a","n/a"]
[null,"NLWheelAdjR04","NLWheelAdjR04","Gen-wheeling rural","Non-municipal","Customers receiving energy from a non-Eskom generator located at a  different area from customer's plant","WEPS non-Munic","Applicable","Applicable","Applicable","Applicable","Applicable","Applicable","Applicable","Applicable","Applicable","Applicable","Applicable","Applicable","Applicable","Applicable","Applicable","Applicable","n/a","n/a","n/a","n/a","n/a","n/a","n/a","n/a","n/a","n/a","n/a","Applicable","n/a","n/a","n/a","n/a","n/a","n/a","n/a","n/a","n/a","n/a","n/a","n/a","n/a","n/a","n/a"]
[null,"NLPurchAdjR04","NLPurchAdjR04","Gen-purchase rural","Non-municipal","Generator selling energy to Eskom but energy does not come into Eskom's network but used by customer on site","WEPS non-Munic","Applicable","Applicable","Applicable","Applicable","Applicable","Applicable","Applicable","Applicable","Applicable","Applicable","Applicable","Applicable","Applicable","Applicable","Applicable","Applicable","n/a","n/a","n/a","n/a","n/a","n/a","n/a","n/a","n/a","n/a","n/a","Applicable","n/a","n/a","n/a","n/a","n/a","n/a","n/a","n/a","n/a","n/a","n/a","n/a","n/a","n/a","n/a"]
[null,"NLWheelAdj04","NLWheelAdj04Y","Gen-wheeling","Municipal","Customers receiving energy from a non-Eskom generator located at a  different area from customer's plant thorough Municipality network","WEPS munic","Applicable","Applicable","Applicable","Applicable","Applicable","Applicable","Applicable","Applicable","Applicable","Applicable","Applicable","Applicable","Applicable","Applicable","Applicable","Applicable","n/a","n/a","n/a","n/a","n/a","n/a","n/a","n/a","n/a","n/a","n/a","Applicable","n/a","n/a","n/a","n/a","n/a","n/a","n/a","n/a","n/a","n/a","n/a","n/a","n/a","n/a","n/a"]
[null,"NLPurchAdj04","NLPurchAdj04Y","Gen-purchase","Municipal","Generator in Munic area selling energy to Eskom but energy does not come into Eskom's network but used by Municipality","WEPS munic","Applicable","Applicable","Applicable","Applicable","Applicable","Applicable","Applicable","Applicable","Applicable","Applicable","Applicable","Applicable","Applicable","Applicable","Applicable","Applicable","n/a","n/a","n/a","n/a","n/a","n/a","n/a","n/a","n/a","n/a","n/a","Applicable","n/a","n/a","n/a","n/a","n/a","n/a","n/a","n/a","n/a","n/a","n/a","n/a","n/a","n/a","n/a"]
[null,"NLWheelAdjR04","NLWheelAdjR04","Gen-wheeling rural","Municipal","Customers receiving energy from a non-Eskom generator located at a  different area from customer's plant thorough Municipality network","WEPS munic","Applicable","Applicable","Applicable","Applicable","Applicable","Applicable","Applicable","Applicable","Applicable","Applicable","Applicable","Applicable","Applicable","Applicable","Applicable","Applicable","n/a","n/a","n/a","n/a","n/a","n/a","n/a","n/a","n/a","n/a","n/a","Applicable","n/a","n/a","n/a","n/a","n/a","n/a","n/a","n/a","n/a","n/a","n/a","n/a","n/a","n/a","n/a"]
[null,"NLPurchAdjR04","NLPurchAdjR04","Gen-purchase rural","Municipal","Generator in Munic area selling energy to Eskom but energy does not come into Eskom's network but used by Municipality","WEPS munic","Applicable","Applicable","Applicable","Applicable","Applicable","Applicable","Applicable","Applicable","Applicable","Applicable","Applicable","Applicable","Applicable","Applicable","Applicable","Applicable","n/a","n/a","n/a","n/a","n/a","n/a","n/a","n/a","n/a","n/a","n/a","Applicable","n/a","n/a","n/a","n/a","n/a","n/a","n/a","n/a","n/a","n/a","n/a","n/a","n/a","n/a","n/a"]
[null,"NLUrbOffset01","NLUrbOffset01N","Gen-offset urban","Non-municipal","Customer with own generator on site, but at times exports energy to Eskom network","Megaflex","Applicable","Applicable","Applicable","Applicable","Applicable","Applicable","Applicable","Applicable","Applicable","Applicable","Applicable","Applicable","Applicable","Applicable","Applicable","Applicable","n/a","n/a","n/a","n/a","n/a","n/a","n/a","n/a","n/a","n/a","n/a","Applicable","n/a","n/a","n/a","n/a","n/a","n/a","n/a","Applicable","n/a","n/a","n/a","n/a","n/a","n/a","n/a"]
[null,"NLRurOffset01","NLRurOffset01N","Gen-offset rural","Non-municipal","Customer with own generator on site, but at times exports energy to Eskom network","Ruraflex","Applicable","Applicable","Applicable","Applicable","Applicable","Applicable","Applicable","Applicable","Applicable","Applicable","Applicable","Applicable","Applicable","Applicable","Applicable","Applicable","n/a","n/a","n/a","n/a","n/a","n/a","n/a","n/a","n/a","n/a","n/a","Applicable","n/a","n/a","n/a","n/a","n/a","n/a","n/a","n/a","n/a","n/a","n/a","n/a","n/a","n/a","n/a","n/a"]
[null,"NEGenDUoSU01","NEGenDUoSU01","Gen-DUoS urban","Non-municipal","Non-Eskom urban generators  for distribution use of system charges","WEPS, UOS urban for Dx","Applicable","Applicable","Applicable","Applicable","Applicable","Applicable","Applicable","Applicable","Applicable","Applicable","Applicable","Applicable","Applicable","Applicable","Applicable","Applicable","n/a","n/a","n/a","n/a","n/a","n/a","n/a","n/a","n/a","n/a","n/a","Applicable","n/a","n/a","n/a","n/a","n/a","n/a","n/a","n/a","n/a","n/a","n/a","n/a","Applicable","n/a","n/a","Applicable"]
[null,"NEGenDUoSR01","NEGenDUoSR01","Gen-DUoS rural","Non-municipal","Non-Eskom rural generators for distribution use of system charges","WEPS, UOS rural for Dx","Applicable","Applicable","Applicable","Applicable","Applicable","Applicable","Applicable","Applicable","Applicable","Applicable","Applicable","Applicable","Applicable","Applicable","Applicable","Applicable","n/a","n/a","n/a","n/a","n/a","n/a","n/a","n/a","n/a","n/a","n/a","Applicable","n/a","n/a","n/a","n/a","n/a","n/a","n/a","n/a","n/a","n/a","n/a","n/a","Applicable","n/a","n/a","Applicable"]
[null,"GenTUoSCape4","GenTUoSCape4","Gen-TUOS","Non-municipal","Cape, Non-Eskom  generators  for Transmission use of system charges","WEPS, TUOS ","Applicable","Applicable","Applicable","Applicable","Applicable","Applicable","Applicable","Applicable","Applicable","Applicable","Applicable","Applicable","Applicable","Applicable","Applicable","Applicable","n/a","n/a","n/a","n/a","n/a","n/a","n/a","n/a","n/a","n/a","n/a","Applicable","n/a","n/a","n/a","n/a","n/a","n/a","n/a","n/a","n/a","n/a","n/a","n/a","n/a","Applicable","n/a"]
[null,"GenTUoSKaroo4","GenTUoSKaroo4","Gen-TUOS","Non-municipal","Karoo, Non-Eskom  generators  for Transmission use of system charges","WEPS, TUOS ","Applicable","Applicable","Applicable","Applicable","Applicable","Applicable","Applicable","Applicable","Applicable","Applicable","Applicable","Applicable","Applicable","Applicable","Applicable","Applicable","n/a","n/a","n/a","n/a","n/a","n/a","n/a","n/a","n/a","n/a","n/a","Applicable","n/a","n/a","n/a","n/a","n/a","n/a","n/a","n/a","n/a","n/a","n/a","n/a","n/a","Applicable","n/a"]
[null,"GenTUoSKwazulu-Natal4","GenTUoSKwazulu-Natal4","Gen-TUOS","Non-municipal","Kwazulu-Natal, Non-Eskom  generators  for Transmission use of system charges","WEPS, TUOS ","Applicable","Applicable","Applicable","Applicable","Applicable","Applicable","Applicable","Applicable","Applicable","Applicable","Applicable","Applicable","Applicable","Applicable","Applicable","Applicable","n/a","n/a","n/a","n/a","n/a","n/a","n/a","n/a","n/a","n/a","n/a","Applicable","n/a","n/a","n/a","n/a","n/a","n/a","n/a","n/a","n/a","n/a","n/a","n/a","n/a","Applicable","Applicable"]
[null,"GenTUoSVaal4","GenTUoSVaal4","Gen-TUOS","Non-municipal","Vaal, Non-Eskom  generators  for Transmission use of system charges","WEPS, TUOS ","Applicable","Applicable","Applicable","Applicable","Applicable","Applicable","Applicable","Applicable","Applicable","Applicable","Applicable","Applicable","Applicable","Applicable","Applicable","Applicable","n/a","n/a","n/a","n/a","n/a","n/a","n/a","n/a","n/a","n/a","n/a","Applicable","n/a","n/a","n/a","n/a","n/a","n/a","n/a","n/a","n/a","n/a","n/a","n/a","n/a","Applicable","Applicable"]
[null,"GenTUoSWaterburg4","GenTUoSWaterburg4","Gen-TUOS","Non-municipal","Waterburg, Non-Eskom  generators  for Transmission use of system charges","WEPS, TUOS ","Applicable","Applicable","Applicable","Applicable","Applicable","Applicable","Applicable","Applicable","Applicable","Applicable","Applicable","Applicable","Applicable","Applicable","Applicable","Applicable","n/a","n/a","n/a","n/a","n/a","n/a","n/a","n/a","n/a","n/a","n/a","Applicable","n/a","n/a","n/a","n/a","n/a","n/a","n/a","n/a","n/a","n/a","n/a","n/a","n/a","Applicable","Applicable"]
[null,"GenTUoSMpumalanga4","GenTUoSMpumalanga4","Gen-TUOS","Non-municipal","Mpumalanga, Non-Eskom  generators  for Transmission use of system charges","WEPS, TUOS ","Applicable","Applicable","Applicable","Applicable","Applicable","Applicable","Applicable","Applicable","Applicable","Applicable","Applicable","Applicable","Applicable","Applicable","Applicable","Applicable","n/a","n/a","n/a","n/a","n/a","n/a","n/a","n/a","n/a","n/a","n/a","Applicable","n/a","n/a","n/a","n/a","n/a","n/a","n/a","n/a","n/a","n/a","n/a","n/a","n/a","Applicable","Applicable"]
[null,"TUOS  > 132kV04","TUOS  > 132kV04","TUOS  > 132kV","Non-municipal","Eskom loads at >132kV  transmission use of system charges","WEPS","n/a","n/a","n/a","n/a","n/a","n/a","n/a","n/a","n/a","n/a","n/a","n/a","n/a","n/a","n/a","n/a","n/a","n/a","n/a","n/a","n/a","Applicable","n/a","n/a","n/a","n/a","n/a","Applicable","n/a","n/a","n/a","n/a","n/a","n/a","n/a","n/a","n/a","n/a","n/a","n/a","n/a","n/a","n/a"]

{"sheet":"Reconciliaton","index":35,"n_rows":30,"n_cols":9,"rows_kept":30,"cut":false,"hidden":false,"merged":[[1,1,1,9],[3,2,3,4],[20,2,20,4],[22,2,25,2],[26,2,29,2],[5,2,8,2],[9,2,11,2],[12,2,14,2],[15,2,17,2],[3,6,3,8],[5,6,8,6],[9,6,11,6],[12,6,14,6],[15,6,17,6]]}
[]
[null,"Generator reconciliations"]
[]
[null,null,"Wheeling",null,null,null,"Energy add back"]
[null,null,"Tariff name","Tariff rate","Source",null,"Tariff name","Tariff rate","Source"]
[null,null,"Gen-wheeling non Munic urban","Energy:                         ","WEPS energy rate excluding losses ",null,"Gen-purchase- urban","Energy:                         ","WEPS energy rate excluding losses "]
[null,null,null,"Affordability subsidy:     ","same as WEPS",null,null,"Affordability subsidy:     ","same as WEPS"]
[null,null,null,"Admin charge:               ","same as WEPS",null,null,"Admin charge:               ","same as WEPS"]
[null,null,null,"Other components:        ","not applicable",null,null,"Other components:        ","not applicable"]
[null,null,"Gen-wheeling non Munic rural","Energy:                         ","WEPS energy rate excluding losses ",null,"Gen-purchase-rural","Energy:                         ","WEPS energy rate excluding losses "]
[null,null,null,"Admin charge:               ","same as Ruraflex",null,null,"Admin charge:               ","same as Ruraflex"]
[null,null,null,"Other components:        ","not applicable",null,null,"Other components:        ","not applicable"]
[null,null,"Gen-wheeling Munic urban","Energy (Local):                         ","WEPS energy rate excluding losses (Local)",null,"Gen-purchase Munic urban","Energy:                         ","WEPS energy rate excluding losses(Local)"]
[null,null,null,"Admin charge:               ","same as WEPS (local)",null,null,"Admin charge:               ","same as WEPS (Local)"]
[null,null,null,"Other components:        ","not applicable",null,null,"Other components:        ","not applicable"]
[null,null,"Gen-wheeling Munic rural","Energy (Local):                         ","WEPS energy rate excluding losses (Local)",null,"Gen-purchase Munic rural","Energy:                         ","WEPS energy rate excluding losses(Local) "]
[null,null,null,"Admin charge:               ","same as same as Ruraflex (local)",null,null,"Admin charge:               ","same as Ruraflex (Local)"]
[null,null,null,"Other components:        ","not applicable",null,null,"Other components:        ","not applicable"]
[]
[]
[null,null,"Offset"]
[null,null,"Tariff name","Tariff rate","Source"]
[null,null,"Gen-offset urban","Energy:                         ","WEPS energy rate including losses (per Tx and voltage zone)"]
[null,null,null,"Affordability subsidy:     ","same as WEPS"]
[null,null,null,"Admin charge:               ","same as WEPS"]
[null,null,null,"Other components:        ","not applicable"]
[null,null,"Gen-offset rural","Energy:                         ","Ruraflex energy rate  (per Tx and voltage zone)"]
[null,null,null,"Affordability subsidy:     ","same as WEPS"]
[null,null,null,"Admin charge:               ","same as WEPS"]
[null,null,null,"Other components:        ","not applicable"]