{"text_format":"1","workbook":"xlsx","n_sheets":33,"sheets":["Menu","WEPS NLA","WEPS Munic","Nightsave Large NLA","Nightsave Large Munic"," Nightsave Small NLA","Nightsave Small Munic","Megaflex NLA","Megaflex Munic ","Megaflex Gen NLA","Miniflex NLA","Miniflex Munic ","Businessrate NLA","Businessrate Munic","Public Lighting NLA","Public Lighting Munic ","Homepower NLA","Homepower Munic","Homelight NLA","Nightsave Rural NLA","Nightsave Rural Munic ","Ruraflex NLA","Ruraflex Munic ","Ruraflex Gen NLA","Landrate NLA","Landrate Munic ","TOuS Original"," TUoS NLA","DUoS NLA","Loss Factors"," Excess NCC NLA","Excess NCC Munic","Gen Reconciliatons"],"not_rendered":{"charts":0,"images":0,"macros":0,"external_links":6,"defined_names":531,"comments":1,"pivot_tables":0},"unopened":[],"bounds":{"document_bytes":16777216,"sheet_cells":100000,"rows_first":2000,"rows_last":500,"rows_between":2000,"halvings":0,"cell_chars":16384,"cell_head_chars":4096},"cells_cut":0,"cells_raw":0,"read":"whole","date_system":"1900"}

{"sheet":"Menu","index":0,"n_rows":27,"n_cols":10,"rows_kept":27,"cut":false,"hidden":false,"merged":[[1,5,1,10],[7,32,7,35],[8,32,8,35],[12,35,12,36],[3,32,3,38],[6,32,6,35],[5,7,5,9],[3,5,3,10]]}
[]
[null,null,null,null,null,"This file contains the excel tables of the rates contained in the published Schedule of Standard Prices for Eskom tariffs."]
[]
[null,null,null,null,null,"\n2020/21 SCHEDULE OF STANDARD PRICES FOR ESKOM TARIFFS \n\n1 April 2020 to 31 March 2021 for Non-Local Authority supplies, and\n1 July 2020 to 30 June 2021 for Local Authority supplies. "]
[]
[null,null,null,null,null,null,null,"Click on the arrow to select the tariff"]
[null,null,null,null,null,null,null,"Non-local authority (NLA)",null,"Local Authority (Munic)"]
[null,null,null,null,null,null,"WEPS","u",null,"u"]
[null,null,null,null,null,"ê","Megaflex","u",null,"u"]
[null,null,null,null,null,"ê","Nightsave Large Urban","u",null,"u"]
[null,null,null,null,null,"ê","Miniflex","u",null,"u"]
[null,null,null,null,null,"ê","Nightsave Small Urban","u",null,"u"]
[null,null,null,null,null,"ê","Businessrate","u",null,"u"]
[null,null,null,null,null,"ê","Public lighting","u",null,"u"]
[null,null,null,null,null,"ê","Ruraflex","u",null,"u"]
[null,null,null,null,null,"ê","Nightsave Rural","u",null,"u"]
[null,null,null,null,null,"ê","Landrate tariffs","u",null,"u"]
[null,null,null,null,null,"ê","Homepower tariffs","u",null,"u"]
[null,null,null,null,null,"ê","Homelight tariffs","u",null,"n/a"]
[null,null,null,null,null,"ê","Excess NCC charges","u",null,"u"]
[null,null,null,null,null,"ê","Loss factors","u",null,"u"]
[null,null,null,null,null,"ê","Transmission use of system charges","u",null,"n/a"]
[null,null,null,null,null,"ê","Distribution use of system charges","u",null,"n/a"]
[null,null,null,null,null,"ê","Megaflex Gen","u",null,"n/a"]
[null,null,null,null,null,"ê","Ruraflex Gen","u",null,"n/a"]
[]
[null,null,null,null,null,"ê"]

{"sheet":"WEPS NLA","index":1,"n_rows":62,"n_cols":23,"rows_kept":62,"cut":false,"hidden":false,"merged":[[1,6,1,23],[3,21,5,22],[11,7,14,7],[3,9,3,20],[4,7,6,7],[4,9,4,14],[4,15,4,20],[5,9,5,10],[5,11,5,12],[5,13,5,14],[5,15,5,16],[5,17,5,18],[5,19,5,20],[7,7,10,7],[29,7,29,8],[29,16,29,17],[15,7,18,7],[19,7,22,7],[24,7,24,14],[25,7,26,8],[25,9,26,10],[25,11,26,12],[25,13,26,14],[26,18,26,19],[27,7,27,8],[27,16,27,17],[28,7,28,8],[28,16,28,17],[26,16,26,17],[30,7,30,8],[30,16,30,17],[31,7,31,8],[31,16,31,17],[34,7,34,8],[34,9,35,10],[34,11,35,12],[34,16,34,19],[51,7,51,18],[36,7,36,8],[36,16,36,17],[36,18,36,19],[37,7,37,8],[38,7,38,8],[39,7,39,8],[40,7,40,8],[41,7,41,8],[44,9,45,10],[46,9,46,10],[44,7,46,8],[52,7,52,12],[52,13,52,18],[53,7,53,8],[53,9,53,10],[53,11,53,12],[53,13,53,14],[53,15,53,16],[53,17,53,18],[57,7,57,18],[58,7,58,12],[58,13,58,18],[59,7,59,8],[59,9,59,10],[59,11,59,12],[59,13,59,14],[59,15,59,16],[59,17,59,18]]}
[null,null,null,null,null,null,"Back to menu"]
["Non-municipal",null,null,null,null,null,"WEPS  – Non-local Authority"]
[]
[null,null,null,null,null,null,null,null,null,"Active energy charge [c/kWh]",null,null,null,null,null,null,null,null,null,null,null,"Transmission network charges [R/kVA/m]"]
[null,null,null,null,null,null,null,"Transmission zone",null,"High demand season [Jun - Aug]",null,null,null,null,null,"Low demand season [Sep - May]"]
[null,null,null,null,null,null,null,null,"Voltage","Peak",null,"Standard",null,"Off Peak",null,"Peak",null,"Standard",null,"Off Peak"]
["Tariff","Tariff nameBillcode","Tx zone","Voltage","Billcode",null,null,null,null,null,"VAT incl",null,"VAT incl",null,"VAT incl",null,"VAT incl",null,"VAT incl",null,"VAT incl",null,"VAT incl"]
["WEPS","We",0,1,{"$f":"B8&C8&D8&IF($A$2=\"Non-municipal\",\"N\",IF($A$2=\"Municiple\",\"Y\",\"error\"))","v":"We01N"},null,null,"≤ 300km","< 500V",362.73,{"$f":"ROUND(J8 * (1 + VAT), 2)","v":417.14},110.36,{"$f":"ROUND(L8 * (1 + VAT), 2)","v":126.91},60.26,{"$f":"ROUND(N8 * (1 + VAT), 2)","v":69.3},118.78,{"$f":"ROUND(P8 * (1 + VAT), 2)","v":136.6},81.96,{"$f":"ROUND(R8 * (1 + VAT), 2)","v":94.25},52.25,{"$f":"ROUND(T8 * (1 + VAT), 2)","v":60.09},10.38,{"$f":"ROUND(V8 * (1 + VAT), 2)","v":11.94}]
["WEPS","We",0,2,"We02N",null,null,null,"≥ 500V & < 66kV",357.04,{"$f":"ROUND(J9 * (1 + VAT), 2)","v":410.6},108.16,124.38,58.74,67.55,116.45,133.91999999999999,80.17,92.2,50.86,58.49,9.48,10.9]
["WEPS","We",0,3,"We03N",null,null,null,"≥ 66kV & ≤ 132kV",345.73,397.59,104.73,120.44,56.88,65.41,112.79,129.71,77.61,89.25,49.26,56.65,9.23,10.61]
["WEPS","We",0,4,"We04N",null,null,null,"> 132kV*",325.83999999999997,374.72,98.7,113.51,53.61,61.65,106.32,122.27,73.150000000000006,84.12,46.42,53.38,11.67,13.42]
["WEPS","We",1,1,"We11N",null,null,"> 300km and \n≤ 600km","< 500V",365.69,420.54,110.8,127.42,60.16,69.180000000000007,119.3,137.19999999999999,82.14,94.46,52.11,59.93,10.45,12.02]
["WEPS","We",1,2,"We12N",null,null,null,"≥ 500V & < 66kV",360.6,414.69,109.23,125.61,59.32,68.22,117.65,135.30000000000001,80.959999999999994,93.1,51.36,59.06,9.57,11.01]
["WEPS","We",1,3,"We13N",null,null,null,"≥ 66kV & ≤ 132kV",349.13,401.5,105.75,121.61,57.41,66.02,113.88,130.96,78.38,90.14,49.73,57.19,9.3000000000000007,10.7]
["WEPS","We",1,4,"We14N",null,null,null,"> 132kV*",329.11,378.48,99.71,114.67,54.11,62.23,107.34,123.44,73.87,84.95,46.85,53.88,11.78,13.55]
["WEPS","We",2,1,"We21N",null,null,"> 600km and \n≤ 900km","< 500V",369.33,424.73,111.88,128.66,60.73,69.84,120.48,138.55000000000001,82.93,95.37,52.59,60.48,10.57,12.16]
["WEPS","We",2,2,"We22N",null,null,null,"≥ 500V & < 66kV",364.23,418.86,110.35,126.9,59.92,68.91,118.81,136.63,81.78,94.05,51.88,59.66,9.66,11.11]
["WEPS","We",2,3,"We23N",null,null,null,"≥ 66kV & ≤ 132kV",352.69,405.59,106.85,122.88,58.01,66.709999999999994,115.04,132.30000000000001,79.19,91.07,50.24,57.78,9.36,10.76]
["WEPS","We",2,4,"We24N",null,null,null,"> 132kV*",332.42,382.28,100.69,115.79,54.71,62.92,108.43,124.69,74.62,85.81,47.35,54.45,11.95,13.74]
["WEPS","We",3,1,"We31N",null,null,"> 900km","< 500V",373.05,429.01,113.05,130.01,61.36,70.56,121.7,139.96,83.75,96.31,53.15,61.12,10.64,12.24]
["WEPS","We",3,2,"We32N",null,null,null,"≥ 500V & < 66kV",367.85,423.03,111.42,128.13,60.48,69.55,119.97,137.97,82.56,94.94,52.39,60.25,9.77,11.24]
["WEPS","We",3,3,"We33N",null,null,null,"≥ 66kV & ≤ 132kV",356.23,409.66,107.9,124.09,58.59,67.38,116.19,133.62,79.98,91.98,50.74,58.35,9.4499999999999993,10.87]
["WEPS","We",3,4,"We34N",null,null,null,"> 132kV*",335.66,386.01,101.72,116.98,55.27,63.56,109.56,125.99,75.44,86.76,47.88,55.06,12.04,13.85]
[null,null,null,null,null,null,null,null,"* 132 kV or Transmission connected"]
[null,null,null,null,null,null,null,"Distribution network charges"]
[null,null,null,null,null,null,null,"Voltage",null,"Network capacity charge \n[R/kVA/m]",null,"Network demand charge \n[R/kVA/m]",null,"Urban low voltage subsidy charge [R/kVA/m]"]
[null,null,null,null,null,null,null,null,null,null,null,null,null,null,null,null,"Voltage",null,"Ancillary service charge [c/kWh]"]
["Tariff","Tariff nameBillcode","Tx zone","Voltage","Billcode",null,null,null,null,null,"VAT incl",null,"VAT incl",null,"VAT incl",null,null,null,null,"VAT incl"]
["WEPS","We",0,1,"We01N",null,null,"< 500V",null,20.62,{"$f":"ROUND(J29 * (1 + VAT), 2)","v":23.71},39.1,{"$f":"ROUND(L29 * (1 + VAT), 2)","v":44.97},0,{"$f":"ROUND(N29 * (1 + VAT), 2)","v":0},null,"< 500V",null,0.48,{"$f":"ROUND(S29 * (1 + VAT), 2)","v":0.55000000000000004}]
["WEPS","We",0,2,"We02N",null,null,"≥ 500V & < 66kV",null,18.91,{"$f":"ROUND(J30 * (1 + VAT), 2)","v":21.75},35.869999999999997,{"$f":"ROUND(L30 * (1 + VAT), 2)","v":41.25},0,{"$f":"ROUND(N30 * (1 + VAT), 2)","v":0},null,"≥ 500V & < 66kV",null,0.47,{"$f":"ROUND(S30 * (1 + VAT), 2)","v":0.54}]
["WEPS","We",0,3,"We03N",null,null,"≥ 66kV & ≤ 132kV",null,6.75,{"$f":"ROUND(J31 * (1 + VAT), 2)","v":7.76},12.51,{"$f":"ROUND(L31 * (1 + VAT), 2)","v":14.39},16.66,{"$f":"ROUND(N31 * (1 + VAT), 2)","v":19.16},null,"≥ 66kV & ≤ 132kV",null,0.45,{"$f":"ROUND(S31 * (1 + VAT), 2)","v":0.52}]
["WEPS","We",0,4,"We04N",null,null,"> 132kV*",null,0,{"$f":"ROUND(J32 * (1 + VAT), 2)","v":0},0,{"$f":"ROUND(L32 * (1 + VAT), 2)","v":0},16.66,{"$f":"ROUND(N32 * (1 + VAT), 2)","v":19.16},null,"> 132kV*",null,0.42,{"$f":"ROUND(S32 * (1 + VAT), 2)","v":0.48}]
[null,null,null,null,null,null,null,"* 132 kV or Transmission connected",null,null,null,null,null,null,null,null,"* 132 kV or Transmission connected"]
[]
[null,null,null,null,null,null,null,"Customer categories",null,"Service charge  [R/account/day]",null,"Administration charge  [R/POD/day]",null,null,null,null,"Reactive energy charge  [c/kVArh]"]
[]
["Tariff","Tariff nameBillcode","Tx zone","Voltage","Billcode",null,null,null,null,null,"VAT incl",null,"VAT incl",null,null,null,"High season",null,"Low season"]
["WEPS","We",0,1,"We01N",null,null,"≤ 100 kVA",null,16.850000000000001,{"$f":"ROUND(J38 * (1 + VAT), 2)","v":19.38},3.7,{"$f":"ROUND(L38 * (1 + VAT), 2)","v":4.26},null,null,null,null,"VAT incl",null,"VAT incl"]
["WEPS","We",0,1,"We01N",null,null,"> 100 kVA & ≤ 500 kVA",null,76.94,{"$f":"ROUND(J39 * (1 + VAT), 2)","v":88.48},21.58,{"$f":"ROUND(L39 * (1 + VAT), 2)","v":24.82},null,null,null,16.68,{"$f":"ROUND(Q39 * (1 + VAT), 2)","v":19.18},0,{"$f":"ROUND(S39 * (1 + VAT), 2)","v":0}]
["WEPS","We",0,1,"We01N",null,null,"> 500 kVA & ≤ 1 MVA",null,236.74,{"$f":"ROUND(J40 * (1 + VAT), 2)","v":272.25},42.85,{"$f":"ROUND(L40 * (1 + VAT), 2)","v":49.28}]
["WEPS","We",0,1,"We01N",null,null,"> 1 MVA",null,236.74,{"$f":"ROUND(J41 * (1 + VAT), 2)","v":272.25},106.69,{"$f":"ROUND(L41 * (1 + VAT), 2)","v":122.69}]
["WEPS","We",0,1,"We01N",null,null,"Key customers",null,4639.2,{"$f":"ROUND(J42 * (1 + VAT), 2)","v":5335.08},148.16,{"$f":"ROUND(L42 * (1 + VAT), 2)","v":170.38}]
[]
[]
[null,null,null,null,null,null,null,"Electrification and rural network subsidy charge  [c/kWh]",null,"Affordability subsidy charge [c/kWh] \nOnly payable by non-local authority tariffs"]
[]
[]
["Tariff","Tariff nameBillcode","Tx zone","Voltage","Billcode",null,null,null,"VAT incl",null,"VAT incl"]
["WEPS","We",0,1,"We01N",null,null,9.2200000000000006,{"$f":"ROUND(H49 * (1 + VAT), 2)","v":10.6},4.34,{"$f":"ROUND(J49 * (1 + VAT), 2)","v":4.99}]
[]
[]
[null,null,null,null,null,null,null,"Active energy charge excluding losses   [c/kWh]"]
[null,null,null,null,null,null,null,"High demand season [Jun - Aug]",null,null,null,null,null,"Low demand season [Sep - May]"]
[null,null,null,null,null,null,null,"Peak",null,"Standard",null,"Off Peak",null,"Peak",null,"Standard",null,"Off Peak"]
["Tariff","Tariff nameBillcode","Tx zone","Voltage","Billcode",null,null,null,"VAT incl",null,"VAT incl",null,"VAT incl",null,"VAT incl",null,"VAT incl",null,"VAT incl"]
["WEPS","We",0,1,"We01N",null,null,{"$f":"ROUND(J11/'Loss Factors'!$T$6, 2)","v":322.39},{"$f":"ROUND(H56 * (1 + VAT), 2)","v":370.75},{"$f":"ROUND(L11/'Loss Factors'!$T$6, 2)","v":97.66},{"$f":"ROUND(J56 * (1 + VAT), 2)","v":112.31},{"$f":"ROUND(N11/'Loss Factors'!$T$6, 2)","v":53.04},{"$f":"ROUND(L56 * (1 + VAT), 2)","v":61},{"$f":"ROUND(P11/'Loss Factors'!$T$6, 2)","v":105.19},{"$f":"ROUND(N56 * (1 + VAT), 2)","v":120.97},{"$f":"ROUND(R11/'Loss Factors'!$T$6, 2)","v":72.38},{"$f":"ROUND(P56 * (1 + VAT), 2)","v":83.24},{"$f":"ROUND(T11/'Loss Factors'!$T$6, 2)","v":45.93},{"$f":"ROUND(R56 * (1 + VAT), 2)","v":52.82}]
[]
[null,null,null,null,null,null,null,"Active energy charge excluding losses and enviromental levy   [c/kWh]"]
[null,null,null,null,null,null,null,"High demand season [Jun - Aug]",null,null,null,null,null,"Low demand season [Sep - May]"]
[null,null,null,null,null,null,null,"Peak",null,"Standard",null,"Off Peak",null,"Peak",null,"Standard",null,"Off Peak"]
["Tariff","Tariff nameBillcode","Tx zone","Voltage","Billcode",null,null,null,"VAT incl",null,"VAT incl",null,"VAT incl",null,"VAT incl",null,"VAT incl",null,"VAT incl"]
["WEPS","We",0,1,"We01N",null,null,{"$f":"H56-ROUND(#REF!,2)","v":{"$error":"#REF!"}},{"$f":"ROUND(H62 * (1 + VAT), 2)","v":{"$error":"#REF!"}},{"$f":"J56-ROUND(#REF!,2)","v":{"$error":"#REF!"}},{"$f":"ROUND(J62 * (1 + VAT), 2)","v":{"$error":"#REF!"}},{"$f":"L56-ROUND(#REF!,2)","v":{"$error":"#REF!"}},{"$f":"ROUND(L62 * (1 + VAT), 2)","v":{"$error":"#REF!"}},{"$f":"N56-ROUND(#REF!,2)","v":{"$error":"#REF!"}},{"$f":"ROUND(N62 * (1 + VAT), 2)","v":{"$error":"#REF!"}},{"$f":"P56-ROUND(#REF!,2)","v":{"$error":"#REF!"}},{"$f":"ROUND(P62 * (1 + VAT), 2)","v":{"$error":"#REF!"}},{"$f":"R56-ROUND(#REF!,2)","v":{"$error":"#REF!"}},{"$f":"ROUND(R62 * (1 + VAT), 2)","v":{"$error":"#REF!"}}]

{"sheet":"WEPS Munic","index":2,"n_rows":62,"n_cols":23,"rows_kept":62,"cut":false,"hidden":false,"merged":[[1,6,1,23],[3,21,5,22],[11,7,14,7],[3,9,3,20],[4,7,6,7],[4,9,4,14],[4,15,4,20],[5,9,5,10],[5,11,5,12],[5,13,5,14],[5,15,5,16],[5,17,5,18],[5,19,5,20],[7,7,10,7],[29,7,29,8],[15,7,18,7],[19,7,22,7],[24,7,24,14],[25,7,26,8],[25,9,26,10],[25,11,26,12],[25,13,26,14],[26,18,26,19],[27,7,27,8],[28,7,28,8],[28,16,28,17],[26,16,27,17],[44,7,46,8],[39,7,39,8],[30,7,30,8],[30,16,30,17],[31,7,31,8],[31,16,31,17],[34,7,34,8],[34,9,35,10],[34,11,35,12],[34,16,34,19],[36,7,36,8],[36,16,36,17],[36,18,36,19],[37,7,37,8],[38,7,38,8],[53,7,53,8],[53,9,53,10],[53,11,53,12],[53,13,53,14],[53,15,53,16],[29,16,29,17],[57,7,57,18],[58,7,58,12],[58,13,58,18],[59,7,59,8],[59,9,59,10],[59,11,59,12],[59,13,59,14],[59,15,59,16],[59,17,59,18],[53,17,53,18],[40,7,40,8],[41,7,41,8],[51,7,51,18],[52,7,52,12],[52,13,52,18]]}
[null,null,null,null,null,null,"Back to menu"]
["Municiple",null,null,null,null,null,"WEPS  – Local Authority"]
[]
[null,null,null,null,null,null,null,null,null,"Active energy charge [c/kWh]",null,null,null,null,null,null,null,null,null,null,null,"Transmission network charges [R/kVA/m]"]
[null,null,null,null,null,null,null,"Transmission zone",null,"High demand season [Jun - Aug]",null,null,null,null,null,"Low demand season [Sep - May]"]
[null,null,null,null,null,null,null,null,"Voltage","Peak",null,"Standard",null,"Off Peak",null,"Peak",null,"Standard",null,"Off Peak"]
["Tariff","Tariff nameBillcode","Tx zone","Voltage","Billcode",null,null,null,null,null,"VAT incl",null,"VAT incl",null,"VAT incl",null,"VAT incl",null,"VAT incl",null,"VAT incl",null,"VAT incl"]
["WEPS","We",0,1,{"$f":"B8&C8&D8&IF($A$2=\"Non-municipal\",\"N\",IF($A$2=\"Municiple\",\"Y\",\"error\"))","v":"We01Y"},null,null,"≤ 300km","< 500V",371.05,{"$f":"ROUND(J8 * (1 + VAT), 2)","v":426.71},112.91,{"$f":"ROUND(L8 * (1 + VAT), 2)","v":129.85},61.61,{"$f":"ROUND(N8 * (1 + VAT), 2)","v":70.849999999999994},121.48,{"$f":"ROUND(P8 * (1 + VAT), 2)","v":139.69999999999999},83.84,{"$f":"ROUND(R8 * (1 + VAT), 2)","v":96.42},53.44,{"$f":"ROUND(T8 * (1 + VAT), 2)","v":61.46},10.34,{"$f":"ROUND(V8 * (1 + VAT), 2)","v":11.89}]
["WEPS","We",0,2,{"$f":"B9&C9&D9&IF($A$2=\"Non-municipal\",\"N\",IF($A$2=\"Municiple\",\"Y\",\"error\"))","v":"We02Y"},null,null,null,"≥ 500V & < 66kV",365.2,419.98,110.65,127.25,60.09,69.099999999999994,119.13,137,81.99,94.29,52.03,59.83,9.43,10.84]
["WEPS","We",0,3,"We03Y",null,null,null,"≥ 66kV & ≤ 132kV",353.68,406.73,107.14,123.21,58.19,66.92,115.38,132.69,79.42,91.33,50.37,57.93,9.18,10.56]
["WEPS","We",0,4,"We04Y",null,null,null,"> 132kV*",333.32,383.32,100.98,116.13,54.83,63.05,108.73,125.04,74.83,86.05,47.47,54.59,11.62,13.36]
["WEPS","We",1,1,"We11Y",null,null,"> 300km and \n≤ 600km","< 500V",374.08,430.19,113.32,130.32,61.53,70.760000000000005,122.03,140.33000000000001,84.01,96.61,53.29,61.28,10.38,11.94]
["WEPS","We",1,2,"We12Y",null,null,null,"≥ 500V & < 66kV",368.85,424.18,111.74,128.5,60.68,69.78,120.34,138.38999999999999,82.82,95.24,52.53,60.41,9.5399999999999991,10.97]
["WEPS","We",1,3,"We13Y",null,null,null,"≥ 66kV & ≤ 132kV",357.14,410.71,108.18,124.41,58.74,67.55,116.5,133.97999999999999,80.180000000000007,92.21,50.85,58.48,9.25,10.64]
["WEPS","We",1,4,"We14Y",null,null,null,"> 132kV*",336.65,387.15,102,117.3,55.37,63.68,109.8,126.27,75.59,86.93,47.94,55.13,11.73,13.49]
["WEPS","We",2,1,"We21Y",null,null,"> 600km and \n≤ 900km","< 500V",377.81,434.48,114.46,131.63,62.14,71.459999999999994,123.23,141.71,84.84,97.57,53.82,61.89,10.52,12.1]
["WEPS","We",2,2,"We22Y",null,null,null,"≥ 500V & < 66kV",372.57,428.46,112.85,129.78,61.29,70.48,121.56,139.79,83.61,96.15,53.07,61.03,9.6,11.04]
["WEPS","We",2,3,"We23Y",null,null,null,"≥ 66kV & ≤ 132kV",360.78,414.9,109.27,125.66,59.33,68.23,117.65,135.30000000000001,80.98,93.13,51.35,59.05,9.32,10.72]
["WEPS","We",2,4,"We24Y",null,null,null,"> 132kV*",340.02,391.02,103.02,118.47,55.93,64.319999999999993,110.93,127.57,76.34,87.79,48.43,55.69,11.89,13.67]
["WEPS","We",3,1,"We31Y",null,null,"> 900km","< 500V",381.6,438.84,115.61,132.94999999999999,62.78,72.2,124.49,143.16,85.67,98.52,54.36,62.51,10.57,12.16]
["WEPS","We",3,2,"We32Y",null,null,null,"≥ 500V & < 66kV",376.29,432.73,113.98,131.08000000000001,61.91,71.2,122.73,141.13999999999999,84.47,97.14,53.57,61.61,9.7100000000000009,11.17]
["WEPS","We",3,3,"We33Y",null,null,null,"≥ 66kV & ≤ 132kV",364.41,419.07,110.4,126.96,59.95,68.94,118.86,136.69,81.790000000000006,94.06,51.89,59.67,9.4,10.81]
["WEPS","We",3,4,"We34Y",null,null,null,"> 132kV*",343.37,394.88,104.07,119.68,56.55,65.03,112.06,128.87,77.14,88.71,48.96,56.3,11.97,13.77]
[null,null,null,null,null,null,null,null,"* 132 kV or Transmission connected"]
[null,null,null,null,null,null,null,"Distribution network charges"]
[null,null,null,null,null,null,null,"Voltage",null,"Network capacity charge \n[R/kVA/m]",null,"Network demand charge \n[R/kVA/m]",null,"Urban low voltage subsidy charge [R/kVA/m]"]
[null,null,null,null,null,null,null,null,null,null,null,null,null,null,null,null,"Voltage",null,"Ancillary service charge [c/kWh]"]
["Tariff","Tariff nameBillcode","Tx zone","Voltage","Billcode",null,null,null,null,null,"VAT incl",null,"VAT incl",null,"VAT incl",null,null,null,null,"VAT incl"]
["WEPS","We",0,1,{"$f":"B29&C29&D29&IF($A$2=\"Non-municipal\",\"N\",IF($A$2=\"Municiple\",\"Y\",\"error\"))","v":"We01Y"},null,null,"< 500V",null,20.62,{"$f":"ROUND(J29 * (1 + VAT), 2)","v":23.71},39.07,{"$f":"ROUND(L29 * (1 + VAT), 2)","v":44.93},0,{"$f":"ROUND(N29 * (1 + VAT), 2)","v":0},null,"< 500V",null,0.48,{"$f":"ROUND(S29 * (1 + VAT), 2)","v":0.55000000000000004}]
["WEPS","We",0,2,{"$f":"B30&C30&D30&IF($A$2=\"Non-municipal\",\"N\",IF($A$2=\"Municiple\",\"Y\",\"error\"))","v":"We02Y"},null,null,"≥ 500V & < 66kV",null,18.899999999999999,{"$f":"ROUND(J30 * (1 + VAT), 2)","v":21.74},35.83,{"$f":"ROUND(L30 * (1 + VAT), 2)","v":41.2},0,{"$f":"ROUND(N30 * (1 + VAT), 2)","v":0},null,"≥ 500V & < 66kV",null,0.47,{"$f":"ROUND(S30 * (1 + VAT), 2)","v":0.54}]
["WEPS","We",0,3,{"$f":"B31&C31&D31&IF($A$2=\"Non-municipal\",\"N\",IF($A$2=\"Municiple\",\"Y\",\"error\"))","v":"We03Y"},null,null,"≥ 66kV & ≤ 132kV",null,6.76,{"$f":"ROUND(J31 * (1 + VAT), 2)","v":7.77},12.5,{"$f":"ROUND(L31 * (1 + VAT), 2)","v":14.38},16.55,{"$f":"ROUND(N31 * (1 + VAT), 2)","v":19.03},null,"≥ 66kV & ≤ 132kV",null,0.43,{"$f":"ROUND(S31 * (1 + VAT), 2)","v":0.49}]
["WEPS","We",0,4,{"$f":"B32&C32&D32&IF($A$2=\"Non-municipal\",\"N\",IF($A$2=\"Municiple\",\"Y\",\"error\"))","v":"We04Y"},null,null,"> 132kV*",null,0,{"$f":"ROUND(J32 * (1 + VAT), 2)","v":0},0,{"$f":"ROUND(L32 * (1 + VAT), 2)","v":0},16.55,{"$f":"ROUND(N32 * (1 + VAT), 2)","v":19.03},null,"> 132kV*",null,0.41,{"$f":"ROUND(S32 * (1 + VAT), 2)","v":0.47}]
[null,null,null,null,null,null,null,"* 132 kV or Transmission connected",null,null,null,null,null,null,null,null,"* 132 kV or Transmission connected"]
[]
[null,null,null,null,null,null,null,"Customer categories",null,"Service charge  [R/account/day]",null,"Administration charge  [R/POD/day]",null,null,null,null,"Reactive energy charge  [c/kVArh]"]
[]
["Tariff","Tariff nameBillcode","Tx zone","Voltage","Billcode",null,null,null,null,null,"VAT incl",null,"VAT incl",null,null,null,"High season",null,"Low season"]
["WEPS","We",0,1,{"$f":"B38&C38&D38&IF($A$2=\"Non-municipal\",\"N\",IF($A$2=\"Municiple\",\"Y\",\"error\"))","v":"We01Y"},null,null,"≤ 100 kVA",null,16.739999999999998,{"$f":"ROUND(J38 * (1 + VAT), 2)","v":19.25},3.67,{"$f":"ROUND(L38 * (1 + VAT), 2)","v":4.22},null,null,null,null,"VAT incl",null,"VAT incl"]
["WEPS","We",0,1,{"$f":"B39&C39&D39&IF($A$2=\"Non-municipal\",\"N\",IF($A$2=\"Municiple\",\"Y\",\"error\"))","v":"We01Y"},null,null,"> 100 kVA & ≤ 500 kVA",null,76.5,{"$f":"ROUND(J39 * (1 + VAT), 2)","v":87.98},21.43,{"$f":"ROUND(L39 * (1 + VAT), 2)","v":24.64},null,null,null,16.559999999999999,{"$f":"ROUND(Q39 * (1 + VAT), 2)","v":19.04},0,{"$f":"ROUND(S39 * (1 + VAT), 2)","v":0}]
["WEPS","We",0,1,{"$f":"B40&C40&D40&IF($A$2=\"Non-municipal\",\"N\",IF($A$2=\"Municiple\",\"Y\",\"error\"))","v":"We01Y"},null,null,"> 500 kVA & ≤ 1 MVA",null,235.44,{"$f":"ROUND(J40 * (1 + VAT), 2)","v":270.76},42.62,{"$f":"ROUND(L40 * (1 + VAT), 2)","v":49.01}]
["WEPS","We",0,1,{"$f":"B41&C41&D41&IF($A$2=\"Non-municipal\",\"N\",IF($A$2=\"Municiple\",\"Y\",\"error\"))","v":"We01Y"},null,null,"> 1 MVA",null,235.44,{"$f":"ROUND(J41 * (1 + VAT), 2)","v":270.76},106.13,{"$f":"ROUND(L41 * (1 + VAT), 2)","v":122.05}]
["WEPS","We",0,1,{"$f":"B42&C42&D42&IF($A$2=\"Non-municipal\",\"N\",IF($A$2=\"Municiple\",\"Y\",\"error\"))","v":"We01Y"},null,null,"Key customers",null,4613.6899999999996,{"$f":"ROUND(J42 * (1 + VAT), 2)","v":5305.74},147.34,{"$f":"ROUND(L42 * (1 + VAT), 2)","v":169.44}]
[]
[]
[null,null,null,null,null,null,null,"Electrification and rural network subsidy charge  [c/kWh]"]
[]
[]
["Tariff","Tariff nameBillcode","Tx zone","Voltage","Billcode",null,null,null,"VAT incl"]
["WEPS","We",0,1,{"$f":"B49&C49&D49&IF($A$2=\"Non-municipal\",\"N\",IF($A$2=\"Municiple\",\"Y\",\"error\"))","v":"We01Y"},null,null,9.17,{"$f":"ROUND(H49 * (1 + VAT), 2)","v":10.55}]
[]
[]
[null,null,null,null,null,null,null,"Active energy charge excluding losses   [c/kWh]"]
[null,null,null,null,null,null,null,"High demand season [Jun - Aug]",null,null,null,null,null,"Low demand season [Sep - May]"]
[null,null,null,null,null,null,null,"Peak",null,"Standard",null,"Off Peak",null,"Peak",null,"Standard",null,"Off Peak"]
["Tariff","Tariff nameBillcode","Tx zone","Voltage","Billcode",null,null,null,"VAT incl",null,"VAT incl",null,"VAT incl",null,"VAT incl",null,"VAT incl",null,"VAT incl"]
["WEPS","We",0,1,{"$f":"B56&C56&D56&IF($A$2=\"Non-municipal\",\"N\",IF($A$2=\"Municiple\",\"Y\",\"error\"))","v":"We01Y"},null,null,{"$f":"ROUND(J11/'Loss Factors'!$T$6, 2)","v":329.79},{"$f":"ROUND(H56 * (1 + VAT), 2)","v":379.26},{"$f":"ROUND(L11/'Loss Factors'!$T$6, 2)","v":99.91},{"$f":"ROUND(J56 * (1 + VAT), 2)","v":114.9},{"$f":"ROUND(N11/'Loss Factors'!$T$6, 2)","v":54.25},{"$f":"ROUND(L56 * (1 + VAT), 2)","v":62.39},{"$f":"ROUND(P11/'Loss Factors'!$T$6, 2)","v":107.58},{"$f":"ROUND(N56 * (1 + VAT), 2)","v":123.72},{"$f":"ROUND(R11/'Loss Factors'!$T$6, 2)","v":74.040000000000006},{"$f":"ROUND(P56 * (1 + VAT), 2)","v":85.15},{"$f":"ROUND(T11/'Loss Factors'!$T$6, 2)","v":46.97},{"$f":"ROUND(R56 * (1 + VAT), 2)","v":54.02}]
[]
[null,null,null,null,null,null,null,"Active energy charge excluding losses and enviromental levy   [c/kWh]"]
[null,null,null,null,null,null,null,"High demand season [Jun - Aug]",null,null,null,null,null,"Low demand season [Sep - May]"]
[null,null,null,null,null,null,null,"Peak",null,"Standard",null,"Off Peak",null,"Peak",null,"Standard",null,"Off Peak"]
["Tariff","Tariff nameBillcode","Tx zone","Voltage","Billcode",null,null,null,"VAT incl",null,"VAT incl",null,"VAT incl",null,"VAT incl",null,"VAT incl",null,"VAT incl"]
["WEPS","We",0,1,{"$f":"B62&C62&D62&IF($A$2=\"Non-municipal\",\"N\",IF($A$2=\"Municiple\",\"Y\",\"error\"))","v":"We01Y"},null,null,326.3,{"$f":"ROUND(H62 * (1 + VAT), 2)","v":375.25},96.42,{"$f":"ROUND(J62 * (1 + VAT), 2)","v":110.88},50.76,{"$f":"ROUND(L62 * (1 + VAT), 2)","v":58.37},104.09,{"$f":"ROUND(N62 * (1 + VAT), 2)","v":119.7},70.550000000000011,{"$f":"ROUND(P62 * (1 + VAT), 2)","v":81.13},43.48,{"$f":"ROUND(R62 * (1 + VAT), 2)","v":50}]

{"sheet":"Nightsave Large NLA","index":3,"n_rows":47,"n_cols":33,"rows_kept":47,"cut":false,"hidden":false,"merged":[[3,17,5,18],[1,6,1,19],[7,7,10,7],[11,7,14,7],[15,7,18,7],[3,9,3,12],[3,13,3,16],[4,7,6,7],[4,9,5,10],[4,11,5,12],[4,13,5,14],[4,15,5,16],[19,7,22,7],[25,7,25,14],[35,13,37,14],[26,7,27,8],[37,15,37,16],[32,7,32,8],[35,7,36,7],[35,8,36,9],[35,10,36,11],[35,15,36,16],[27,17,27,18],[28,7,28,8],[29,7,29,8],[30,7,30,8],[31,7,31,8],[26,9,27,10],[26,11,27,12],[26,13,27,14]]}
[null,null,null,null,null,null,null,"Back to menu"]
["Non-municipal",null,null,null,null,null,"Nightsave Urban Large – Non-local Authority",null,null,null,null,null,null,null,null,null,null,null,null,null,null,null,null,null,null,null,null,null,null,null,null,null,"check value"]
[]
[null,null,null,null,null,null,null,null,null,"Active energy charge [c/kWh]",null,null,null,"Energy demand charge [R/kVA/m]",null,null,null,"Transmission network charges [R/kVA/m]"]
[null,null,null,null,null,null,null,"Transmission zone",null,"High demand season \n[Jun - Aug]",null,"Low demand season \n[Sep - May]",null,"High demand season \n[Jun - Aug]",null,"Low demand season \n[Sep - May]"]
[null,null,null,null,null,null,null,null,"Voltage"]
["Tariff","Tariff nameBillcode","Tx zone","Voltage","Billcode",null,null,null,null,"","VAT incl",null,"VAT incl","","VAT incl",null,"VAT incl",null,"VAT incl"]
["Nightsave Large","NL",0,1,{"$f":"B8&C8&D8&IF($A$2=\"Non-municipal\",\"N\",IF($A$2=\"Municiple\",\"Y\",\"error\"))","v":"NL01N"},null,null,"≤ 300km","< 500V",89.59,{"$f":"ROUND(J8 * (1 + VAT), 2)","v":103.03},69.64,{"$f":"ROUND(L8 * (1 + VAT), 2)","v":80.09},272.60000000000002,{"$f":"ROUND(N8 * (1 + VAT), 2)","v":313.49},38.1,{"$f":"ROUND(P8 * (1 + VAT), 2)","v":43.82},10.38,{"$f":"ROUND(R8 * (1 + VAT), 2)","v":11.94}]
["Nightsave Large","NL",0,2,{"$f":"B9&C9&D9&IF($A$2=\"Non-municipal\",\"N\",IF($A$2=\"Municiple\",\"Y\",\"error\"))","v":"NL02N"},null,null,null,"≥ 500V & < 66kV",84.83,97.55,66.22,76.150000000000006,263.83999999999997,303.42,36.880000000000003,42.41,9.48,10.9]
["Nightsave Large","NL",0,3,"NL03N",null,null,null,"≥ 66kV & ≤ 132kV",84.21,96.84,65.430000000000007,75.239999999999995,254.23,292.36,35.54,40.869999999999997,9.23,10.61]
["Nightsave Large","NL",0,4,"NL04N",null,null,null,"> 132kV*",78.77,90.59,61.25,70.44,245.24,282.02999999999997,34.28,39.42,11.67,13.42]
["Nightsave Large","NL",1,1,"NL11N",null,null,"> 300km and \n≤ 600km","< 500V",90.79,104.41,70.41,80.97,275.39999999999998,316.70999999999998,38.47,44.24,10.45,12.02]
["Nightsave Large","NL",1,2,"NL12N",null,null,null,"≥ 500V & < 66kV",86.62,99.61,67.569999999999993,77.709999999999994,266.52,306.5,37.21,42.79,9.57,11.01]
["Nightsave Large","NL",1,3,"NL13N",null,null,null,"≥ 66kV & ≤ 132kV",85.97,98.87,66.760000000000005,76.77,256.74,295.25,35.869999999999997,41.25,9.3000000000000007,10.7]
["Nightsave Large","NL",1,4,"NL14N",null,null,null,"> 132kV*",80.44,92.51,62.5,71.88,247.74,284.89999999999998,34.590000000000003,39.78,11.78,13.55]
["Nightsave Large","NL",2,1,"NL21N",null,null,"> 600km and \n≤ 900km","< 500V",91.63,105.37,71.09,81.75,278.23,319.95999999999998,38.86,44.69,10.57,12.16]
["Nightsave Large","NL",2,2,"NL22N",null,null,null,"≥ 500V & < 66kV",87.48,100.6,68.27,78.510000000000005,269.19,309.57,37.619999999999997,43.26,9.66,11.11]
["Nightsave Large","NL",2,3,"NL23N",null,null,null,"≥ 66kV & ≤ 132kV",86.81,99.83,67.42,77.53,259.33,298.23,36.229999999999997,41.66,9.36,10.76]
["Nightsave Large","NL",2,4,"NL24N",null,null,null,"> 132kV*",81.22,93.4,63.14,72.61,250.21,287.74,34.93,40.17,11.95,13.74]
["Nightsave Large","NL",3,1,"NL31N",null,null,"> 900km","< 500V",92.61,106.5,71.81,82.58,280.92,323.06,39.229999999999997,45.11,10.64,12.24]
["Nightsave Large","NL",3,2,"NL32N",null,null,null,"≥ 500V & < 66kV",88.32,101.57,68.930000000000007,79.27,271.89,312.67,37.950000000000003,43.64,9.77,11.24]
["Nightsave Large","NL",3,3,"NL33N",null,null,null,"≥ 66kV & ≤ 132kV",87.71,100.87,68.069999999999993,78.28,261.98,301.27999999999997,36.6,42.09,9.4499999999999993,10.87]
["Nightsave Large","NL",3,4,"NL34N",null,null,null,"> 132kV*",82.08,94.39,63.83,73.400000000000006,252.75,290.66000000000003,35.29,40.58,12.04,13.85]
[null,null,null,null,null,null,null,null,"* 132 kV or Transmission connected"]
[]
[null,null,null,null,null,null,null,"Distribution network charges"]
[null,null,null,null,null,null,null,"Voltage",null,"Network capacity charge \n[R/kVA/m]",null,"Network demand charge \n[R/kVA/m]",null,"Urban low voltage subsidy charge [R/kVA/m]"]
[null,null,null,null,null,null,null,null,null,null,null,null,null,null,null,null,"Voltage","Ancillary service charge [c/kWh]"]
["Tariff","Tariff nameBillcode","Tx zone","Voltage","Billcode",null,null,null,null,null,"VAT incl",null,"VAT incl",null,"VAT incl",null,null,null,"VAT incl"]
["Nightsave Large","NL",0,1,{"$f":"B30&C30&D30&IF($A$2=\"Non-municipal\",\"N\",IF($A$2=\"Municiple\",\"Y\",\"error\"))","v":"NL01N"},null,null,"< 500V",null,20.62,{"$f":"ROUND(J30 * (1 + VAT), 2)","v":23.71},39.1,{"$f":"ROUND(L30 * (1 + VAT), 2)","v":44.97},0,{"$f":"ROUND(N30 * (1 + VAT), 2)","v":0},null,"< 500V",0.48,{"$f":"ROUND(R30 * (1 + VAT), 2)","v":0.55000000000000004}]
["Nightsave Large","NL",0,2,{"$f":"B31&C31&D31&IF($A$2=\"Non-municipal\",\"N\",IF($A$2=\"Municiple\",\"Y\",\"error\"))","v":"NL02N"},null,null,"≥ 500V & < 66kV",null,18.91,{"$f":"ROUND(J31 * (1 + VAT), 2)","v":21.75},35.869999999999997,{"$f":"ROUND(L31 * (1 + VAT), 2)","v":41.25},0,{"$f":"ROUND(N31 * (1 + VAT), 2)","v":0},null,"≥ 500V & < 66kV",0.47,{"$f":"ROUND(R31 * (1 + VAT), 2)","v":0.54}]
["Nightsave Large","NL",0,3,{"$f":"B32&C32&D32&IF($A$2=\"Non-municipal\",\"N\",IF($A$2=\"Municiple\",\"Y\",\"error\"))","v":"NL03N"},null,null,"≥ 66kV & ≤ 132kV",null,6.75,{"$f":"ROUND(J32 * (1 + VAT), 2)","v":7.76},12.51,{"$f":"ROUND(L32 * (1 + VAT), 2)","v":14.39},16.66,{"$f":"ROUND(N32 * (1 + VAT), 2)","v":19.16},null,"≥ 66kV & ≤ 132kV",0.45,{"$f":"ROUND(R32 * (1 + VAT), 2)","v":0.52}]
["Nightsave Large","NL",0,4,{"$f":"B33&C33&D33&IF($A$2=\"Non-municipal\",\"N\",IF($A$2=\"Municiple\",\"Y\",\"error\"))","v":"NL04N"},null,null,"> 132kV / Transmission connected",null,0,{"$f":"ROUND(J33 * (1 + VAT), 2)","v":0},0,{"$f":"ROUND(L33 * (1 + VAT), 2)","v":0},16.66,{"$f":"ROUND(N33 * (1 + VAT), 2)","v":19.16},null,"> 132kV*",0.42,{"$f":"ROUND(R33 * (1 + VAT), 2)","v":0.48}]
[null,null,null,null,null,null,null,null,null,null,null,null,null,null,null,null,"* 132 kV or Transmission connected"]
[]
[null,null,null,null,null,null,null,"Customer categories","Service charge  [R/account/day]",null,"Administration charge  [R/POD/day]",null,null,"Electrification and rural network subsidy charge  [c/kWh]",null,"Affordability subsidy charge [c/kWh] \nOnly payable by non-local authority tariffs"]
[]
["Tariff","Tariff nameBillcode","Tx zone","Voltage","Billcode",null,null,null,null,"VAT incl",null,"VAT incl"]
["Nightsave Large","NL",0,1,{"$f":"B39&C39&D39&IF($A$2=\"Non-municipal\",\"N\",IF($A$2=\"Municiple\",\"Y\",\"error\"))","v":"NL01N"},null,null,">1  MVA",236.74,{"$f":"ROUND(I39 * (1 + VAT), 2)","v":272.25},106.69,{"$f":"ROUND(K39 * (1 + VAT), 2)","v":122.69},null,null,"VAT incl",null,"VAT incl"]
["Nightsave Large","NL",0,1,{"$f":"B40&C40&D40&IF($A$2=\"Non-municipal\",\"N\",IF($A$2=\"Municiple\",\"Y\",\"error\"))","v":"NL01N"},null,null,"Key customers",4639.2,{"$f":"ROUND(I40 * (1 + VAT), 2)","v":5335.08},148.16,{"$f":"ROUND(K40 * (1 + VAT), 2)","v":170.38},null,9.2200000000000006,{"$f":"ROUND(N40 * (1 + VAT), 2)","v":10.6},4.34,{"$f":"ROUND(P40 * (1 + VAT), 2)","v":4.99}]
[]
[]
[]
[]
[]
["Tariff","Tariff nameBillcode","Tx zone","Voltage","Billcode"]
["Nightsave Large","NL",0,1,{"$f":"B47&C47&D47&IF($A$2=\"Non-municipal\",\"N\",IF($A$2=\"Municiple\",\"Y\",\"error\"))","v":"NL01N"}]

{"sheet":"Nightsave Large Munic","index":4,"n_rows":47,"n_cols":33,"rows_kept":47,"cut":false,"hidden":false,"merged":[[3,17,5,18],[1,6,1,19],[7,7,10,7],[11,7,14,7],[15,7,18,7],[3,9,3,12],[3,13,3,16],[4,7,6,7],[4,9,5,10],[4,11,5,12],[4,13,5,14],[4,15,5,16],[19,7,22,7],[25,7,25,14],[35,7,36,7],[35,8,36,9],[35,10,36,11],[35,13,37,14],[32,7,32,8],[27,17,27,18],[28,7,28,8],[29,7,29,8],[30,7,30,8],[31,7,31,8],[26,7,27,8],[26,9,27,10],[26,11,27,12],[26,13,27,14]]}
[null,null,null,null,null,null,null,"Back to menu"]
["Municiple",null,null,null,null,null,"Nightsave Urban Large – Local Authority",null,null,null,null,null,null,null,null,null,null,null,null,null,null,null,null,null,null,null,null,null,null,null,null,null,"check value"]
[]
[null,null,null,null,null,null,null,null,null,"Active energy charge [c/kWh]",null,null,null,"Energy demand charge [R/kVA/m]",null,null,null,"Transmission network charges [R/kVA/m]"]
[null,null,null,null,null,null,null,"Transmission zone",null,"High demand season \n[Jun - Aug]",null,"Low demand season \n[Sep - May]",null,"High demand season \n[Jun - Aug]",null,"Low demand season \n[Sep - May]"]
[null,null,null,null,null,null,null,null,"Voltage"]
["Tariff","Tariff nameBillcode","Tx zone","Voltage","Billcode",null,null,null,null,"","VAT incl",null,"VAT incl","","VAT incl",null,"VAT incl",null,"VAT incl"]
["Nightsave Large","NL",0,1,"NL01Y",null,null,"≤ 300km","< 500V",91.65,{"$f":"ROUND(J8 * (1 + VAT), 2)","v":105.4},71.260000000000005,{"$f":"ROUND(L8 * (1 + VAT), 2)","v":81.95},273.62,{"$f":"ROUND(N8 * (1 + VAT), 2)","v":314.66000000000003},38.229999999999997,{"$f":"ROUND(P8 * (1 + VAT), 2)","v":43.96},10.34,{"$f":"ROUND(R8 * (1 + VAT), 2)","v":11.89}]
["Nightsave Large","NL",0,2,"NL02Y",null,null,null,"≥ 500V & < 66kV",86.78,99.8,67.739999999999995,77.900000000000006,264.83,304.55,37.03,42.58,9.43,10.84]
["Nightsave Large","NL",0,3,"NL03Y",null,null,null,"≥ 66kV & ≤ 132kV",86.14,99.06,66.900000000000006,76.94,255.19,293.47000000000003,35.659999999999997,41.01,9.18,10.56]
["Nightsave Large","NL",0,4,"NL04Y",null,null,null,"> 132kV*",80.59,92.68,62.66,72.06,246.17,283.10000000000002,34.39,39.549999999999997,11.62,13.36]
["Nightsave Large","NL",1,1,"NL11Y",null,null,"> 300km and \n≤ 600km","< 500V",92.84,106.77,72.03,82.83,276.45,317.92,38.6,44.39,10.38,11.94]
["Nightsave Large","NL",1,2,"NL12Y",null,null,null,"≥ 500V & < 66kV",88.59,101.88,69.099999999999994,79.47,267.5,307.63,37.35,42.95,9.5399999999999991,10.97]
["Nightsave Large","NL",1,3,"NL13Y",null,null,null,"≥ 66kV & ≤ 132kV",87.94,101.13,68.3,78.55,257.73,296.39,36.01,41.41,9.25,10.64]
["Nightsave Large","NL",1,4,"NL14Y",null,null,null,"> 132kV*",82.25,94.59,63.95,73.540000000000006,248.67,285.97000000000003,34.729999999999997,39.94,11.73,13.49]
["Nightsave Large","NL",2,1,"NL21Y",null,null,"> 600km and \n≤ 900km","< 500V",93.73,107.79,72.709999999999994,83.62,279.25,321.14,39.01,44.86,10.52,12.1]
["Nightsave Large","NL",2,2,"NL22Y",null,null,null,"≥ 500V & < 66kV",89.48,102.9,69.819999999999993,80.290000000000006,270.22000000000003,310.75,37.76,43.42,9.6,11.04]
["Nightsave Large","NL",2,3,"NL23Y",null,null,null,"≥ 66kV & ≤ 132kV",88.81,102.13,68.98,79.33,260.32,299.37,36.36,41.81,9.32,10.72]
["Nightsave Large","NL",2,4,"NL24Y",null,null,null,"> 132kV*",83.07,95.53,64.59,74.28,251.18,288.86,35.1,40.369999999999997,11.89,13.67]
["Nightsave Large","NL",3,1,"NL31Y",null,null,"> 900km","< 500V",94.73,108.94,73.45,84.47,282,324.3,39.39,45.3,10.57,12.16]
["Nightsave Large","NL",3,2,"NL32Y",null,null,null,"≥ 500V & < 66kV",90.37,103.93,70.489999999999995,81.06,272.92,313.86,38.1,43.82,9.7100000000000009,11.17]
["Nightsave Large","NL",3,3,"NL33Y",null,null,null,"≥ 66kV & ≤ 132kV",89.7,103.16,69.650000000000006,80.099999999999994,262.95,302.39,36.75,42.26,9.4,10.81]
["Nightsave Large","NL",3,4,"NL34Y",null,null,null,"> 132kV*",83.98,96.58,65.31,75.11,253.71,291.77,35.42,40.729999999999997,11.97,13.77]
[null,null,null,null,null,null,null,null,"* 132 kV or Transmission connected"]
[]
[null,null,null,null,null,null,null,"Distribution network charges"]
[null,null,null,null,null,null,null,"Voltage",null,"Network capacity charge \n[R/kVA/m]",null,"Network demand charge \n[R/kVA/m]",null,"Urban low voltage subsidy charge [R/kVA/m]"]
[null,null,null,null,null,null,null,null,null,null,null,null,null,null,null,null,"Voltage","Ancillary service charge [c/kWh]"]
["Tariff","Tariff nameBillcode","Tx zone","Voltage","Billcode",null,null,null,null,null,"VAT incl",null,"VAT incl",null,"VAT incl",null,null,null,"VAT incl"]
["Nightsave Large","NL",0,1,"NL01Y",null,null,"< 500V",null,20.62,{"$f":"ROUND(J30 * (1 + VAT), 2)","v":23.71},39.07,{"$f":"ROUND(L30 * (1 + VAT), 2)","v":44.93},0,{"$f":"ROUND(N30 * (1 + VAT), 2)","v":0},null,"< 500V",0.48,{"$f":"ROUND(R30 * (1 + VAT), 2)","v":0.55000000000000004}]
["Nightsave Large","NL",0,2,"NL02Y",null,null,"≥ 500V & < 66kV",null,18.899999999999999,{"$f":"ROUND(J31 * (1 + VAT), 2)","v":21.74},35.83,{"$f":"ROUND(L31 * (1 + VAT), 2)","v":41.2},0,{"$f":"ROUND(N31 * (1 + VAT), 2)","v":0},null,"≥ 500V & < 66kV",0.47,{"$f":"ROUND(R31 * (1 + VAT), 2)","v":0.54}]
["Nightsave Large","NL",0,3,"NL03Y",null,null,"≥ 66kV & ≤ 132kV",null,6.76,{"$f":"ROUND(J32 * (1 + VAT), 2)","v":7.77},12.5,{"$f":"ROUND(L32 * (1 + VAT), 2)","v":14.38},16.55,{"$f":"ROUND(N32 * (1 + VAT), 2)","v":19.03},null,"≥ 66kV & ≤ 132kV",0.43,{"$f":"ROUND(R32 * (1 + VAT), 2)","v":0.49}]
["Nightsave Large","NL",0,4,"NL04Y",null,null,"> 132kV / Transmission connected",null,0,{"$f":"ROUND(J33 * (1 + VAT), 2)","v":0},0,{"$f":"ROUND(L33 * (1 + VAT), 2)","v":0},16.55,{"$f":"ROUND(N33 * (1 + VAT), 2)","v":19.03},null,"> 132kV*",0.41,{"$f":"ROUND(R33 * (1 + VAT), 2)","v":0.47}]
[null,null,null,null,null,null,null,null,null,null,null,null,null,null,null,null,"* 132 kV or Transmission connected"]
[]
[null,null,null,null,null,null,null,"Customer categories","Service charge  [R/account/day]",null,"Administration charge  [R/POD/day]",null,null,"Electrification and rural network subsidy charge  [c/kWh]"]
[]
["Tariff","Tariff nameBillcode","Tx zone","Voltage","Billcode",null,null,null,null,"VAT incl",null,"VAT incl"]
["Nightsave Large","NL",0,1,"NL01Y",null,null,">1  MVA",235.44,{"$f":"ROUND(I39 * (1 + VAT), 2)","v":270.76},106.13,{"$f":"ROUND(K39 * (1 + VAT), 2)","v":122.05},null,null,"VAT incl"]
["Nightsave Large","NL",0,1,"NL01Y",null,null,"Key customers",4613.6899999999996,{"$f":"ROUND(I40 * (1 + VAT), 2)","v":5305.74},147.34,{"$f":"ROUND(K40 * (1 + VAT), 2)","v":169.44},null,9.17,{"$f":"ROUND(N40 * (1 + VAT), 2)","v":10.55}]
[]
[]
[]
[]
[]
["Tariff","Tariff nameBillcode","Tx zone","Voltage","Billcode"]
["Nightsave Large","NL",0,1,"NL01Y"]

{"sheet":" Nightsave Small NLA","index":5,"n_rows":48,"n_cols":33,"rows_kept":48,"cut":false,"hidden":false,"merged":[[1,6,1,19],[27,7,28,8],[3,9,3,12],[3,13,3,16],[3,17,5,18],[4,7,6,7],[4,9,5,10],[4,11,5,12],[4,13,5,14],[4,15,5,16],[7,7,10,7],[11,7,14,7],[15,7,18,7],[19,7,22,7],[25,7,25,14],[25,19,25,20],[26,9,27,10],[26,11,27,12],[26,13,27,14],[27,17,27,18],[35,10,36,11],[35,13,37,14],[35,15,36,16],[37,15,37,16],[29,7,29,8],[30,7,30,8],[31,7,31,8],[32,7,32,8],[35,7,36,7],[35,8,36,9]]}
[null,null,null,null,null,null,"Back to menu"]
["Non-municipal",null,null,null,null,null,"Nightsave Urban Small – Non-local Authority",null,null,null,null,null,null,null,null,null,null,null,null,null,null,null,null,null,null,null,null,null,null,null,null,{"$f":"SUM(#REF!,#REF!,#REF!,#REF!,#REF!,#REF!,#REF!,#REF!,#REF!)","v":{"$error":"#REF!"}},"check value"]
[]
[null,null,null,null,null,null,null,null,null,"Active energy charge [c/kWh]",null,null,null,"Energy demand charge [R/kVA/m]",null,null,null,"Transmission network charges [R/kVA/m]"]
[null,null,null,null,null,null,null,"Transmission zone",null,"High demand season \n[Jun - Aug]",null,"Low demand season \n[Sep - May]",null,"High demand season \n[Jun - Aug]",null,"Low demand season \n[Sep - May]"]
[null,null,null,null,null,null,null,null,"Voltage"]
["Tariff","Tariff nameBillcode","Tx zone","Voltage","Billcode",null,null,null,null,"","VAT incl",null,"VAT incl","","VAT incl",null,"VAT incl",null,"VAT incl"]
["Nightsave Small","NS",0,1,{"$f":"B8&C8&D8&IF($A$2=\"Non-municipal\",\"N\",IF($A$2=\"Municiple\",\"Y\",\"error\"))","v":"NS01N"},null,null,"≤ 300km","< 500V",89.59,{"$f":"ROUND(J8 * (1 + VAT), 2)","v":103.03},69.64,{"$f":"ROUND(L8 * (1 + VAT), 2)","v":80.09},191.44,{"$f":"ROUND(N8 * (1 + VAT), 2)","v":220.16},24.67,{"$f":"ROUND(P8 * (1 + VAT), 2)","v":28.37},10.38,{"$f":"ROUND(R8 * (1 + VAT), 2)","v":11.94}]
["Nightsave Small","NS",0,2,{"$f":"B9&C9&D9&IF($A$2=\"Non-municipal\",\"N\",IF($A$2=\"Municiple\",\"Y\",\"error\"))","v":"NS02N"},null,null,null,"≥ 500V & < 66kV",84.83,97.55,66.22,76.150000000000006,185.28,213.07,23.84,27.42,9.48,10.9]
["Nightsave Small","NS",0,3,"NS03N",null,null,null,"≥ 66kV & ≤ 132kV",84.21,96.84,65.430000000000007,75.239999999999995,178.46,205.23,22.95,26.39,9.23,10.61]
["Nightsave Small","NS",0,4,"NS04N",null,null,null,"> 132kV*",78.77,90.59,61.25,70.44,172.22,198.05,22.15,25.47,11.67,13.42]
["Nightsave Small","NS",1,1,"NS11N",null,null,"> 300km and \n≤ 600km","< 500V",90.79,104.41,70.41,80.97,193.4,222.41,24.87,28.6,10.45,12.02]
["Nightsave Small","NS",1,2,"NS12N",null,null,null,"≥ 500V & < 66kV",86.62,99.61,67.569999999999993,77.709999999999994,187.14,215.21,24.08,27.69,9.57,11.01]
["Nightsave Small","NS",1,3,"NS13N",null,null,null,"≥ 66kV & ≤ 132kV",85.97,98.87,66.760000000000005,76.77,180.3,207.35,23.2,26.68,9.3000000000000007,10.7]
["Nightsave Small","NS",1,4,"NS14N",null,null,null,"> 132kV*",80.44,92.51,62.5,71.88,173.94,200.03,22.38,25.74,11.78,13.55]
["Nightsave Small","NS",2,1,"NS21N",null,null,"> 600km and \n≤ 900km","< 500V",91.63,105.37,71.09,81.75,195.3,224.6,25.1,28.87,10.57,12.16]
["Nightsave Small","NS",2,2,"NS22N",null,null,null,"≥ 500V & < 66kV",87.48,100.6,68.27,78.510000000000005,189.06,217.42,24.32,27.97,9.66,11.11]
["Nightsave Small","NS",2,3,"NS23N",null,null,null,"≥ 66kV & ≤ 132kV",86.81,99.83,67.42,77.53,182.12,209.44,23.43,26.94,9.36,10.76]
["Nightsave Small","NS",2,4,"NS24N",null,null,null,"> 132kV*",81.22,93.4,63.14,72.61,175.66,202.01,22.6,25.99,11.95,13.74]
["Nightsave Small","NS",3,1,"NS31N",null,null,"> 900km","< 500V",92.61,106.5,71.81,82.58,197.3,226.9,25.37,29.18,10.64,12.24]
["Nightsave Small","NS",3,2,"NS32N",null,null,null,"≥ 500V & < 66kV",88.32,101.57,68.930000000000007,79.27,190.91,219.55,24.57,28.26,9.77,11.24]
["Nightsave Small","NS",3,3,"NS33N",null,null,null,"≥ 66kV & ≤ 132kV",87.71,100.87,68.069999999999993,78.28,183.97,211.57,23.68,27.23,9.4499999999999993,10.87]
["Nightsave Small","NS",3,4,"NS34N",null,null,null,"> 132kV*",82.08,94.39,63.83,73.400000000000006,177.5,204.13,22.86,26.29,12.04,13.85]
[null,null,null,null,null,null,null,null,"* 132 kV or Transmission connected"]
[]
[null,null,null,null,null,null,null,"Distribution network charges"]
[null,null,null,null,null,null,null,null,null,"Network capacity charge \n[R/kVA/m]",null,"Network demand charge \n[R/kVA/m]",null,"Urban low voltage subsidy charge [R/kVA/m]"]
[null,null,null,null,null,null,null,"Voltage",null,null,null,null,null,null,null,null,"Voltage","Ancillary service charge [c/kWh]"]
["Tariff","Tariff nameBillcode","Tx zone","Voltage","Billcode",null,null,null,null,null,"VAT incl",null,"VAT incl",null,"VAT incl",null,null,null,"VAT incl"]
["Nightsave Small","NS",0,1,{"$f":"B30&C30&D30&IF($A$2=\"Non-municipal\",\"N\",IF($A$2=\"Municiple\",\"Y\",\"error\"))","v":"NS01N"},null,null,"< 500V",null,20.62,{"$f":"ROUND(J30 * (1 + VAT), 2)","v":23.71},39.1,{"$f":"ROUND(L30 * (1 + VAT), 2)","v":44.97},0,{"$f":"ROUND(N30 * (1 + VAT), 2)","v":0},null,"< 500V",0.48,{"$f":"ROUND(R30 * (1 + VAT), 2)","v":0.55000000000000004}]
["Nightsave Small","NS",0,2,{"$f":"B31&C31&D31&IF($A$2=\"Non-municipal\",\"N\",IF($A$2=\"Municiple\",\"Y\",\"error\"))","v":"NS02N"},null,null,"≥ 500V & < 66kV",null,18.91,{"$f":"ROUND(J31 * (1 + VAT), 2)","v":21.75},35.869999999999997,{"$f":"ROUND(L31 * (1 + VAT), 2)","v":41.25},0,{"$f":"ROUND(N31 * (1 + VAT), 2)","v":0},null,"≥ 500V & < 66kV",0.47,{"$f":"ROUND(R31 * (1 + VAT), 2)","v":0.54}]
["Nightsave Small","NS",0,3,{"$f":"B32&C32&D32&IF($A$2=\"Non-municipal\",\"N\",IF($A$2=\"Municiple\",\"Y\",\"error\"))","v":"NS03N"},null,null,"≥ 66kV & ≤ 132kV",null,6.75,{"$f":"ROUND(J32 * (1 + VAT), 2)","v":7.76},12.51,{"$f":"ROUND(L32 * (1 + VAT), 2)","v":14.39},16.66,{"$f":"ROUND(N32 * (1 + VAT), 2)","v":19.16},null,"≥ 66kV & ≤ 132kV",0.45,{"$f":"ROUND(R32 * (1 + VAT), 2)","v":0.52}]
["Nightsave Small","NS",0,4,{"$f":"B33&C33&D33&IF($A$2=\"Non-municipal\",\"N\",IF($A$2=\"Municiple\",\"Y\",\"error\"))","v":"NS04N"},null,null,"> 132kV / Transmission connected",null,0,{"$f":"ROUND(J33 * (1 + VAT), 2)","v":0},0,{"$f":"ROUND(L33 * (1 + VAT), 2)","v":0},16.66,{"$f":"ROUND(N33 * (1 + VAT), 2)","v":19.16},null,"> 132kV*",0.42,{"$f":"ROUND(R33 * (1 + VAT), 2)","v":0.48}]
[null,null,null,null,null,null,null,null,null,null,null,null,null,null,null,null,"* 132 kV or Transmission connected"]
[]
[null,null,null,null,null,null,null,"Customer categories","Service charge  [R/account/day]",null,"Administration charge  [R/POD/day]",null,null,"Electrification and rural network subsidy charge  [c/kWh]",null,"Affordability subsidy charge [c/kWh] \nOnly payable by non-local authority tariffs"]
[]
["Tariff","Tariff nameBillcode","Tx zone","Voltage","Billcode",null,null,null,null,"VAT incl",null,"VAT incl"]
["Nightsave Small","NS",0,1,{"$f":"B39&C39&D39&IF($A$2=\"Non-municipal\",\"N\",IF($A$2=\"Municiple\",\"Y\",\"error\"))","v":"NS01N"},null,null,"≤ 100 kVA",16.850000000000001,{"$f":"ROUND(I39 * (1 + VAT), 2)","v":19.38},3.7,{"$f":"ROUND(K39 * (1 + VAT), 2)","v":4.26},null,null,"VAT incl",null,"VAT incl"]
["Nightsave Small","NS",0,1,{"$f":"B40&C40&D40&IF($A$2=\"Non-municipal\",\"N\",IF($A$2=\"Municiple\",\"Y\",\"error\"))","v":"NS01N"},null,null,"> 100 kVA & ≤ 500 kVA",76.94,{"$f":"ROUND(I40 * (1 + VAT), 2)","v":88.48},21.58,{"$f":"ROUND(K40 * (1 + VAT), 2)","v":24.82},null,9.2200000000000006,{"$f":"ROUND(N40 * (1 + VAT), 2)","v":10.6},4.34,{"$f":"ROUND(P40 * (1 + VAT), 2)","v":4.99}]
["Nightsave Small","NS",0,1,{"$f":"B41&C41&D41&IF($A$2=\"Non-municipal\",\"N\",IF($A$2=\"Municiple\",\"Y\",\"error\"))","v":"NS01N"},null,null,"> 500 kVA & ≤ 1 MVA",236.74,{"$f":"ROUND(I41 * (1 + VAT), 2)","v":272.25},42.85,{"$f":"ROUND(K41 * (1 + VAT), 2)","v":49.28}]
["Nightsave Small","NS",0,1,{"$f":"B42&C42&D42&IF($A$2=\"Non-municipal\",\"N\",IF($A$2=\"Municiple\",\"Y\",\"error\"))","v":"NS01N"},null,null,"Key customers",4639.2,{"$f":"ROUND(I42 * (1 + VAT), 2)","v":5335.08},148.16,{"$f":"ROUND(K42 * (1 + VAT), 2)","v":170.38}]
[]
[]
[]
[]
["Tariff","Tariff nameBillcode","Tx zone","Voltage","Billcode"]
["Nightsave Small","NS",0,1,{"$f":"B48&C48&D48&IF($A$2=\"Non-municipal\",\"N\",IF($A$2=\"Municiple\",\"Y\",\"error\"))","v":"NS01N"}]

{"sheet":"Nightsave Small Munic","index":6,"n_rows":48,"n_cols":33,"rows_kept":48,"cut":false,"hidden":false,"merged":[[1,6,1,19],[27,7,28,8],[3,9,3,12],[3,13,3,16],[3,17,5,18],[4,7,6,7],[4,9,5,10],[4,11,5,12],[4,13,5,14],[4,15,5,16],[7,7,10,7],[11,7,14,7],[15,7,18,7],[19,7,22,7],[25,7,25,14],[25,19,25,20],[26,9,27,10],[26,11,27,12],[26,13,27,14],[27,17,27,18],[35,10,36,11],[35,13,37,14],[29,7,29,8],[30,7,30,8],[31,7,31,8],[32,7,32,8],[35,7,36,7],[35,8,36,9]]}
[null,null,null,null,null,null,"Back to menu"]
["Municiple",null,null,null,null,null,"Nightsave Urban Small – Local Authority",null,null,null,null,null,null,null,null,null,null,null,null,null,null,null,null,null,null,null,null,null,null,null,null,{"$f":"SUM(#REF!,#REF!,#REF!,#REF!,#REF!,#REF!,#REF!,#REF!,#REF!)","v":{"$error":"#REF!"}},"check value"]
[]
[null,null,null,null,null,null,null,null,null,"Active energy charge [c/kWh]",null,null,null,"Energy demand charge [R/kVA/m]",null,null,null,"Transmission network charges [R/kVA/m]"]
[null,null,null,null,null,null,null,"Transmission zone",null,"High demand season \n[Jun - Aug]",null,"Low demand season \n[Sep - May]",null,"High demand season \n[Jun - Aug]",null,"Low demand season \n[Sep - May]"]
[null,null,null,null,null,null,null,null,"Voltage"]
["Tariff","Tariff nameBillcode","Tx zone","Voltage","Billcode",null,null,null,null,"","VAT incl",null,"VAT incl","","VAT incl",null,"VAT incl",null,"VAT incl"]
["Nightsave Small","NS",0,1,"NS01Y",null,null,"≤ 300km","< 500V",91.65,{"$f":"ROUND(J8 * (1 + VAT), 2)","v":105.4},71.260000000000005,{"$f":"ROUND(L8 * (1 + VAT), 2)","v":81.95},192.15,{"$f":"ROUND(N8 * (1 + VAT), 2)","v":220.97},24.78,{"$f":"ROUND(P8 * (1 + VAT), 2)","v":28.5},10.34,{"$f":"ROUND(R8 * (1 + VAT), 2)","v":11.89}]
["Nightsave Small","NS",0,2,"NS02Y",null,null,null,"≥ 500V & < 66kV",86.78,99.8,67.739999999999995,77.900000000000006,185.96,213.85,23.93,27.52,9.43,10.84]
["Nightsave Small","NS",0,3,"NS03Y",null,null,null,"≥ 66kV & ≤ 132kV",86.14,99.06,66.900000000000006,76.94,179.15,206.02,23.03,26.48,9.18,10.56]
["Nightsave Small","NS",0,4,"NS04Y",null,null,null,"> 132kV*",80.59,92.68,62.66,72.06,172.87,198.8,22.24,25.58,11.62,13.36]
["Nightsave Small","NS",1,1,"NS11Y",null,null,"> 300km and \n≤ 600km","< 500V",92.84,106.77,72.03,82.83,194.13,223.25,24.98,28.73,10.38,11.94]
["Nightsave Small","NS",1,2,"NS12Y",null,null,null,"≥ 500V & < 66kV",88.59,101.88,69.099999999999994,79.47,187.89,216.07,24.15,27.77,9.5399999999999991,10.97]
["Nightsave Small","NS",1,3,"NS13Y",null,null,null,"≥ 66kV & ≤ 132kV",87.94,101.13,68.3,78.55,181,208.15,23.26,26.75,9.25,10.64]
["Nightsave Small","NS",1,4,"NS14Y",null,null,null,"> 132kV*",82.25,94.59,63.95,73.540000000000006,174.6,200.79,22.46,25.83,11.73,13.49]
["Nightsave Small","NS",2,1,"NS21Y",null,null,"> 600km and \n≤ 900km","< 500V",93.73,107.79,72.709999999999994,83.62,196.07,225.48,25.21,28.99,10.52,12.1]
["Nightsave Small","NS",2,2,"NS22Y",null,null,null,"≥ 500V & < 66kV",89.48,102.9,69.819999999999993,80.290000000000006,189.75,218.21,24.42,28.08,9.6,11.04]
["Nightsave Small","NS",2,3,"NS23Y",null,null,null,"≥ 66kV & ≤ 132kV",88.81,102.13,68.98,79.33,182.82,210.24,23.51,27.04,9.32,10.72]
["Nightsave Small","NS",2,4,"NS24Y",null,null,null,"> 132kV*",83.07,95.53,64.59,74.28,176.33,202.78,22.67,26.07,11.89,13.67]
["Nightsave Small","NS",3,1,"NS31Y",null,null,"> 900km","< 500V",94.73,108.94,73.45,84.47,198.04,227.75,25.45,29.27,10.57,12.16]
["Nightsave Small","NS",3,2,"NS32Y",null,null,null,"≥ 500V & < 66kV",90.37,103.93,70.489999999999995,81.06,191.63,220.37,24.65,28.35,9.7100000000000009,11.17]
["Nightsave Small","NS",3,3,"NS33Y",null,null,null,"≥ 66kV & ≤ 132kV",89.7,103.16,69.650000000000006,80.099999999999994,184.66,212.36,23.75,27.31,9.4,10.81]
["Nightsave Small","NS",3,4,"NS34Y",null,null,null,"> 132kV*",83.98,96.58,65.31,75.11,178.18,204.91,22.94,26.38,11.97,13.77]
[null,null,null,null,null,null,null,null,"* 132 kV or Transmission connected"]
[]
[null,null,null,null,null,null,null,"Distribution network charges"]
[null,null,null,null,null,null,null,null,null,"Network capacity charge \n[R/kVA/m]",null,"Network demand charge \n[R/kVA/m]",null,"Urban low voltage subsidy charge [R/kVA/m]"]
[null,null,null,null,null,null,null,"Voltage",null,null,null,null,null,null,null,null,"Voltage","Ancillary service charge [c/kWh]"]
["Tariff","Tariff nameBillcode","Tx zone","Voltage","Billcode",null,null,null,null,null,"VAT incl",null,"VAT incl",null,"VAT incl",null,null,null,"VAT incl"]
["Nightsave Small","NS",0,1,"NS01Y",null,null,"< 500V",null,20.62,{"$f":"ROUND(J30 * (1 + VAT), 2)","v":23.71},39.07,{"$f":"ROUND(L30 * (1 + VAT), 2)","v":44.93},0,{"$f":"ROUND(N30 * (1 + VAT), 2)","v":0},null,"< 500V",0.48,{"$f":"ROUND(R30 * (1 + VAT), 2)","v":0.55000000000000004}]
["Nightsave Small","NS",0,2,"NS02Y",null,null,"≥ 500V & < 66kV",null,18.899999999999999,{"$f":"ROUND(J31 * (1 + VAT), 2)","v":21.74},35.83,{"$f":"ROUND(L31 * (1 + VAT), 2)","v":41.2},0,{"$f":"ROUND(N31 * (1 + VAT), 2)","v":0},null,"≥ 500V & < 66kV",0.47,{"$f":"ROUND(R31 * (1 + VAT), 2)","v":0.54}]
["Nightsave Small","NS",0,3,"NS03Y",null,null,"≥ 66kV & ≤ 132kV",null,6.76,{"$f":"ROUND(J32 * (1 + VAT), 2)","v":7.77},12.5,{"$f":"ROUND(L32 * (1 + VAT), 2)","v":14.38},16.55,{"$f":"ROUND(N32 * (1 + VAT), 2)","v":19.03},null,"≥ 66kV & ≤ 132kV",0.43,{"$f":"ROUND(R32 * (1 + VAT), 2)","v":0.49}]
["Nightsave Small","NS",0,4,"NS04Y",null,null,"> 132kV / Transmission connected",null,0,{"$f":"ROUND(J33 * (1 + VAT), 2)","v":0},0,{"$f":"ROUND(L33 * (1 + VAT), 2)","v":0},16.55,{"$f":"ROUND(N33 * (1 + VAT), 2)","v":19.03},null,"> 132kV*",0.41,{"$f":"ROUND(R33 * (1 + VAT), 2)","v":0.47}]
[null,null,null,null,null,null,null,null,null,null,null,null,null,null,null,null,"* 132 kV or Transmission connected"]
[]
[null,null,null,null,null,null,null,"Customer categories","Service charge  [R/account/day]",null,"Administration charge  [R/POD/day]",null,null,"Electrification and rural network subsidy charge  [c/kWh]"]
[]
["Tariff","Tariff nameBillcode","Tx zone","Voltage","Billcode",null,null,null,null,"VAT incl",null,"VAT incl"]
["Nightsave Small","NS",0,1,"NS01Y",null,null,"≤ 100 kVA",16.739999999999998,{"$f":"ROUND(I39 * (1 + VAT), 2)","v":19.25},3.67,{"$f":"ROUND(K39 * (1 + VAT), 2)","v":4.22},null,null,"VAT incl"]
["Nightsave Small","NS",0,1,"NS01Y",null,null,"> 100 kVA & ≤ 500 kVA",76.5,{"$f":"ROUND(I40 * (1 + VAT), 2)","v":87.98},21.43,{"$f":"ROUND(K40 * (1 + VAT), 2)","v":24.64},null,9.17,{"$f":"ROUND(N40 * (1 + VAT), 2)","v":10.55}]
["Nightsave Small","NS",0,1,"NS01Y",null,null,"> 500 kVA & ≤ 1 MVA",235.44,{"$f":"ROUND(I41 * (1 + VAT), 2)","v":270.76},42.62,{"$f":"ROUND(K41 * (1 + VAT), 2)","v":49.01}]
["Nightsave Small","NS",0,1,"NS01Y",null,null,"Key customers",4613.6899999999996,{"$f":"ROUND(I42 * (1 + VAT), 2)","v":5305.74},147.34,{"$f":"ROUND(K42 * (1 + VAT), 2)","v":169.44}]
[]
[]
[]
[]
["Tariff","Tariff nameBillcode","Tx zone","Voltage","Billcode"]
["Nightsave Small","NS",0,1,"NS01Y"]

{"sheet":"Megaflex NLA","index":7,"n_rows":46,"n_cols":33,"rows_kept":46,"cut":false,"hidden":false,"merged":[[1,6,1,23],[11,7,14,7],[7,7,10,7],[30,7,30,8],[30,16,30,17],[15,7,18,7],[19,7,22,7],[25,7,25,14],[26,9,27,10],[26,11,27,12],[26,13,27,14],[29,7,29,8],[29,16,29,17],[3,21,5,22],[37,7,37,8],[39,7,39,8],[3,9,3,20],[4,7,6,7],[4,9,4,14],[4,15,4,20],[5,9,5,10],[5,11,5,12],[5,13,5,14],[5,15,5,16],[5,17,5,18],[5,19,5,20],[27,18,27,19],[41,7,43,8],[27,7,28,8],[27,16,28,17],[31,7,31,8],[31,16,31,17],[38,7,38,8],[41,9,42,10],[43,9,43,10],[32,7,32,8],[32,16,32,17],[35,7,35,8],[35,9,36,10],[35,11,36,12],[35,16,35,19],[36,16,36,17],[36,18,36,19]]}
[null,null,null,null,null,null,"Back to menu"]
["Non-municipal",null,null,null,null,null,"Megaflex – Non-local Authority",null,null,null,null,null,null,null,null,null,null,null,null,null,null,null,null,null,null,null,null,null,null,null,null,{"$f":"SUM(J8:T23,V8:V23,#REF!,#REF!,#REF!,#REF!,H26:J26,L26)","v":{"$error":"#REF!"}},"check value"]
[]
[null,null,null,null,null,null,null,null,null,"Active energy charge [c/kWh]",null,null,null,null,null,null,null,null,null,null,null,"Transmission network charges [R/kVA/m]"]
[null,null,null,null,null,null,null,"Transmission zone",null,"High demand season [Jun - Aug]",null,null,null,null,null,"Low demand season [Sep - May]"]
[null,null,null,null,null,null,null,null,"Voltage","Peak",null,"Standard",null,"Off Peak",null,"Peak",null,"Standard",null,"Off Peak"]
["Tariff","Tariff nameBillcode","Tx zone","Voltage","Billcode",null,null,null,null,"","VAT incl",null,"VAT incl",null,"VAT incl",null,"VAT incl",null,"VAT incl",null,"VAT incl",null,"VAT incl"]
["Megaflex","Me",0,1,{"$f":"B8&C8&D8&IF($A$2=\"Non-municipal\",\"N\",IF($A$2=\"Municiple\",\"Y\",\"error\"))","v":"Me01N"},null,null,"≤ 300km","< 500V",362.73,{"$f":"ROUND(J8 * (1 + VAT), 2)","v":417.14},110.36,{"$f":"ROUND(L8 * (1 + VAT), 2)","v":126.91},60.26,{"$f":"ROUND(N8 * (1 + VAT), 2)","v":69.3},118.78,{"$f":"ROUND(P8 * (1 + VAT), 2)","v":136.6},81.96,{"$f":"ROUND(R8 * (1 + VAT), 2)","v":94.25},52.25,{"$f":"ROUND(T8 * (1 + VAT), 2)","v":60.09},10.38,{"$f":"ROUND(V8 * (1 + VAT), 2)","v":11.94}]
["Megaflex","Me",0,2,{"$f":"B9&C9&D9&IF($A$2=\"Non-municipal\",\"N\",IF($A$2=\"Municiple\",\"Y\",\"error\"))","v":"Me02N"},null,null,null,"≥ 500V & < 66kV",357.04,410.6,108.16,124.38,58.74,67.55,116.45,133.91999999999999,80.17,92.2,50.86,58.49,9.48,10.9]
["Megaflex","Me",0,3,"Me03N",null,null,null,"≥ 66kV & ≤ 132kV",345.73,397.59,104.73,120.44,56.88,65.41,112.79,129.71,77.61,89.25,49.26,56.65,9.23,10.61]
["Megaflex","Me",0,4,"Me04N",null,null,null,"> 132kV*",325.83999999999997,374.72,98.7,113.51,53.61,61.65,106.32,122.27,73.150000000000006,84.12,46.42,53.38,11.67,13.42]
["Megaflex","Me",1,1,"Me11N",null,null,"> 300km and \n≤ 600km","< 500V",365.69,420.54,110.8,127.42,60.16,69.180000000000007,119.3,137.19999999999999,82.14,94.46,52.11,59.93,10.45,12.02]
["Megaflex","Me",1,2,"Me12N",null,null,null,"≥ 500V & < 66kV",360.6,414.69,109.23,125.61,59.32,68.22,117.65,135.30000000000001,80.959999999999994,93.1,51.36,59.06,9.57,11.01]
["Megaflex","Me",1,3,"Me13N",null,null,null,"≥ 66kV & ≤ 132kV",349.13,401.5,105.75,121.61,57.41,66.02,113.88,130.96,78.38,90.14,49.73,57.19,9.3000000000000007,10.7]
["Megaflex","Me",1,4,"Me14N",null,null,null,"> 132kV*",329.11,378.48,99.71,114.67,54.11,62.23,107.34,123.44,73.87,84.95,46.85,53.88,11.78,13.55]
["Megaflex","Me",2,1,"Me21N",null,null,"> 600km and \n≤ 900km","< 500V",369.33,424.73,111.88,128.66,60.73,69.84,120.48,138.55000000000001,82.93,95.37,52.59,60.48,10.57,12.16]
["Megaflex","Me",2,2,"Me22N",null,null,null,"≥ 500V & < 66kV",364.23,418.86,110.35,126.9,59.92,68.91,118.81,136.63,81.78,94.05,51.88,59.66,9.66,11.11]
["Megaflex","Me",2,3,"Me23N",null,null,null,"≥ 66kV & ≤ 132kV",352.69,405.59,106.85,122.88,58.01,66.709999999999994,115.04,132.30000000000001,79.19,91.07,50.24,57.78,9.36,10.76]
["Megaflex","Me",2,4,"Me24N",null,null,null,"> 132kV*",332.42,382.28,100.69,115.79,54.71,62.92,108.43,124.69,74.62,85.81,47.35,54.45,11.95,13.74]
["Megaflex","Me",3,1,"Me31N",null,null,"> 900km","< 500V",373.05,429.01,113.05,130.01,61.36,70.56,121.7,139.96,83.75,96.31,53.15,61.12,10.64,12.24]
["Megaflex","Me",3,2,"Me32N",null,null,null,"≥ 500V & < 66kV",367.85,423.03,111.42,128.13,60.48,69.55,119.97,137.97,82.56,94.94,52.39,60.25,9.77,11.24]
["Megaflex","Me",3,3,"Me33N",null,null,null,"≥ 66kV & ≤ 132kV",356.23,409.66,107.9,124.09,58.59,67.38,116.19,133.62,79.98,91.98,50.74,58.35,9.4499999999999993,10.87]
["Megaflex","Me",3,4,"Me34N",null,null,null,"> 132kV*",335.66,386.01,101.72,116.98,55.27,63.56,109.56,125.99,75.44,86.76,47.88,55.06,12.04,13.85]
[null,null,null,null,null,null,null,null,"* 132 kV or Transmission connected"]
[]
[null,null,null,null,null,null,null,"Distribution network charges"]
[null,null,null,null,null,null,null,null,null,"Network capacity charge \n[R/kVA/m]",null,"Network demand charge \n[R/kVA/m]",null,"Urban low voltage subsidy charge [R/kVA/m]"]
[null,null,null,null,null,null,null,"Voltage",null,null,null,null,null,null,null,null,"Voltage",null,"Ancillary service charge [c/kWh]"]
["Tariff","Tariff nameBillcode","Tx zone","Voltage","Billcode",null,null,null,null,null,"VAT incl",null,"VAT incl",null,"VAT incl",null,null,null,null,"VAT incl"]
["Megaflex","Me",0,1,{"$f":"B30&C30&D30&IF($A$2=\"Non-municipal\",\"N\",IF($A$2=\"Municiple\",\"Y\",\"error\"))","v":"Me01N"},null,null,"< 500V",null,20.62,{"$f":"ROUND(J30 * (1 + VAT), 2)","v":23.71},39.1,{"$f":"ROUND(L30 * (1 + VAT), 2)","v":44.97},0,{"$f":"ROUND(N30 * (1 + VAT), 2)","v":0},null,"< 500V",null,0.48,{"$f":"ROUND(S30 * (1 + VAT), 2)","v":0.55000000000000004}]
["Megaflex","Me",0,2,{"$f":"B31&C31&D31&IF($A$2=\"Non-municipal\",\"N\",IF($A$2=\"Municiple\",\"Y\",\"error\"))","v":"Me02N"},null,null,"≥ 500V & < 66kV",null,18.91,{"$f":"ROUND(J31 * (1 + VAT), 2)","v":21.75},35.869999999999997,{"$f":"ROUND(L31 * (1 + VAT), 2)","v":41.25},0,{"$f":"ROUND(N31 * (1 + VAT), 2)","v":0},null,"≥ 500V & < 66kV",null,0.47,{"$f":"ROUND(S31 * (1 + VAT), 2)","v":0.54}]
["Megaflex","Me",0,3,{"$f":"B32&C32&D32&IF($A$2=\"Non-municipal\",\"N\",IF($A$2=\"Municiple\",\"Y\",\"error\"))","v":"Me03N"},null,null,"≥ 66kV & ≤ 132kV",null,6.75,{"$f":"ROUND(J32 * (1 + VAT), 2)","v":7.76},12.51,{"$f":"ROUND(L32 * (1 + VAT), 2)","v":14.39},16.66,{"$f":"ROUND(N32 * (1 + VAT), 2)","v":19.16},null,"≥ 66kV & ≤ 132kV",null,0.45,{"$f":"ROUND(S32 * (1 + VAT), 2)","v":0.52}]
["Megaflex","Me",0,4,{"$f":"B33&C33&D33&IF($A$2=\"Non-municipal\",\"N\",IF($A$2=\"Municiple\",\"Y\",\"error\"))","v":"Me04N"},null,null,"> 132kV*",null,0,{"$f":"ROUND(J33 * (1 + VAT), 2)","v":0},0,{"$f":"ROUND(L33 * (1 + VAT), 2)","v":0},16.66,{"$f":"ROUND(N33 * (1 + VAT), 2)","v":19.16},null,"> 132kV*",null,0.42,{"$f":"ROUND(S33 * (1 + VAT), 2)","v":0.48}]
[null,null,null,null,null,null,null,"* 132 kV or Transmission connected",null,null,null,null,null,null,null,null,"* 132 kV or Transmission connected"]
[]
[null,null,null,null,null,null,null,"Customer categories",null,"Service charge  [R/account/day]",null,"Administration charge  [R/POD/day]",null,null,null,null,"Reactive energy charge  [c/kVArh]"]
[null,null,null,null,null,null,null,null,null,null,null,null,null,null,null,null,"High season",null,"Low season"]
["Tariff","Tariff nameBillcode","Tx zone","Voltage","Billcode",null,null,null,null,null,"VAT incl",null,"VAT incl",null,null,null,null,"VAT incl",null,"VAT incl"]
["Megaflex","Me",0,1,{"$f":"B39&C39&D39&IF($A$2=\"Non-municipal\",\"N\",IF($A$2=\"Municiple\",\"Y\",\"error\"))","v":"Me01N"},null,null,"> 1 MVA",null,236.74,{"$f":"ROUND(J39 * (1 + VAT), 2)","v":272.25},106.69,{"$f":"ROUND(L39 * (1 + VAT), 2)","v":122.69},null,null,null,16.68,{"$f":"ROUND(Q39 * (1 + VAT), 2)","v":19.18},0,{"$f":"ROUND(S39 * (1 + VAT), 2)","v":0}]
["Megaflex","Me",0,1,{"$f":"B40&C40&D40&IF($A$2=\"Non-municipal\",\"N\",IF($A$2=\"Municiple\",\"Y\",\"error\"))","v":"Me01N"},null,null,"Key customers",null,4639.2,{"$f":"ROUND(J40 * (1 + VAT), 2)","v":5335.08},148.16,{"$f":"ROUND(L40 * (1 + VAT), 2)","v":170.38}]
[]
[null,null,null,null,null,null,null,"Electrification and rural network subsidy charge  [c/kWh]",null,"Affordability subsidy charge [c/kWh] \nOnly payable by non-local authority tariffs"]
[]
[]
["Tariff","Tariff nameBillcode","Tx zone","Voltage","Billcode",null,null,null,"VAT incl",null,"VAT incl"]
["Megaflex","Me",0,1,{"$f":"B46&C46&D46&IF($A$2=\"Non-municipal\",\"N\",IF($A$2=\"Municiple\",\"Y\",\"error\"))","v":"Me01N"},null,null,9.2200000000000006,{"$f":"ROUND(H46 * (1 + VAT), 2)","v":10.6},4.34,{"$f":"ROUND(J46 * (1 + VAT), 2)","v":4.99}]

{"sheet":"Megaflex Munic ","index":8,"n_rows":46,"n_cols":33,"rows_kept":46,"cut":false,"hidden":false,"merged":[[36,18,36,19],[36,16,36,17],[35,16,35,19],[11,7,14,7],[7,7,10,7],[30,7,30,8],[30,16,30,17],[15,7,18,7],[19,7,22,7],[25,7,25,14],[26,9,27,10],[26,11,27,12],[26,13,27,14],[35,9,36,10],[35,11,36,12],[3,9,3,20],[4,7,6,7],[4,9,4,14],[4,15,4,20],[5,9,5,10],[5,11,5,12],[5,13,5,14],[5,15,5,16],[5,17,5,18],[5,19,5,20],[3,21,5,22],[1,6,1,23],[41,7,43,8],[27,18,27,19],[29,7,29,8],[29,16,29,17],[27,7,28,8],[27,16,28,17],[39,7,39,8],[38,7,38,8],[37,7,37,8],[31,7,31,8],[31,16,31,17],[32,7,32,8],[32,16,32,17],[35,7,35,8]]}
[null,null,null,null,null,null,"Back to menu",null,null,null,null,null,null,null,null,null,null,null,null,null,null,null,{"$error":"#REF!"}]
["Municiple",null,null,null,null,null,"Megaflex – Local Authority",null,null,null,null,null,null,null,null,null,null,null,null,null,null,null,null,null,null,null,null,null,null,null,null,{"$f":"SUM(J8:T23,V8:V23,#REF!,#REF!,#REF!,#REF!,H26:J26,L26)","v":{"$error":"#REF!"}},"check value"]
[]
[null,null,null,null,null,null,null,null,null,"Active energy charge [c/kWh]",null,null,null,null,null,null,null,null,null,null,null,"Transmission network charges [R/kVA/m]"]
[null,null,null,null,null,null,null,"Transmission zone",null,"High demand season [Jun - Aug]",null,null,null,null,null,"Low demand season [Sep - May]"]
[null,null,null,null,null,null,null,null,"Voltage","Peak",null,"Standard",null,"Off Peak",null,"Peak",null,"Standard",null,"Off Peak"]
["Tariff","Tariff nameBillcode","Tx zone","Voltage","Billcode",null,null,null,null,"","VAT incl",null,"VAT incl",null,"VAT incl",null,"VAT incl",null,"VAT incl",null,"VAT incl",null,"VAT incl"]
["Megaflex","Me",0,1,"Me01Y",null,null,"≤ 300km","< 500V",371.05,{"$f":"ROUND(J8 * (1 + VAT), 2)","v":426.71},112.91,{"$f":"ROUND(L8 * (1 + VAT), 2)","v":129.85},61.61,{"$f":"ROUND(N8 * (1 + VAT), 2)","v":70.849999999999994},121.48,{"$f":"ROUND(P8 * (1 + VAT), 2)","v":139.69999999999999},83.84,{"$f":"ROUND(R8 * (1 + VAT), 2)","v":96.42},53.44,{"$f":"ROUND(T8 * (1 + VAT), 2)","v":61.46},10.34,{"$f":"ROUND(V8 * (1 + VAT), 2)","v":11.89}]
["Megaflex","Me",0,2,"Me02Y",null,null,null,"≥ 500V & < 66kV",365.2,419.98,110.65,127.25,60.09,69.099999999999994,119.13,137,81.99,94.29,52.03,59.83,9.43,10.84]
["Megaflex","Me",0,3,"Me03Y",null,null,null,"≥ 66kV & ≤ 132kV",353.68,406.73,107.14,123.21,58.19,66.92,115.38,132.69,79.42,91.33,50.37,57.93,9.18,10.56]
["Megaflex","Me",0,4,"Me04Y",null,null,null,"> 132kV*",333.32,383.32,100.98,116.13,54.83,63.05,108.73,125.04,74.83,86.05,47.47,54.59,11.62,13.36]
["Megaflex","Me",1,1,"Me11Y",null,null,"> 300km and \n≤ 600km","< 500V",374.08,430.19,113.32,130.32,61.53,70.760000000000005,122.03,140.33000000000001,84.01,96.61,53.29,61.28,10.38,11.94]
["Megaflex","Me",1,2,"Me12Y",null,null,null,"≥ 500V & < 66kV",368.85,424.18,111.74,128.5,60.68,69.78,120.34,138.38999999999999,82.82,95.24,52.53,60.41,9.5399999999999991,10.97]
["Megaflex","Me",1,3,"Me13Y",null,null,null,"≥ 66kV & ≤ 132kV",357.14,410.71,108.18,124.41,58.74,67.55,116.5,133.97999999999999,80.180000000000007,92.21,50.85,58.48,9.25,10.64]
["Megaflex","Me",1,4,"Me14Y",null,null,null,"> 132kV*",336.65,387.15,102,117.3,55.37,63.68,109.8,126.27,75.59,86.93,47.94,55.13,11.73,13.49]
["Megaflex","Me",2,1,"Me21Y",null,null,"> 600km and \n≤ 900km","< 500V",377.81,434.48,114.46,131.63,62.14,71.459999999999994,123.23,141.71,84.84,97.57,53.82,61.89,10.52,12.1]
["Megaflex","Me",2,2,"Me22Y",null,null,null,"≥ 500V & < 66kV",372.57,428.46,112.85,129.78,61.29,70.48,121.56,139.79,83.61,96.15,53.07,61.03,9.6,11.04]
["Megaflex","Me",2,3,"Me23Y",null,null,null,"≥ 66kV & ≤ 132kV",360.78,414.9,109.27,125.66,59.33,68.23,117.65,135.30000000000001,80.98,93.13,51.35,59.05,9.32,10.72]
["Megaflex","Me",2,4,"Me24Y",null,null,null,"> 132kV*",340.02,391.02,103.02,118.47,55.93,64.319999999999993,110.93,127.57,76.34,87.79,48.43,55.69,11.89,13.67]
["Megaflex","Me",3,1,"Me31Y",null,null,"> 900km","< 500V",381.6,438.84,115.61,132.94999999999999,62.78,72.2,124.49,143.16,85.67,98.52,54.36,62.51,10.57,12.16]
["Megaflex","Me",3,2,"Me32Y",null,null,null,"≥ 500V & < 66kV",376.29,432.73,113.98,131.08000000000001,61.91,71.2,122.73,141.13999999999999,84.47,97.14,53.57,61.61,9.7100000000000009,11.17]
["Megaflex","Me",3,3,"Me33Y",null,null,null,"≥ 66kV & ≤ 132kV",364.41,419.07,110.4,126.96,59.95,68.94,118.86,136.69,81.790000000000006,94.06,51.89,59.67,9.4,10.81]
["Megaflex","Me",3,4,"Me34Y",null,null,null,"> 132kV*",343.37,394.88,104.07,119.68,56.55,65.03,112.06,128.87,77.14,88.71,48.96,56.3,11.97,13.77]
[null,null,null,null,null,null,null,null,"* 132 kV or Transmission connected"]
[]
[null,null,null,null,null,null,null,"Distribution network charges"]
[null,null,null,null,null,null,null,null,null,"Network capacity charge \n[R/kVA/m]",null,"Network demand charge \n[R/kVA/m]",null,"Urban low voltage subsidy charge [R/kVA/m]"]
[null,null,null,null,null,null,null,"Voltage",null,null,null,null,null,null,null,null,"Voltage",null,"Ancillary service charge [c/kWh]"]
["Tariff","Tariff nameBillcode","Tx zone","Voltage","Billcode",null,null,null,null,null,"VAT incl",null,"VAT incl",null,"VAT incl",null,null,null,null,"VAT incl"]
["Megaflex","Me",0,1,"Me01Y",null,null,"< 500V",null,20.62,{"$f":"ROUND(J30 * (1 + VAT), 2)","v":23.71},39.07,{"$f":"ROUND(L30 * (1 + VAT), 2)","v":44.93},0,{"$f":"ROUND(N30 * (1 + VAT), 2)","v":0},null,"< 500V",null,0.48,{"$f":"ROUND(S30 * (1 + VAT), 2)","v":0.55000000000000004}]
["Megaflex","Me",0,2,"Me02Y",null,null,"≥ 500V & < 66kV",null,18.899999999999999,{"$f":"ROUND(J31 * (1 + VAT), 2)","v":21.74},35.83,{"$f":"ROUND(L31 * (1 + VAT), 2)","v":41.2},0,{"$f":"ROUND(N31 * (1 + VAT), 2)","v":0},null,"≥ 500V & < 66kV",null,0.47,{"$f":"ROUND(S31 * (1 + VAT), 2)","v":0.54}]
["Megaflex","Me",0,3,"Me03Y",null,null,"≥ 66kV & ≤ 132kV",null,6.76,{"$f":"ROUND(J32 * (1 + VAT), 2)","v":7.77},12.5,{"$f":"ROUND(L32 * (1 + VAT), 2)","v":14.38},16.55,{"$f":"ROUND(N32 * (1 + VAT), 2)","v":19.03},null,"≥ 66kV & ≤ 132kV",null,0.43,{"$f":"ROUND(S32 * (1 + VAT), 2)","v":0.49}]
["Megaflex","Me",0,4,"Me04Y",null,null,"> 132kV*",null,0,{"$f":"ROUND(J33 * (1 + VAT), 2)","v":0},0,{"$f":"ROUND(L33 * (1 + VAT), 2)","v":0},16.55,{"$f":"ROUND(N33 * (1 + VAT), 2)","v":19.03},null,"> 132kV*",null,0.41,{"$f":"ROUND(S33 * (1 + VAT), 2)","v":0.47}]
[null,null,null,null,null,null,null,"* 132 kV or Transmission connected",null,null,null,null,null,null,null,null,"* 132 kV or Transmission connected"]
[]
[null,null,null,null,null,null,null,"Customer categories",null,"Service charge  [R/account/day]",null,"Administration charge  [R/POD/day]",null,null,null,null,"Reactive energy charge  [c/kVArh]"]
[null,null,null,null,null,null,null,null,null,null,null,null,null,null,null,null,"High season",null,"Low season"]
["Tariff","Tariff nameBillcode","Tx zone","Voltage","Billcode",null,null,null,null,null,"VAT incl",null,"VAT incl",null,null,null,null,"VAT incl",null,"VAT incl"]
["Megaflex","Me",0,1,"Me01Y",null,null,"> 1 MVA",null,235.44,{"$f":"ROUND(J39 * (1 + VAT), 2)","v":270.76},106.13,{"$f":"ROUND(L39 * (1 + VAT), 2)","v":122.05},null,null,null,16.559999999999999,{"$f":"ROUND(Q39 * (1 + VAT), 2)","v":19.04},0,{"$f":"ROUND(S39 * (1 + VAT), 2)","v":0}]
["Megaflex","Me",0,1,"Me01Y",null,null,"Key customers",null,4613.6899999999996,{"$f":"ROUND(J40 * (1 + VAT), 2)","v":5305.74},147.34,{"$f":"ROUND(L40 * (1 + VAT), 2)","v":169.44}]
[]
[null,null,null,null,null,null,null,"Electrification and rural network subsidy charge  [c/kWh]"]
[]
[]
["Tariff","Tariff nameBillcode","Tx zone","Voltage","Billcode",null,null,null,"VAT incl"]
["Megaflex","Me",0,1,"Me01Y",null,null,9.17,{"$f":"ROUND(H46 * (1 + VAT), 2)","v":10.55}]

{"sheet":"Megaflex Gen NLA","index":9,"n_rows":64,"n_cols":25,"rows_kept":64,"cut":false,"hidden":false,"merged":[[1,6,1,24],[34,20,36,23],[58,12,58,13],[56,7,56,10],[56,12,56,14],[57,7,57,9],[57,10,57,11],[57,12,57,14],[58,10,58,11],[39,7,39,8],[38,7,38,8],[46,9,47,10],[48,9,48,10],[40,7,40,8],[41,7,41,8],[42,7,42,8],[43,7,43,8],[46,7,48,8],[45,7,45,10],[32,7,32,8],[33,7,33,8],[36,7,36,8],[36,9,37,10],[37,7,37,8],[31,7,31,8],[15,7,18,7],[19,7,22,7],[26,7,26,14],[27,9,28,10],[27,11,28,12],[27,13,28,14],[23,7,23,8],[30,7,30,8],[28,7,29,8],[11,7,14,7],[3,9,3,20],[4,7,6,7],[4,9,4,14],[4,15,4,20],[5,9,5,10],[5,11,5,12],[5,13,5,14],[5,15,5,16],[5,17,5,18],[5,19,5,20],[7,7,10,7],[3,21,5,22],[26,16,26,19],[26,20,26,23],[28,16,28,17],[28,20,28,21],[32,20,32,21],[28,22,29,23],[28,18,28,19],[33,20,33,21],[30,20,30,21],[31,20,31,21],[47,12,47,15],[30,16,30,17],[31,16,31,17],[32,16,32,17],[33,16,33,17],[34,16,34,17],[35,16,35,17],[39,16,39,17],[37,16,38,19],[39,18,39,19],[44,16,44,17],[43,16,43,17],[41,16,41,17],[40,16,40,17],[42,16,42,17],[36,11,37,12],[53,7,53,14],[54,7,54,11],[54,12,54,14],[55,7,55,11],[55,12,55,14]]}
[null,null,null,null,null,null,"Back to menu",null,null,null,null,null,null,null,null,null,null,null,null,null,null,null,{"$error":"#REF!"}]
["Non-municipal",null,null,null,null,null,"Megaflex Gen - Non-local authority"]
[]
[null,null,null,null,null,null,null,null,null,"Active energy charge for loads [c/kWh]",null,null,null,null,null,null,null,null,null,null,null,"Transmission network charges [R/kVA/m]"]
[null,null,null,null,null,null,null,"Transmission zone",null,"High demand season [Jun - Aug]",null,null,null,null,null,"Low demand season [Sep - May]"]
[null,null,null,null,null,null,null,null,"Voltage","Peak",null,"Standard",null,"Off Peak",null,"Peak",null,"Standard",null,"Off Peak"]
["Tariff","Tariff nameBillcode","Tx zone","Voltage","Billcode",null,null,null,null,"","VAT incl",null,"VAT incl",null,"VAT incl",null,"VAT incl",null,"VAT incl",null,"VAT incl",null,"VAT incl"]
["Genflex urban loads","GU",0,1,{"$f":"B8&C8&D8&IF($A$2=\"Non-municipal\",\"N\",IF($A$2=\"Municiple\",\"Y\",\"error\"))","v":"GU01N"},null,null,"≤ 300km","< 500V",362.73,{"$f":"ROUND(J8 * (1 + VAT), 2)","v":417.14},110.36,{"$f":"ROUND(L8 * (1 + VAT), 2)","v":126.91},60.26,{"$f":"ROUND(N8 * (1 + VAT), 2)","v":69.3},118.78,{"$f":"ROUND(P8 * (1 + VAT), 2)","v":136.6},81.96,{"$f":"ROUND(R8 * (1 + VAT), 2)","v":94.25},52.25,{"$f":"ROUND(T8 * (1 + VAT), 2)","v":60.09},10.38,{"$f":"ROUND(V8 * (1 + VAT), 2)","v":11.94}]
["Genflex urban loads","GU",0,2,{"$f":"B9&C9&D9&IF($A$2=\"Non-municipal\",\"N\",IF($A$2=\"Municiple\",\"Y\",\"error\"))","v":"GU02N"},null,null,null,"≥ 500V & < 66kV",357.04,410.6,108.16,124.38,58.74,67.55,116.45,133.91999999999999,80.17,92.2,50.86,58.49,9.48,10.9]
["Genflex urban loads","GU",0,3,"GU03N",null,null,null,"≥ 66kV & ≤ 132kV",345.73,397.59,104.73,120.44,56.88,65.41,112.79,129.71,77.61,89.25,49.26,56.65,9.23,10.61]
["Genflex urban loads","GU",0,4,"GU04N",null,null,null,"> 132kV*",325.83999999999997,374.72,98.7,113.51,53.61,61.65,106.32,122.27,73.150000000000006,84.12,46.42,53.38,11.67,13.42]
["Genflex urban loads","GU",1,1,"GU11N",null,null,"> 300km and \n≤ 600km","< 500V",365.69,420.54,110.8,127.42,60.16,69.180000000000007,119.3,137.19999999999999,82.14,94.46,52.11,59.93,10.45,12.02]
["Genflex urban loads","GU",1,2,"GU12N",null,null,null,"≥ 500V & < 66kV",360.6,414.69,109.23,125.61,59.32,68.22,117.65,135.30000000000001,80.959999999999994,93.1,51.36,59.06,9.57,11.01]
["Genflex urban loads","GU",1,3,"GU13N",null,null,null,"≥ 66kV & ≤ 132kV",349.13,401.5,105.75,121.61,57.41,66.02,113.88,130.96,78.38,90.14,49.73,57.19,9.3000000000000007,10.7]
["Genflex urban loads","GU",1,4,"GU14N",null,null,null,"> 132kV*",329.11,378.48,99.71,114.67,54.11,62.23,107.34,123.44,73.87,84.95,46.85,53.88,11.78,13.55]
["Genflex urban loads","GU",2,1,"GU21N",null,null,"> 600km and \n≤ 900km","< 500V",369.33,424.73,111.88,128.66,60.73,69.84,120.48,138.55000000000001,82.93,95.37,52.59,60.48,10.57,12.16]
["Genflex urban loads","GU",2,2,"GU22N",null,null,null,"≥ 500V & < 66kV",364.23,418.86,110.35,126.9,59.92,68.91,118.81,136.63,81.78,94.05,51.88,59.66,9.66,11.11]
["Genflex urban loads","GU",2,3,"GU23N",null,null,null,"≥ 66kV & ≤ 132kV",352.69,405.59,106.85,122.88,58.01,66.709999999999994,115.04,132.30000000000001,79.19,91.07,50.24,57.78,9.36,10.76]
["Genflex urban loads","GU",2,4,"GU24N",null,null,null,"> 132kV*",332.42,382.28,100.69,115.79,54.71,62.92,108.43,124.69,74.62,85.81,47.35,54.45,11.95,13.74]
["Genflex urban loads","GU",3,1,"GU31N",null,null,"> 900km","< 500V",373.05,429.01,113.05,130.01,61.36,70.56,121.7,139.96,83.75,96.31,53.15,61.12,10.64,12.24]
["Genflex urban loads","GU",3,2,"GU32N",null,null,null,"≥ 500V & < 66kV",367.85,423.03,111.42,128.13,60.48,69.55,119.97,137.97,82.56,94.94,52.39,60.25,9.77,11.24]
["Genflex urban loads","GU",3,3,"GU33N",null,null,null,"≥ 66kV & ≤ 132kV",356.23,409.66,107.9,124.09,58.59,67.38,116.19,133.62,79.98,91.98,50.74,58.35,9.4499999999999993,10.87]
["Genflex urban loads","GU",3,4,"GU34N",null,null,null,"> 132kV*",335.66,386.01,101.72,116.98,55.27,63.56,109.56,125.99,75.44,86.76,47.88,55.06,12.04,13.85]
["Gen-purchase","NLPurchADJ",0,4,"NLPurchADJ04N",null,null,"WEPS energy rate excluding losses",null,322.39042247946969,370.75,97.65509053131494,{"$f":"ROUND(L24 * (1 + VAT), 2)","v":112.3},53.042445829623034,{"$f":"ROUND(N24 * (1 + VAT), 2)","v":61},105.19441970911249,{"$f":"ROUND(P24 * (1 + VAT), 2)","v":120.97},72.375581280300793,{"$f":"ROUND(R24 * (1 + VAT), 2)","v":83.23},45.928564361333734,{"$f":"ROUND(T24 * (1 + VAT), 2)","v":52.82}]
["TUoS network charges for Transmission connected generators","GenTUOS","Cape",4,"GenTUOSCape4N",null,null,null,"* 132 kV or Transmission connected"]
["TUoS network charges for Transmission connected generators","GenTUOS","Karoo",4,"GenTUOSKaroo4N"]
["TUoS network charges for Transmission connected generators","GenTUOS","Kwazulu-Natal",4,"GenTUOSKwazulu-Natal4N",null,null,"Distribution network charges for loads",null,null,null,null,null,null,null,null,"Transmission network charges for generators ",null,null,null,"Distribution network charges for generators*"]
["TUoS network charges for Transmission connected generators","GenTUOS","Vaal",4,"GenTUOSVaal4N",null,null,null,null,"Network capacity charge \n[R/kVA/m]",null,"Network demand charge \n[R/kVA/m]",null,"Urban low voltage subsidy charge [R/kVA/m]"]
["TUoS network charges for Transmission connected generators","GenTUOS","Waterburg",4,"GenTUOSWaterburg4N",null,null,"Voltage",null,null,null,null,null,null,null,null,"TUoS [ > 132kV]",null,"Network charge\n[R/kW]",null,"Voltage ",null,"Network capacity charge    [R/kW/m]"]
["TUoS network charges for Transmission connected generators","GenTUOS","Mpumalanga",4,"GenTUOSMpumalanga4N",null,null,"Voltage",null,null,"VAT incl",null,"VAT incl",null,"VAT incl",null,null,null,null,"VAT incl"]
["Genflex urban loads","GU",0,1,{"$f":"B31&C31&D31&IF($A$2=\"Non-municipal\",\"N\",IF($A$2=\"Municiple\",\"Y\",\"error\"))","v":"GU01N"},null,null,"< 500V",null,20.62,{"$f":"ROUND(J31 * (1 + VAT), 2)","v":23.71},39.1,{"$f":"ROUND(L31 * (1 + VAT), 2)","v":44.97},0,{"$f":"ROUND(N31 * (1 + VAT), 2)","v":0},null,"Cape",null,0,{"$f":"ROUND(S31 * (1 + VAT), 2)","v":0},null,null,null,"VAT incl"]
["Genflex urban loads","GU",0,2,{"$f":"B32&C32&D32&IF($A$2=\"Non-municipal\",\"N\",IF($A$2=\"Municiple\",\"Y\",\"error\"))","v":"GU02N"},null,null,"≥ 500V & < 66kV",null,18.91,{"$f":"ROUND(J32 * (1 + VAT), 2)","v":21.75},35.869999999999997,{"$f":"ROUND(L32 * (1 + VAT), 2)","v":41.25},0,{"$f":"ROUND(N32 * (1 + VAT), 2)","v":0},null,"Karoo",null,0,0,"< 500V"]
["Genflex urban loads","GU",0,3,{"$f":"B33&C33&D33&IF($A$2=\"Non-municipal\",\"N\",IF($A$2=\"Municiple\",\"Y\",\"error\"))","v":"GU03N"},null,null,"≥ 66kV & ≤ 132kV",null,6.75,{"$f":"ROUND(J33 * (1 + VAT), 2)","v":7.76},12.51,{"$f":"ROUND(L33 * (1 + VAT), 2)","v":14.39},16.66,{"$f":"ROUND(N33 * (1 + VAT), 2)","v":19.16},null,"Kwazulu-Natal",null,2.4500000000000002,2.82,"≥ 500V & < 66kV"]
["Genflex urban loads","GU",0,4,{"$f":"B34&C34&D34&IF($A$2=\"Non-municipal\",\"N\",IF($A$2=\"Municiple\",\"Y\",\"error\"))","v":"GU04N"},null,null,"> 132kV / Transmission connected",null,0,{"$f":"ROUND(J34 * (1 + VAT), 2)","v":0},0,{"$f":"ROUND(L34 * (1 + VAT), 2)","v":0},16.66,{"$f":"ROUND(N34 * (1 + VAT), 2)","v":19.16},null,"Vaal",null,8.16,9.3800000000000008,"≥ 66kV & ≤ 132kV",null,16.68,{"$f":"ROUND(W34 * (1 + VAT), 2)","v":19.18}]
["Gen-DUoS urban","NEGenDUoSU",0,3,{"$f":"B35&C35&D35&IF($A$2=\"Non-municipal\",\"N\",IF($A$2=\"Municiple\",\"Y\",\"error\"))","v":"NEGenDUoSU03N"},null,null,null,null,null,null,null,null,null,null,null,"Waterberg",null,10.45,12.02,"* The Distribution network charge will be rebated by the Losses charge, but not beyond extintion"]
[null,null,null,null,null,null,null,null,null,null,null,null,null,null,null,null,"Mpumalanga",null,9.6999999999999993,11.16]
[null,null,null,null,null,null,null,"Customer categories",null,"Service charge  [R/account/day]",null,"Administration charge  [R/POD/day]"]
[null,null,null,null,null,null,null,"[kVA or MVA = loads]",null,null,null,null,null,null,null,null,"Ancillary service charge for loads and generators"]
["Tariff","Tariff nameBillcode","Tx zone","Voltage","Billcode",null,null,"[kW or MW = generators]",null,null,"VAT incl",null,"VAT incl"]
["Genflex urban loads","GU",0,1,{"$f":"B40&C40&D40&IF($A$2=\"Non-municipal\",\"N\",IF($A$2=\"Municiple\",\"Y\",\"error\"))","v":"GU01N"},null,null,"≤ 100 KVA/ kW ",null,16.850000000000001,{"$f":"ROUND(J40 * (1 + VAT), 2)","v":19.38},3.7,{"$f":"ROUND(L40 * (1 + VAT), 2)","v":4.26},null,null,null,"Voltage",null,"Ancillary service charge [c/kWh]"]
["Genflex urban loads","GU",0,1,{"$f":"B41&C41&D41&IF($A$2=\"Non-municipal\",\"N\",IF($A$2=\"Municiple\",\"Y\",\"error\"))","v":"GU01N"},null,null,"> 100 kVA/ kW & ≤ 500 kVA/ kW",null,76.94,{"$f":"ROUND(J41 * (1 + VAT), 2)","v":88.48},21.58,{"$f":"ROUND(L41 * (1 + VAT), 2)","v":24.82},null,null,null,null,null,null,"VAT incl"]
["Genflex urban loads","GU",0,1,{"$f":"B42&C42&D42&IF($A$2=\"Non-municipal\",\"N\",IF($A$2=\"Municiple\",\"Y\",\"error\"))","v":"GU01N"},null,null,"> 500 kVA/ kW & ≤ 1 MVA/MW",null,236.74,{"$f":"ROUND(J42 * (1 + VAT), 2)","v":272.25},42.85,{"$f":"ROUND(L42 * (1 + VAT), 2)","v":49.28},null,null,null,"< 500V",null,0.48,{"$f":"ROUND(S42 * (1 + VAT), 2)","v":0.55000000000000004}]
["Genflex urban loads","GU",0,1,{"$f":"B43&C43&D43&IF($A$2=\"Non-municipal\",\"N\",IF($A$2=\"Municiple\",\"Y\",\"error\"))","v":"GU01N"},null,null,"> 1 MVA/MW",null,236.74,{"$f":"ROUND(J43 * (1 + VAT), 2)","v":272.25},106.69,{"$f":"ROUND(L43 * (1 + VAT), 2)","v":122.69},null,null,null,"≥ 500V & < 66kV",null,0.47,{"$f":"ROUND(S43 * (1 + VAT), 2)","v":0.54}]
["Genflex urban loads","GU",0,1,{"$f":"B44&C44&D44&IF($A$2=\"Non-municipal\",\"N\",IF($A$2=\"Municiple\",\"Y\",\"error\"))","v":"GU01N"},null,null,"Key customers or Transmission connected generators",null,4639.2,{"$f":"ROUND(J44 * (1 + VAT), 2)","v":5335.08},148.16,{"$f":"ROUND(L44 * (1 + VAT), 2)","v":170.38},null,null,null,"≥ 66kV & ≤ 132kV",null,0.45,{"$f":"ROUND(S44 * (1 + VAT), 2)","v":0.52}]
[null,null,null,null,null,null,null,null,null,null,null,null,null,null,null,null,"> 132kV",null,0.42,{"$f":"ROUND(S45 * (1 + VAT), 2)","v":0.48},null,null,null,null,{"$f":"'Loss Factors'!R10","v":0}]
[null,null,null,null,null,null,null,"Applicable to loads",null,null,null,null,null,null,null,null,"* 132 kV or Transmission connected"]
[null,null,null,null,null,null,null,"Electrification and rural network subsidy charge  [c/kWh]",null,"Affordability subsidy charge [c/kWh] \nOnly payable by non-local authority tariffs"]
[null,null,null,null,null,null,null,null,null,null,null,null,"Reactive energy charge  [c/kVArh] (loads)"]
[null,null,null,null,null,null,null,null,null,null,null,null,"High season",null,"Low season"]
["Tariff","Tariff nameBillcode","Tx zone","Voltage","Billcode",null,null,null,"VAT incl",null,"VAT incl",null,null,"VAT incl",null,"VAT incl"]
["Genflex urban loads","GU",0,1,{"$f":"B51&C51&D51&IF($A$2=\"Non-municipal\",\"N\",IF($A$2=\"Municiple\",\"Y\",\"error\"))","v":"GU01N"},null,null,9.2200000000000006,{"$f":"ROUND(H51 * (1 + VAT), 2)","v":10.6},4.34,{"$f":"ROUND(J51 * (1 + VAT), 2)","v":4.99},null,16.68,{"$f":"ROUND(M51 * (1 + VAT), 2)","v":19.18},0,{"$f":"ROUND(O51 * (1 + VAT), 2)","v":0}]
[]
[]
[null,null,null,null,null,null,null,"Losses charge for generators"]
[null,null,null,null,null,null,null,"Distribution connected generators",null,null,null,null,"Transmission connected generators"]
[null,null,null,null,null,null,null,"Formula",null,null,null,null,"Formula"]
[null,null,null,null,null,null,null,"Distribution = - ((Energy produced x WEPS rate excluding losses) x (Distribution loss factor x Transmission loss factor-1)) in each TOU period",null,null,null,null,"Transmission = (Energy produced x WEPS rate excluding losses) x (Transmission loss factor-1/Transmission loss factor) in each TOU period"]
[null,null,null,null,null,null,null,"Transmission loss factors for Distribution connected",null,null,"Distribution loss factors",null,"Generator loss factor"]
[null,null,null,null,null,null,null,"Distance from Johannesburg",null,null,{"$f":"'Loss Factors'!N5","v":"Voltage"},null,{"$f":"' TUoS NLA'!I38","v":"Cape"},null,{"$f":"' TUoS NLA'!J38","v":0.97099999999999997}]
[null,null,null,null,null,null,null,{"$f":"'Loss Factors'!R6","v":"≤ 300km"},null,{"$f":"'Loss Factors'!T6","v":1.0106999999999999},"< 500V",{"$f":"'Loss Factors'!O6","v":1.1111},{"$f":"' TUoS NLA'!I39","v":"Karoo"},null,{"$f":"' TUoS NLA'!J39","v":0.995}]
[null,null,null,null,null,null,null,{"$f":"'Loss Factors'!R7","v":"> 300km & ≤ 600km"},null,{"$f":"'Loss Factors'!T7","v":1.0207999999999999},"≥ 500V & < 66kV",{"$f":"'Loss Factors'!O7","v":1.0956999999999999},{"$f":"' TUoS NLA'!I40","v":"Kwazulu-Natal"},null,{"$f":"' TUoS NLA'!J40","v":1.004}]
[null,null,null,null,null,null,null,{"$f":"'Loss Factors'!R8","v":"> 600km & ≤ 900km"},null,{"$f":"'Loss Factors'!T8","v":1.0309999999999999},"≥ 66kV & ≤ 132kV",{"$f":"'Loss Factors'!O8","v":1.0610999999999999},{"$f":"' TUoS NLA'!I41","v":"Vaal"},null,{"$f":"' TUoS NLA'!J41","v":1.02}]
[null,null,null,null,null,null,null,{"$f":"'Loss Factors'!R9","v":"> 900km"},null,{"$f":"'Loss Factors'!T9","v":1.0412999999999999},"> 132kV*",{"$f":"'Loss Factors'!O9","v":1},{"$f":"' TUoS NLA'!I42","v":"Waterberg"},null,{"$f":"' TUoS NLA'!J42","v":1.0229999999999999}]
[null,null,null,null,null,null,null,"* 132 kV or Transmission connected",null,null,null,null,{"$f":"' TUoS NLA'!I43","v":"Mpumalanga"},null,{"$f":"' TUoS NLA'!J43","v":1.0209999999999999}]

{"sheet":"Miniflex NLA","index":10,"n_rows":45,"n_cols":23,"rows_kept":45,"cut":false,"hidden":false,"merged":[[3,21,5,22],[1,6,1,23],[5,17,5,18],[5,19,5,20],[7,7,10,7],[3,9,3,20],[4,7,6,7],[4,9,4,14],[4,15,4,20],[5,9,5,10],[25,9,26,10],[25,11,26,12],[5,11,5,12],[5,13,5,14],[5,15,5,16],[11,7,14,7],[15,7,18,7],[19,7,22,7],[27,7,27,8],[25,7,25,8],[35,7,37,8],[27,15,27,16],[27,17,27,18],[27,20,27,22],[28,7,28,8],[37,9,37,10],[37,14,37,15],[37,16,37,17],[30,7,30,8],[31,7,31,8],[32,7,32,8],[35,9,36,10],[35,14,36,17],[29,7,29,8]]}
[null,null,null,null,null,null,"Back to menu",null,null,null,null,null,null,null,null,null,null,null,null,null,null,null,{"$error":"#REF!"}]
["Non-municipal",null,null,null,null,null,"Miniflex - Non-Local Authority"]
[]
[null,null,null,null,null,null,null,null,null,"Active energy charge [c/kWh]",null,null,null,null,null,null,null,null,null,null,null,"Network capacity charge [R/kVA/m]"]
[null,null,null,null,null,null,null,"Transmission zone",null,"High demand season [Jun - Aug]",null,null,null,null,null,"Low demand season [Sep - May]"]
[null,null,null,null,null,null,null,null,"Voltage","Peak",null,"Standard",null,"Off Peak",null,"Peak",null,"Standard",null,"Off Peak"]
["Tariff","Tariff nameBillcode","Tx zone","Voltage","Billcode",null,null,null,null,"","VAT incl",null,"VAT incl",null,"VAT incl",null,"VAT incl",null,"VAT incl",null,"VAT incl",null,"VAT incl"]
["Miniflex","Mi",0,1,{"$f":"B8&C8&D8&IF($A$2=\"Non-municipal\",\"N\",IF($A$2=\"Municiple\",\"Y\",\"error\"))","v":"Mi01N"},null,null,"≤ 300km","< 500V",362.73,{"$f":"ROUND(J8 * (1 + VAT), 2)","v":417.14},110.36,{"$f":"ROUND(L8 * (1 + VAT), 2)","v":126.91},60.26,{"$f":"ROUND(N8 * (1 + VAT), 2)","v":69.3},118.78,{"$f":"ROUND(P8 * (1 + VAT), 2)","v":136.6},81.96,{"$f":"ROUND(R8 * (1 + VAT), 2)","v":94.25},52.25,{"$f":"ROUND(T8 * (1 + VAT), 2)","v":60.09},30.96,{"$f":"ROUND(V8 * (1 + VAT), 2)","v":35.6}]
["Miniflex","Mi",0,2,{"$f":"B9&C9&D9&IF($A$2=\"Non-municipal\",\"N\",IF($A$2=\"Municiple\",\"Y\",\"error\"))","v":"Mi02N"},null,null,null,"≥ 500V & < 66kV",357.04,410.6,108.16,124.38,58.74,67.55,116.45,133.91999999999999,80.17,92.2,50.86,58.49,28.38,32.64]
["Miniflex","Mi",0,3,"Mi03N",null,null,null,"≥ 66kV & ≤ 132kV",345.73,397.59,104.73,120.44,56.88,65.41,112.79,129.71,77.61,89.25,49.26,56.65,15.94,18.329999999999998]
["Miniflex","Mi",0,4,"Mi04N",null,null,null,"> 132kV*",325.83999999999997,374.72,98.7,113.51,53.61,61.65,106.32,122.27,73.150000000000006,84.12,46.42,53.38,11.62,13.36]
["Miniflex","Mi",1,1,"Mi11N",null,null,"> 300km and \n≤ 600km","< 500V",365.69,420.54,110.8,127.42,60.16,69.180000000000007,119.3,137.19999999999999,82.14,94.46,52.11,59.93,31.04,35.700000000000003]
["Miniflex","Mi",1,2,"Mi12N",null,null,null,"≥ 500V & < 66kV",360.6,414.69,109.23,125.61,59.32,68.22,117.65,135.30000000000001,80.959999999999994,93.1,51.36,59.06,28.46,32.729999999999997]
["Miniflex","Mi",1,3,"Mi13N",null,null,null,"≥ 66kV & ≤ 132kV",349.13,401.5,105.75,121.61,57.41,66.02,113.88,130.96,78.38,90.14,49.73,57.19,16,18.399999999999999]
["Miniflex","Mi",1,4,"Mi14N",null,null,null,"> 132kV*",329.11,378.48,99.71,114.67,54.11,62.23,107.34,123.44,73.87,84.95,46.85,53.88,11.74,13.5]
["Miniflex","Mi",2,1,"Mi21N",null,null,"> 600km and \n≤ 900km","< 500V",369.33,424.73,111.88,128.66,60.73,69.84,120.48,138.55000000000001,82.93,95.37,52.59,60.48,31.18,35.86]
["Miniflex","Mi",2,2,"Mi22N",null,null,null,"≥ 500V & < 66kV",364.23,418.86,110.35,126.9,59.92,68.91,118.81,136.63,81.78,94.05,51.88,59.66,28.55,32.83]
["Miniflex","Mi",2,3,"Mi23N",null,null,null,"≥ 66kV & ≤ 132kV",352.69,405.59,106.85,122.88,58.01,66.709999999999994,115.04,132.30000000000001,79.19,91.07,50.24,57.78,16.100000000000001,18.52]
["Miniflex","Mi",2,4,"Mi24N",null,null,null,"> 132kV*",332.42,382.28,100.69,115.79,54.71,62.92,108.43,124.69,74.62,85.81,47.35,54.45,11.91,13.7]
["Miniflex","Mi",3,1,"Mi31N",null,null,"> 900km","< 500V",373.05,429.01,113.05,130.01,61.36,70.56,121.7,139.96,83.75,96.31,53.15,61.12,31.21,35.89]
["Miniflex","Mi",3,2,"Mi32N",null,null,null,"≥ 500V & < 66kV",367.85,423.03,111.42,128.13,60.48,69.55,119.97,137.97,82.56,94.94,52.39,60.25,28.65,32.950000000000003]
["Miniflex","Mi",3,3,"Mi33N",null,null,null,"≥ 66kV & ≤ 132kV",356.23,409.66,107.9,124.09,58.59,67.38,116.19,133.62,79.98,91.98,50.74,58.35,16.16,18.579999999999998]
["Miniflex","Mi",3,4,"Mi34N",null,null,null,"> 132kV*",335.66,386.01,101.72,116.98,55.27,63.56,109.56,125.99,75.44,86.76,47.88,55.06,11.99,13.79]
[null,null,null,null,null,null,null,null,"* 132 kV or Transmission connected"]
[]
[null,null,null,null,null,null,null,"Customer categories",null,"Service charge  [R/account/day]",null,"Administration charge  [R/POD/day]"]
[]
["Tariff","Tariff nameBillcode","Tx zone","Voltage","Billcode",null,null,null,null,null,"VAT incl",null,"VAT incl",null,null,"Ancillary service charge [c/kWh]",null,"Network demand charge [c/kWh]        \n     [Peak & Standard]",null,null,"Urban low voltage subsidy charge [R/kVA/m]"]
["Miniflex","Mi",0,1,{"$f":"B29&C29&D29&IF($A$2=\"Non-municipal\",\"N\",IF($A$2=\"Municiple\",\"Y\",\"error\"))","v":"Mi01N"},null,null,"≤ 100 kVA",null,16.850000000000001,{"$f":"ROUND(J29 * (1 + VAT), 2)","v":19.38},3.7,{"$f":"ROUND(L29 * (1 + VAT), 2)","v":4.26},null,"Voltage",null,"VAT incl",null,"VAT incl",null,null,null,"VAT incl"]
["Miniflex","Mi",0,1,{"$f":"B30&C30&D30&IF($A$2=\"Non-municipal\",\"N\",IF($A$2=\"Municiple\",\"Y\",\"error\"))","v":"Mi01N"},null,null,"> 100 kVA & ≤ 500 kVA",null,76.94,{"$f":"ROUND(J30 * (1 + VAT), 2)","v":88.48},21.58,{"$f":"ROUND(L30 * (1 + VAT), 2)","v":24.82},null,"< 500V",0.48,{"$f":"ROUND(P30 * (1 + VAT), 2)","v":0.55000000000000004},19.16,{"$f":"ROUND(R30 * (1 + VAT), 2)","v":22.03},null,"< 500V",0,{"$f":"ROUND(V30 * (1 + VAT), 2)","v":0}]
["Miniflex","Mi",0,1,{"$f":"B31&C31&D31&IF($A$2=\"Non-municipal\",\"N\",IF($A$2=\"Municiple\",\"Y\",\"error\"))","v":"Mi01N"},null,null,"> 500 kVA & ≤ 1 MVA",null,236.74,{"$f":"ROUND(J31 * (1 + VAT), 2)","v":272.25},42.85,{"$f":"ROUND(L31 * (1 + VAT), 2)","v":49.28},null,"≥ 500V & < 66kV",0.47,{"$f":"ROUND(P31 * (1 + VAT), 2)","v":0.54},8.0299999999999994,{"$f":"ROUND(R31 * (1 + VAT), 2)","v":9.23},null,"≥ 500V & < 66kV",0,{"$f":"ROUND(V31 * (1 + VAT), 2)","v":0}]
["Miniflex","Mi",0,1,{"$f":"B32&C32&D32&IF($A$2=\"Non-municipal\",\"N\",IF($A$2=\"Municiple\",\"Y\",\"error\"))","v":"Mi01N"},null,null,"> 1 MVA",null,236.74,{"$f":"ROUND(J32 * (1 + VAT), 2)","v":272.25},106.69,{"$f":"ROUND(L32 * (1 + VAT), 2)","v":122.69},null,"≥ 66kV & ≤ 132kV",0.45,{"$f":"ROUND(P32 * (1 + VAT), 2)","v":0.52},2.8,{"$f":"ROUND(R32 * (1 + VAT), 2)","v":3.22},null,"≥ 66kV & ≤ 132kV",16.66,{"$f":"ROUND(V32 * (1 + VAT), 2)","v":19.16}]
["Miniflex","Mi",0,1,{"$f":"B33&C33&D33&IF($A$2=\"Non-municipal\",\"N\",IF($A$2=\"Municiple\",\"Y\",\"error\"))","v":"Mi01N"},null,null,"Key customers",null,4639.2,{"$f":"ROUND(J33 * (1 + VAT), 2)","v":5335.08},148.16,{"$f":"ROUND(L33 * (1 + VAT), 2)","v":170.38},null,"> 132kV*",0.42,{"$f":"ROUND(P33 * (1 + VAT), 2)","v":0.48},0,{"$f":"ROUND(R33 * (1 + VAT), 2)","v":0},null,"> 132kV*",16.66,{"$f":"ROUND(V33 * (1 + VAT), 2)","v":19.16}]
[null,null,null,null,null,null,null,null,null,null,null,null,null,null,"* 132 kV or Transmission connected",null,null,null,null,null,"* 132 kV or Transmission connected"]
[]
[null,null,null,null,null,null,null,"Electrification and rural network subsidy charge  [c/kWh]",null,"Affordability subsidy charge [c/kWh] \nOnly payable by non-local authority tariffs",null,null,null,null,"Reactive energy charge  [c/kVArh]"]
[]
[null,null,null,null,null,null,null,null,null,null,null,null,null,null,"High season",null,"Low season"]
["Tariff","Tariff nameBillcode","Tx zone","Voltage","Billcode",null,null,null,"VAT incl",null,"VAT incl",null,null,null,null,"VAT incl",null,"VAT incl"]
["Miniflex","Mi",0,1,{"$f":"B40&C40&D40&IF($A$2=\"Non-municipal\",\"N\",IF($A$2=\"Municiple\",\"Y\",\"error\"))","v":"Mi01N"},null,null,9.2200000000000006,{"$f":"ROUND(H40 * (1 + VAT), 2)","v":10.6},4.34,{"$f":"ROUND(J40 * (1 + VAT), 2)","v":4.99},null,null,null,7.27,{"$f":"ROUND(O40 * (1 + VAT), 2)","v":8.36},0,{"$f":"ROUND(Q40 * (1 + VAT), 2)","v":0}]
[]
["Miniflex","Mi",0,1,{"$f":"B42&C42&D42&IF($A$2=\"Non-municipal\",\"N\",IF($A$2=\"Municiple\",\"Y\",\"error\"))","v":"Mi01N"}]
["Miniflex","Mi",1,2,{"$f":"B43&C43&D43&IF($A$2=\"Non-municipal\",\"N\",IF($A$2=\"Municiple\",\"Y\",\"error\"))","v":"Mi12N"}]
["Miniflex","Mi",2,3,{"$f":"B44&C44&D44&IF($A$2=\"Non-municipal\",\"N\",IF($A$2=\"Municiple\",\"Y\",\"error\"))","v":"Mi23N"}]
["Miniflex","Mi",3,4,{"$f":"B45&C45&D45&IF($A$2=\"Non-municipal\",\"N\",IF($A$2=\"Municiple\",\"Y\",\"error\"))","v":"Mi34N"}]

{"sheet":"Miniflex Munic ","index":11,"n_rows":45,"n_cols":23,"rows_kept":45,"cut":false,"hidden":false,"merged":[[1,6,1,23],[3,21,5,22],[7,7,10,7],[3,9,3,20],[4,7,6,7],[4,9,4,14],[4,15,4,20],[5,9,5,10],[5,11,5,12],[5,13,5,14],[5,15,5,16],[5,17,5,18],[5,19,5,20],[27,17,27,18],[27,20,27,22],[28,7,28,8],[29,7,29,8],[11,7,14,7],[15,7,18,7],[19,7,22,7],[25,9,26,10],[25,11,26,12],[25,7,25,8],[37,11,37,12],[37,13,37,14],[27,7,27,8],[27,15,27,16],[30,7,30,8],[31,7,31,8],[32,7,32,8],[35,11,36,14],[35,7,37,8]]}
[null,null,null,null,null,null,"Back to menu"]
["Municiple",null,null,null,null,null,"Miniflex - Local Authority"]
[]
[null,null,null,null,null,null,null,null,null,"Active energy charge [c/kWh]",null,null,null,null,null,null,null,null,null,null,null,"Network capacity charge [R/kVA/m]"]
[null,null,null,null,null,null,null,"Transmission zone",null,"High demand season [Jun - Aug]",null,null,null,null,null,"Low demand season [Sep - May]"]
[null,null,null,null,null,null,null,null,"Voltage","Peak",null,"Standard",null,"Off Peak",null,"Peak",null,"Standard",null,"Off Peak"]
["Tariff","Tariff nameBillcode","Tx zone","Voltage","Billcode",null,null,null,null,"","VAT incl",null,"VAT incl",null,"VAT incl",null,"VAT incl",null,"VAT incl",null,"VAT incl",null,"VAT incl"]
["Miniflex","Mi",0,1,"Mi01Y",null,null,"≤ 300km","< 500V",371.05,{"$f":"ROUND(J8 * (1 + VAT), 2)","v":426.71},112.91,{"$f":"ROUND(L8 * (1 + VAT), 2)","v":129.85},61.61,{"$f":"ROUND(N8 * (1 + VAT), 2)","v":70.849999999999994},121.48,{"$f":"ROUND(P8 * (1 + VAT), 2)","v":139.69999999999999},83.84,{"$f":"ROUND(R8 * (1 + VAT), 2)","v":96.42},53.44,{"$f":"ROUND(T8 * (1 + VAT), 2)","v":61.46},30.94,{"$f":"ROUND(V8 * (1 + VAT), 2)","v":35.58}]
["Miniflex","Mi",0,2,"Mi02Y",null,null,null,"≥ 500V & < 66kV",365.2,419.98,110.65,127.25,60.09,69.099999999999994,119.13,137,81.99,94.29,52.03,59.83,28.34,32.590000000000003]
["Miniflex","Mi",0,3,"Mi03Y",null,null,null,"≥ 66kV & ≤ 132kV",353.68,406.73,107.14,123.21,58.19,66.92,115.38,132.69,79.42,91.33,50.37,57.93,15.92,18.309999999999999]
["Miniflex","Mi",0,4,"Mi04Y",null,null,null,"> 132kV*",333.32,383.32,100.98,116.13,54.83,63.05,108.73,125.04,74.83,86.05,47.47,54.59,11.62,13.36]
["Miniflex","Mi",1,1,"Mi11Y",null,null,"> 300km and \n≤ 600km","< 500V",374.08,430.19,113.32,130.32,61.53,70.760000000000005,122.03,140.33000000000001,84.01,96.61,53.29,61.28,31,35.65]
["Miniflex","Mi",1,2,"Mi12Y",null,null,null,"≥ 500V & < 66kV",368.85,424.18,111.74,128.5,60.68,69.78,120.34,138.38999999999999,82.82,95.24,52.53,60.41,28.45,32.72]
["Miniflex","Mi",1,3,"Mi13Y",null,null,null,"≥ 66kV & ≤ 132kV",357.14,410.71,108.18,124.41,58.74,67.55,116.5,133.97999999999999,80.180000000000007,92.21,50.85,58.48,16,18.399999999999999]
["Miniflex","Mi",1,4,"Mi14Y",null,null,null,"> 132kV*",336.65,387.15,102,117.3,55.37,63.68,109.8,126.27,75.59,86.93,47.94,55.13,11.73,13.49]
["Miniflex","Mi",2,1,"Mi21Y",null,null,"> 600km and \n≤ 900km","< 500V",377.81,434.48,114.46,131.63,62.14,71.459999999999994,123.23,141.71,84.84,97.57,53.82,61.89,31.16,35.83]
["Miniflex","Mi",2,2,"Mi22Y",null,null,null,"≥ 500V & < 66kV",372.57,428.46,112.85,129.78,61.29,70.48,121.56,139.79,83.61,96.15,53.07,61.03,28.52,32.799999999999997]
["Miniflex","Mi",2,3,"Mi23Y",null,null,null,"≥ 66kV & ≤ 132kV",360.78,414.9,109.27,125.66,59.33,68.23,117.65,135.30000000000001,80.98,93.13,51.35,59.05,16.079999999999998,18.489999999999998]
["Miniflex","Mi",2,4,"Mi24Y",null,null,null,"> 132kV*",340.02,391.02,103.02,118.47,55.93,64.319999999999993,110.93,127.57,76.34,87.79,48.43,55.69,11.89,13.67]
["Miniflex","Mi",3,1,"Mi31Y",null,null,"> 900km","< 500V",381.6,438.84,115.61,132.94999999999999,62.78,72.2,124.49,143.16,85.67,98.52,54.36,62.51,31.18,35.86]
["Miniflex","Mi",3,2,"Mi32Y",null,null,null,"≥ 500V & < 66kV",376.29,432.73,113.98,131.08000000000001,61.91,71.2,122.73,141.13999999999999,84.47,97.14,53.57,61.61,28.64,32.94]
["Miniflex","Mi",3,3,"Mi33Y",null,null,null,"≥ 66kV & ≤ 132kV",364.41,419.07,110.4,126.96,59.95,68.94,118.86,136.69,81.790000000000006,94.06,51.89,59.67,16.13,18.55]
["Miniflex","Mi",3,4,"Mi34Y",null,null,null,"> 132kV*",343.37,394.88,104.07,119.68,56.55,65.03,112.06,128.87,77.14,88.71,48.96,56.3,11.97,13.77]
[null,null,null,null,null,null,null,null,"* 132 kV or Transmission connected"]
[]
[null,null,null,null,null,null,null,"Customer categories",null,"Service charge  [R/account/day]",null,"Administration charge  [R/POD/day]"]
[]
["Tariff","Tariff nameBillcode","Tx zone","Voltage","Billcode",null,null,null,null,null,"VAT incl",null,"VAT incl",null,null,"Ancillary service charge [c/kWh]",null,"Network demand charge [c/kWh]        \n     [Peak & Standard]",null,null,"Urban low voltage subsidy charge [R/kVA/m]"]
["Miniflex","Mi",0,1,"Mi01Y",null,null,"≤ 100 kVA",null,16.739999999999998,{"$f":"ROUND(J29 * (1 + VAT), 2)","v":19.25},3.67,{"$f":"ROUND(L29 * (1 + VAT), 2)","v":4.22},null,"Voltage",null,"VAT incl",null,"VAT incl",null,null,null,"VAT incl"]
["Miniflex","Mi",0,1,"Mi01Y",null,null,"> 100 kVA & ≤ 500 kVA",null,76.5,{"$f":"ROUND(J30 * (1 + VAT), 2)","v":87.98},21.43,{"$f":"ROUND(L30 * (1 + VAT), 2)","v":24.64},null,"< 500V",0.48,{"$f":"ROUND(P30 * (1 + VAT), 2)","v":0.55000000000000004},19.14,{"$f":"ROUND(R30 * (1 + VAT), 2)","v":22.01},null,"< 500V",0,{"$f":"ROUND(V30 * (1 + VAT), 2)","v":0}]
["Miniflex","Mi",0,1,"Mi01Y",null,null,"> 500 kVA & ≤ 1 MVA",null,235.44,{"$f":"ROUND(J31 * (1 + VAT), 2)","v":270.76},42.62,{"$f":"ROUND(L31 * (1 + VAT), 2)","v":49.01},null,"≥ 500V & < 66kV",0.47,{"$f":"ROUND(P31 * (1 + VAT), 2)","v":0.54},8.0399999999999991,{"$f":"ROUND(R31 * (1 + VAT), 2)","v":9.25},null,"≥ 500V & < 66kV",0,{"$f":"ROUND(V31 * (1 + VAT), 2)","v":0}]
["Miniflex","Mi",0,1,"Mi01Y",null,null,"> 1 MVA",null,235.44,{"$f":"ROUND(J32 * (1 + VAT), 2)","v":270.76},106.13,{"$f":"ROUND(L32 * (1 + VAT), 2)","v":122.05},null,"≥ 66kV & ≤ 132kV",0.43,{"$f":"ROUND(P32 * (1 + VAT), 2)","v":0.49},2.78,{"$f":"ROUND(R32 * (1 + VAT), 2)","v":3.2},null,"≥ 66kV & ≤ 132kV",16.55,{"$f":"ROUND(V32 * (1 + VAT), 2)","v":19.03}]
["Miniflex","Mi",0,1,"Mi01Y",null,null,"Key customers",null,4613.6899999999996,{"$f":"ROUND(J33 * (1 + VAT), 2)","v":5305.74},147.34,{"$f":"ROUND(L33 * (1 + VAT), 2)","v":169.44},null,"> 132kV*",0.41,{"$f":"ROUND(P33 * (1 + VAT), 2)","v":0.47},0,{"$f":"ROUND(R33 * (1 + VAT), 2)","v":0},null,"> 132kV*",16.55,{"$f":"ROUND(V33 * (1 + VAT), 2)","v":19.03}]
[null,null,null,null,null,null,null,null,null,null,null,null,null,null,"* 132 kV or Transmission connected",null,null,null,null,null,"* 132 kV or Transmission connected"]
[]
[null,null,null,null,null,null,null,"Electrification and rural network subsidy charge  [c/kWh]",null,null,null,"Reactive energy charge  [c/kVArh]"]
[]
[null,null,null,null,null,null,null,null,null,null,null,"High season",null,"Low season"]
["Tariff","Tariff nameBillcode","Tx zone","Voltage","Billcode",null,null,null,"VAT incl",null,null,null,"VAT incl",null,"VAT incl"]
["Miniflex","Mi",0,1,"Mi01Y",null,null,9.17,{"$f":"ROUND(H40 * (1 + VAT), 2)","v":10.55},null,null,7.26,{"$f":"ROUND(L40 * (1 + VAT), 2)","v":8.35},0,{"$f":"ROUND(N40 * (1 + VAT), 2)","v":0}]
[]
["Miniflex","Mi",0,1,"Mi01Y"]
["Miniflex","Mi",1,2,"Mi12Y"]
["Miniflex","Mi",2,3,"Mi23Y"]
["Miniflex","Mi",3,4,"Mi34Y"]

{"sheet":"Businessrate NLA","index":12,"n_rows":11,"n_cols":29,"rows_kept":11,"cut":false,"hidden":false,"merged":[[1,6,1,19],[8,7,8,8],[9,7,9,8],[10,7,10,8],[3,25,4,26],[3,27,4,28],[4,17,4,18],[5,25,5,26],[5,27,5,28],[7,7,7,8],[3,9,4,10],[3,11,4,12],[3,13,4,14],[3,15,4,16],[3,17,3,18]]}
[null,null,null,null,null,null,null,"Back to menu"]
["Non-municipal",null,null,null,null,null,"Businessrate - Non-local Authority"]
[]
[null,null,null,null,null,null,null,null,null,"Energy charge [c/kWh]",null,"Ancillary service charge \n[c/kWh]",null,"Network demand charge \n [c/kWh]",null,"Network capacity charge\n [R/POD/day]",null,"Service and administration charge  \n[R/POD/day]",null,null,null,null,null,null,null,"Electrification and rural network subsidy charge  [c/kWh]",null,"Affordability subsidy charge [c/kWh] payable by non-local authority tariffs"]
[]
[null,null,null,null,null,null,null,null,null,null,null,null,null,null,null,null,null,null,null,null,null,null,null,null,null,"All seasons",null,"All seasons"]
["Tariff","Tariff nameBillcode","Tx zone","Voltage","Billcode",null,null,null,null,null,"VAT incl",null,"VAT incl",null,"VAT incl",null,"VAT incl",null,"VAT incl",null,null,null,null,null,null,null,"VAT incl",null,"VAT incl"]
["Businessrate 1","B1",0,1,{"$f":"B8&C8&D8&IF($A$2=\"Non-municipal\",\"N\",IF($A$2=\"Municiple\",\"Y\",\"error\"))","v":"B101N"},null,null,"Businessrate 1",null,124.19,{"$f":"ROUND(J8 * (1 + VAT), 2)","v":142.82},0.48,{"$f":"ROUND(L8 * (1 + VAT), 2)","v":0.55000000000000004},17.53,{"$f":"ROUND(N8 * (1 + VAT), 2)","v":20.16},25.18,{"$f":"ROUND(P8 * (1 + VAT), 2)","v":28.96},21.75,{"$f":"ROUND(R8 * (1 + VAT), 2)","v":25.01},null,null,null,null,null,null,0,{"$f":"ROUND(Z8 * (1 + VAT), 2)","v":0},0,{"$f":"ROUND(AB8 * (1 + VAT), 2)","v":0}]
["Businessrate 2","B2",0,1,{"$f":"B9&C9&D9&IF($A$2=\"Non-municipal\",\"N\",IF($A$2=\"Municiple\",\"Y\",\"error\"))","v":"B201N"},null,null,"Businessrate 2",null,124.19,{"$f":"ROUND(J9 * (1 + VAT), 2)","v":142.82},0.48,{"$f":"ROUND(L9 * (1 + VAT), 2)","v":0.55000000000000004},17.53,{"$f":"ROUND(N9 * (1 + VAT), 2)","v":20.16},42.42,{"$f":"ROUND(P9 * (1 + VAT), 2)","v":48.78},21.75,{"$f":"ROUND(R9 * (1 + VAT), 2)","v":25.01},null,null,null,null,null,null,{"$f":"Z8","v":0},{"$f":"ROUND(Z9 * (1 + VAT), 2)","v":0},{"$f":"AB8","v":0},{"$f":"ROUND(AB9 * (1 + VAT), 2)","v":0}]
["Businessrate 3","B3",0,1,{"$f":"B10&C10&D10&IF($A$2=\"Non-municipal\",\"N\",IF($A$2=\"Municiple\",\"Y\",\"error\"))","v":"B301N"},null,null,"Businessrate 3",null,124.19,{"$f":"ROUND(J10 * (1 + VAT), 2)","v":142.82},0.48,{"$f":"ROUND(L10 * (1 + VAT), 2)","v":0.55000000000000004},17.53,{"$f":"ROUND(N10 * (1 + VAT), 2)","v":20.16},73.290000000000006,{"$f":"ROUND(P10 * (1 + VAT), 2)","v":84.28},21.75,{"$f":"ROUND(R10 * (1 + VAT), 2)","v":25.01},null,null,null,null,null,null,{"$f":"Z8","v":0},{"$f":"ROUND(Z10 * (1 + VAT), 2)","v":0},{"$f":"AB8","v":0},{"$f":"ROUND(AB10 * (1 + VAT), 2)","v":0}]
["Businessrate 4","B4",0,1,{"$f":"B11&C11&D11&IF($A$2=\"Non-municipal\",\"N\",IF($A$2=\"Municiple\",\"Y\",\"error\"))","v":"B401N"},null,null,"Businessrate 4",null,334.21,{"$f":"ROUND(J11 * (1 + VAT), 2)","v":384.34},0.48,{"$f":"ROUND(L11 * (1 + VAT), 2)","v":0.55000000000000004},17.53,{"$f":"ROUND(N11 * (1 + VAT), 2)","v":20.16},null,null,null,null,null,null,null,null,null,null,{"$f":"Z9","v":0},{"$f":"ROUND(Z11 * (1 + VAT), 2)","v":0},{"$f":"AB9","v":0},{"$f":"ROUND(AB11 * (1 + VAT), 2)","v":0}]

{"sheet":"Businessrate Munic","index":13,"n_rows":11,"n_cols":29,"rows_kept":11,"cut":false,"hidden":false,"merged":[[1,6,1,19],[8,7,8,8],[9,7,9,8],[10,7,10,8],[3,25,4,26],[3,27,4,28],[4,17,4,18],[5,25,5,26],[5,27,5,28],[7,7,7,8],[3,9,4,10],[3,11,4,12],[3,13,4,14],[3,15,4,16],[3,17,3,18]]}
[null,null,null,null,null,null,null,"Back to menu"]
["Municiple",null,null,null,null,null,"Businessrate - Local Authority"]
[]
[null,null,null,null,null,null,null,null,null,"Energy charge [c/kWh]",null,"Ancillary service charge \n[c/kWh]",null,"Network demand charge \n [c/kWh]",null,"Network capacity charge\n [R/POD/day]",null,"Service and administration charge  \n[R/POD/day]",null,null,null,null,null,null,null,"Electrification and rural network subsidy charge  [c/kWh]",null,"Affordability subsidy charge [c/kWh] payable by non-local authority tariffs"]
[]
[null,null,null,null,null,null,null,null,null,null,null,null,null,null,null,null,null,null,null,null,null,null,null,null,null,"All seasons",null,"All seasons"]
["Tariff","Tariff nameBillcode","Tx zone","Voltage","Billcode",null,null,null,null,null,"VAT incl",null,"VAT incl",null,"VAT incl",null,"VAT incl",null,"VAT incl",null,null,null,null,null,null,null,"VAT incl",null,"VAT incl"]
["Businessrate 1","B1",0,1,{"$f":"B8&C8&D8&IF($A$2=\"Non-municipal\",\"N\",IF($A$2=\"Municiple\",\"Y\",\"error\"))","v":"B101Y"},null,null,"Businessrate 1",null,127.04,{"$f":"ROUND(J8 * (1 + VAT), 2)","v":146.1},0.48,{"$f":"ROUND(L8 * (1 + VAT), 2)","v":0.55000000000000004},17.61,{"$f":"ROUND(N8 * (1 + VAT), 2)","v":20.25},25.25,{"$f":"ROUND(P8 * (1 + VAT), 2)","v":29.04},21.62,{"$f":"ROUND(R8 * (1 + VAT), 2)","v":24.86},null,null,null,null,null,null,0,{"$f":"ROUND(Z8 * (1 + VAT), 2)","v":0},0,{"$f":"ROUND(AB8 * (1 + VAT), 2)","v":0}]
["Businessrate 2","B2",0,1,{"$f":"B9&C9&D9&IF($A$2=\"Non-municipal\",\"N\",IF($A$2=\"Municiple\",\"Y\",\"error\"))","v":"B201Y"},null,null,"Businessrate 2",null,127.04,{"$f":"ROUND(J9 * (1 + VAT), 2)","v":146.1},0.48,{"$f":"ROUND(L9 * (1 + VAT), 2)","v":0.55000000000000004},17.61,{"$f":"ROUND(N9 * (1 + VAT), 2)","v":20.25},42.58,{"$f":"ROUND(P9 * (1 + VAT), 2)","v":48.97},21.62,{"$f":"ROUND(R9 * (1 + VAT), 2)","v":24.86},null,null,null,null,null,null,{"$f":"Z8","v":0},{"$f":"ROUND(Z9 * (1 + VAT), 2)","v":0},{"$f":"AB8","v":0},{"$f":"ROUND(AB9 * (1 + VAT), 2)","v":0}]
["Businessrate 3","B3",0,1,{"$f":"B10&C10&D10&IF($A$2=\"Non-municipal\",\"N\",IF($A$2=\"Municiple\",\"Y\",\"error\"))","v":"B301Y"},null,null,"Businessrate 3",null,127.04,{"$f":"ROUND(J10 * (1 + VAT), 2)","v":146.1},0.48,{"$f":"ROUND(L10 * (1 + VAT), 2)","v":0.55000000000000004},17.61,{"$f":"ROUND(N10 * (1 + VAT), 2)","v":20.25},73.58,{"$f":"ROUND(P10 * (1 + VAT), 2)","v":84.62},21.62,{"$f":"ROUND(R10 * (1 + VAT), 2)","v":24.86},null,null,null,null,null,null,{"$f":"Z8","v":0},{"$f":"ROUND(Z10 * (1 + VAT), 2)","v":0},{"$f":"AB8","v":0},{"$f":"ROUND(AB10 * (1 + VAT), 2)","v":0}]
["Businessrate 4","B4",0,1,{"$f":"B11&C11&D11&IF($A$2=\"Non-municipal\",\"N\",IF($A$2=\"Municiple\",\"Y\",\"error\"))","v":"B401Y"},null,null,"Businessrate 4",null,341.87,{"$f":"ROUND(J11 * (1 + VAT), 2)","v":393.15},0.48,{"$f":"ROUND(L11 * (1 + VAT), 2)","v":0.55000000000000004},17.61,{"$f":"ROUND(N11 * (1 + VAT), 2)","v":20.25},null,null,null,null,null,null,null,null,null,null,{"$f":"Z9","v":0},{"$f":"ROUND(Z11 * (1 + VAT), 2)","v":0},{"$f":"AB9","v":0},{"$f":"ROUND(AB11 * (1 + VAT), 2)","v":0}]

{"sheet":"Public Lighting NLA","index":14,"n_rows":14,"n_cols":14,"rows_kept":14,"cut":false,"hidden":false,"merged":[[1,6,1,14],[8,8,8,9],[8,12,8,13],[10,7,11,9],[10,10,10,11],[3,10,3,11],[3,12,3,13],[5,7,6,7],[5,8,5,9],[6,8,6,9]]}
[null,null,null,null,null,null,null,"Back to menu"]
["Non-municipal",null,null,null,null,null,"Public Lighting - Non-local Authority"]
[]
[null,null,null,null,null,null,null,null,null,null,"All Night ",null,"24 Hours "]
["Tariff","Tariff nameBillcode","Tx zone","Voltage","Billcode",null,null,null,null,null,"","VAT incl","","VAT incl"]
["Public lighting 24 hours","Pu",0,1,{"$f":"B6&C6&D6&IF($A$2=\"Non-municipal\",\"N\",IF($A$2=\"Municiple\",\"Y\",\"error\"))","v":"Pu01N"},null,null,"Public Lighting","Energy charge [c/kWh]",null,98.83,{"$f":"ROUND(K6 * (1 + VAT), 2)","v":113.65},132.33000000000001,{"$f":"ROUND(M6 * (1 + VAT), 2)","v":152.18}]
["Public lighting All Night","Pa",0,1,{"$f":"B7&C7&D7&IF($A$2=\"Non-municipal\",\"N\",IF($A$2=\"Municiple\",\"Y\",\"error\"))","v":"Pa01N"},null,null,null,"Energy charge [R/100W/month]",null,30.92,{"$f":"ROUND(K7 * (1 + VAT), 2)","v":35.56},89.13,{"$f":"ROUND(M7 * (1 + VAT), 2)","v":102.5}]
[]
["Public lighting Urban fixed","Pt",0,1,{"$f":"B9&C9&D9&IF($A$2=\"Non-municipal\",\"N\",IF($A$2=\"Municiple\",\"Y\",\"error\"))","v":"Pt01N"},null,null,"Public Lighting - Urban Fixed","Fixed charge [R/POD/day]",null,6.5,{"$f":"ROUND(K9 * (1 + VAT), 2)","v":7.48}]
[]
[null,null,null,null,null,null,null,"Maintenance charges",null,null,"R/month"]
[null,null,null,null,null,null,null,null,null,null,"","VAT incl"]
["Public Lighting - Maintenance charge - per lumanaire","Plu",0,1,{"$f":"B13&C13&D13&IF($A$2=\"Non-municipal\",\"N\",IF($A$2=\"Municiple\",\"Y\",\"error\"))","v":"Plu01N"},null,null,null,null,"Per lumanaire",52.41,{"$f":"ROUND(K13 * (1 + VAT), 2)","v":60.27}]
["Public Lighting - Maintenance charge - per high-mast lumanaire","Plhm",0,1,{"$f":"B14&C14&D14&IF($A$2=\"Non-municipal\",\"N\",IF($A$2=\"Municiple\",\"Y\",\"error\"))","v":"Plhm01N"},null,null,null,null,"Per high-mast lumanaire",1219.96,{"$f":"ROUND(K14 * (1 + VAT), 2)","v":1402.95}]

{"sheet":"Public Lighting Munic ","index":15,"n_rows":14,"n_cols":29,"rows_kept":14,"cut":false,"hidden":false,"merged":[[1,6,1,14],[8,8,8,9],[8,12,8,13],[10,7,11,9],[10,10,10,11],[3,10,3,11],[3,12,3,13],[5,7,6,7],[5,8,5,9],[6,8,6,9]]}
[null,null,null,null,null,null,null,"Back to menu"]
["Municipal",null,null,null,null,null,"Public Lighting - Local Authority",null,null,null,null,null,null,null,null,null,null,null,null,null,null,null,null,null,null,null,null,{"$f":"SUM(#REF!)","v":{"$error":"#REF!"}},"check value"]
[]
[null,null,null,null,null,null,null,null,null,null,"All Night ",null,"24 Hours "]
["Tariff","Tariff nameBillcode","Tx zone","Voltage","Billcode",null,null,null,null,null,"","VAT incl","","VAT incl"]
["Public lighting 24 hours","Pu",0,1,{"$f":"B6&C6&D6&IF($A$2=\"Non-municipal\",\"N\",IF($A$2=\"Municipal\",\"Y\",\"error\"))","v":"Pu01Y"},null,null,"Public Lighting","Energy charge [c/kWh]",null,102.55,{"$f":"ROUND(K6 * (1 + VAT), 2)","v":117.93},137.31,{"$f":"ROUND(M6 * (1 + VAT), 2)","v":157.91}]
["Public lighting All Night","Pa",0,1,{"$f":"B7&C7&D7&IF($A$2=\"Non-municipal\",\"N\",IF($A$2=\"Municipal\",\"Y\",\"error\"))","v":"Pa01Y"},null,null,null,"Energy charge [R/100W/month]",null,31.32,{"$f":"ROUND(K7 * (1 + VAT), 2)","v":36.020000000000003},90.27,{"$f":"ROUND(M7 * (1 + VAT), 2)","v":103.81}]
[]
["Public lighting Urban fixed","Pt",0,1,{"$f":"B9&C9&D9&IF($A$2=\"Non-municipal\",\"N\",IF($A$2=\"Municipal\",\"Y\",\"error\"))","v":"Pt01Y"},null,null,"Public Lighting - Urban Fixed ","Fixed charge [R/POD/day]",null,6.7430063090341816,{"$f":"ROUND(K9 * (1 + VAT), 2)","v":7.75}]
[]
[null,null,null,null,null,null,null,"Maintenance charges",null,null,"R/month"]
[null,null,null,null,null,null,null,null,null,null,"","VAT incl"]
["Public Lighting - Maintenance charge - per lumanaire","Plu",0,1,{"$f":"B13&C13&D13&IF($A$2=\"Non-municipal\",\"N\",IF($A$2=\"Municipal\",\"Y\",\"error\"))","v":"Plu01Y"},null,null,null,null,"Per lumanaire",54.110516254058879,{"$f":"ROUND(K13 * (1 + VAT), 2)","v":62.23}]
["Public Lighting - Maintenance charge - per high-mast lumanaire","Plhm",0,1,{"$f":"B14&C14&D14&IF($A$2=\"Non-municipal\",\"N\",IF($A$2=\"Municipal\",\"Y\",\"error\"))","v":"Plhm01Y"},null,null,null,null,"Per high-mast lumanaire",1263.71,{"$f":"ROUND(K14 * (1 + VAT), 2)","v":1453.27}]

{"sheet":"Homepower NLA","index":16,"n_rows":15,"n_cols":15,"rows_kept":15,"cut":false,"hidden":false,"merged":[[1,6,1,15],[11,9,11,10],[11,11,11,12],[13,7,13,8],[4,13,4,14],[6,7,6,8],[7,7,7,8],[8,7,8,8],[9,7,9,8],[4,9,4,12]]}
[null,null,null,null,null,null,null,"Back to menu"]
["Non-municipal",null,null,null,null,null,"Homepower - Non-local Authority"]
[]
[]
[null,null,null,null,null,null,null,null,null,"Energy charge\n[c/kWh]",null,null,null,"Network capacity charge \n[R/POD/day]"]
["Tariff","Tariff nameBillcode","Tx zone","Voltage","Billcode",null,null,null,null,"Block 1   \n[>0 - 600 kWh]","VAT incl","Block 2   \n[>600 kWh]","VAT incl",null,"VAT incl"]
["Homepower 1","H1",0,1,{"$f":"B7&C7&D7&IF($A$2=\"Non-municipal\",\"N\",IF($A$2=\"Municiple\",\"Y\",\"error\"))","v":"H101N"},null,null,"Homepower 1",null,145.55000000000001,{"$f":"ROUND(J7 * (1 + VAT), 2)","v":167.38},229.83,{"$f":"ROUND(L7 * (1 + VAT), 2)","v":264.3},6.23,{"$f":"ROUND(N7 * (1 + VAT), 2)","v":7.16}]
["Homepower 2","H2",0,1,{"$f":"B8&C8&D8&IF($A$2=\"Non-municipal\",\"N\",IF($A$2=\"Municiple\",\"Y\",\"error\"))","v":"H201N"},null,null,"Homepower 2",null,145.55000000000001,{"$f":"ROUND(J8 * (1 + VAT), 2)","v":167.38},224.09,{"$f":"ROUND(L8 * (1 + VAT), 2)","v":257.7},11.68,{"$f":"ROUND(N8 * (1 + VAT), 2)","v":13.43}]
["Homepower 3","H3",0,1,{"$f":"B9&C9&D9&IF($A$2=\"Non-municipal\",\"N\",IF($A$2=\"Municiple\",\"Y\",\"error\"))","v":"H301N"},null,null,"Homepower 3",null,145.55000000000001,{"$f":"ROUND(J9 * (1 + VAT), 2)","v":167.38},224.09,{"$f":"ROUND(L9 * (1 + VAT), 2)","v":257.7},24.12,{"$f":"ROUND(N9 * (1 + VAT), 2)","v":27.74}]
["Homepower 4","H4",0,1,{"$f":"B10&C10&D10&IF($A$2=\"Non-municipal\",\"N\",IF($A$2=\"Municiple\",\"Y\",\"error\"))","v":"H401N"},null,null,"Homepower 4",null,145.55000000000001,{"$f":"ROUND(J10 * (1 + VAT), 2)","v":167.38},234.06,{"$f":"ROUND(L10 * (1 + VAT), 2)","v":269.17},3.81,{"$f":"ROUND(N10 * (1 + VAT), 2)","v":4.38}]
[]
[null,null,null,null,null,null,null,null,null,"Energy charge  \n[c/kWh]",null,"Network capacity charge [R/kVA]"]
[null,null,null,null,null,null,null,null,null,null,"VAT incl",null,"VAT incl"]
["Homepower Bulk < 500V","HB",0,1,{"$f":"B14&C14&D14&IF($A$2=\"Non-municipal\",\"N\",IF($A$2=\"Municiple\",\"Y\",\"error\"))","v":"HB01N"},null,null,"Homepower Bulk  \n",null,191.1,{"$f":"ROUND(J14 * (1 + VAT), 2)","v":219.77},39.549999999999997,{"$f":"ROUND(L14 * (1 + VAT), 2)","v":45.48}]
[null,null,null,null,null,null,null,"* The Network capacity charge is based on the NMD or on the maximum demand if measured."]

{"sheet":"Homepower Munic","index":17,"n_rows":9,"n_cols":15,"rows_kept":9,"cut":false,"hidden":false,"merged":[[1,6,1,15],[7,7,7,8],[8,7,8,8],[3,9,3,10],[3,11,3,12],[3,13,3,14],[5,7,5,8],[6,7,6,8]]}
[null,null,null,null,null,null,null,"Back to menu"]
["Municiple",null,null,null,null,null,"Homepower - Local Authority"]
[]
[null,null,null,null,null,null,null,null,null,"Energy charge\n[c/kWh]",null,"Energy charge\n[c/kWh]",null,"Network capacity charge [R/POD/day]"]
["Tariff","Tariff nameBillcode","Tx zone","Voltage","Billcode",null,null,null,null,"Block 1   \n[>0 - 600 kWh]","VAT incl","Block 2   \n[>600 kWh]","VAT incl",null,"VAT incl"]
["Homepower 1","H1",0,1,{"$f":"B6&C6&D6&IF($A$2=\"Non-municipal\",\"N\",IF($A$2=\"Municiple\",\"Y\",\"error\"))","v":"H101Y"},null,null,"Homepower 1",null,145.43,{"$f":"ROUND(J6 * (1 + VAT), 2)","v":167.24},229.63,{"$f":"ROUND(L6 * (1 + VAT), 2)","v":264.07},6.22,{"$f":"ROUND(N6 * (1 + VAT), 2)","v":7.15}]
["Homepower 2","H2",0,1,{"$f":"B7&C7&D7&IF($A$2=\"Non-municipal\",\"N\",IF($A$2=\"Municiple\",\"Y\",\"error\"))","v":"H201Y"},null,null,"Homepower 2",null,145.43,{"$f":"ROUND(J7 * (1 + VAT), 2)","v":167.24},223.87,{"$f":"ROUND(L7 * (1 + VAT), 2)","v":257.45},11.67,{"$f":"ROUND(N7 * (1 + VAT), 2)","v":13.42}]
["Homepower 3","H3",0,1,{"$f":"B8&C8&D8&IF($A$2=\"Non-municipal\",\"N\",IF($A$2=\"Municiple\",\"Y\",\"error\"))","v":"H301Y"},null,null,"Homepower 3",null,145.43,{"$f":"ROUND(J8 * (1 + VAT), 2)","v":167.24},223.87,{"$f":"ROUND(L8 * (1 + VAT), 2)","v":257.45},24.11,{"$f":"ROUND(N8 * (1 + VAT), 2)","v":27.73}]
["Homepower 4","H4",0,1,{"$f":"B9&C9&D9&IF($A$2=\"Non-municipal\",\"N\",IF($A$2=\"Municiple\",\"Y\",\"error\"))","v":"H401Y"},null,null,"Homepower 4",null,145.43,{"$f":"ROUND(J9 * (1 + VAT), 2)","v":167.24},233.85,{"$f":"ROUND(L9 * (1 + VAT), 2)","v":268.93},3.81,{"$f":"ROUND(N9 * (1 + VAT), 2)","v":4.38}]

{"sheet":"Homelight NLA","index":18,"n_rows":13,"n_cols":11,"rows_kept":13,"cut":false,"hidden":false,"merged":[[1,6,1,12],[11,7,11,8],[12,7,12,8],[3,7,4,8],[3,9,3,10],[5,7,5,8],[6,7,6,8],[9,7,10,8],[9,9,9,10]]}
[null,null,null,null,null,null,null,"Back to menu"]
["Non-municipal",null,null,null,null,null,"Homelight - Non-local Authority"]
[]
[null,null,null,null,null,null,null,"Homelight 60A",null,"Energy charge [c/kWh]"]
["Tariff","Tariff nameBillcode","Tx zone","Voltage","Billcode",null,null,null,null,null,"VAT incl"]
["Homelight 1 60A","HL16",0,1,{"$f":"B6&C6&D6&IF($A$2=\"Non-municipal\",\"N\",IF($A$2=\"Municiple\",\"Y\",\"error\"))","v":"HL1601N"},null,null,"Block 1   [> 0 - 600 kWh]",null,137.69999999999999,{"$f":"ROUND(J6 * (1 + VAT), 2)","v":158.36000000000001}]
["Homelight 2 60A","HL26",0,1,{"$f":"B7&C7&D7&IF($A$2=\"Non-municipal\",\"N\",IF($A$2=\"Municiple\",\"Y\",\"error\"))","v":"HL2601N"},null,null,"Block 2   [>600 kWh]",null,234.06,{"$f":"ROUND(J7 * (1 + VAT), 2)","v":269.17}]
[]
[]
[null,null,null,null,null,null,null,"Homelight 20A",null,"Energy charge [c/kWh]"]
[null,null,null,null,null,null,null,null,null,null,"VAT incl"]
["Homelight 1 20A","HL12",0,1,{"$f":"B12&C12&D12&IF($A$2=\"Non-municipal\",\"N\",IF($A$2=\"Municiple\",\"Y\",\"error\"))","v":"HL1201N"},null,null,"Block 1   [> 0 - 350 kWh]",null,121.67,{"$f":"ROUND(J12 * (1 + VAT), 2)","v":139.91999999999999}]
["Homelight 2 20A","HL22",0,1,{"$f":"B13&C13&D13&IF($A$2=\"Non-municipal\",\"N\",IF($A$2=\"Municiple\",\"Y\",\"error\"))","v":"HL2201N"},null,null,"Block 2   [>350 kWh]",null,137.86000000000001,{"$f":"ROUND(J13 * (1 + VAT), 2)","v":158.54}]

{"sheet":"Nightsave Rural NLA","index":19,"n_rows":34,"n_cols":33,"rows_kept":34,"cut":false,"hidden":false,"merged":[[1,6,1,19],[3,9,3,12],[3,13,3,16],[3,17,5,18],[4,7,6,7],[4,9,5,10],[4,11,5,12],[4,13,5,14],[4,15,5,16],[29,15,29,16],[29,17,29,18],[30,7,30,8],[7,7,10,7],[11,7,14,7],[15,7,18,7],[19,7,22,7],[25,7,26,8],[25,9,26,10],[25,11,26,12],[31,7,31,8],[32,7,32,8],[27,7,27,8],[28,7,28,8],[29,7,29,8]]}
[null,null,null,null,null,null,"Back to menu",null,null,null,null,null,null,null,null,null,null,null,{"$error":"#REF!"}]
["Non-municipal",null,null,null,null,null,"Nightsave Rural - Non-local Authority",null,null,null,null,null,null,null,null,null,null,null,null,null,null,null,null,null,null,null,null,null,null,null,null,{"$f":"SUM(#REF!,#REF!,#REF!,#REF!,#REF!,#REF!,#REF!,#REF!,#REF!,#REF!,#REF!,#REF!,#REF!,#REF!,#REF!)","v":{"$error":"#REF!"}},"check value"]
[]
[null,null,null,null,null,null,null,null,null,"Active energy charge [c/kWh]",null,null,null,"Energy demand charges [R/kVA/m]",null,null,null,"Network capacity charges [R/kVA/m]"]
[null,null,null,null,null,null,null,"Transmission zone",null,"High demand season \n[Jun - Aug]",null,"Low demand season \n[Sep - May]",null,"High demand season \n[Jun - Aug]",null,"Low demand season \n[Sep - May]"]
[null,null,null,null,null,null,null,null,"Voltage"]
["Tariff","Tariff nameBillcode","Tx zone","Voltage","Billcode",null,null,null,null,"","VAT incl",null,"VAT incl","","VAT incl",null,"VAT incl",null,"VAT incl"]
["Nightsave Rural","NR",0,1,{"$f":"B8&C8&D8&IF($A$2=\"Non-municipal\",\"N\",IF($A$2=\"Municiple\",\"Y\",\"error\"))","v":"NR01N"},null,null,"≤ 300km","< 500V",91.61,{"$f":"ROUND(J8 * (1 + VAT), 2)","v":105.35},71.180000000000007,{"$f":"ROUND(L8 * (1 + VAT), 2)","v":81.86},306.95,{"$f":"ROUND(N8 * (1 + VAT), 2)","v":352.99},162.44999999999999,{"$f":"ROUND(P8 * (1 + VAT), 2)","v":186.82},15.52,{"$f":"ROUND(R8 * (1 + VAT), 2)","v":17.850000000000001}]
["Nightsave Rural","NR",0,2,{"$f":"B9&C9&D9&IF($A$2=\"Non-municipal\",\"N\",IF($A$2=\"Municiple\",\"Y\",\"error\"))","v":"NR02N"},null,null,null,"≥ 500V & ≤ 22kV",90.53,104.11,70.38,80.94,297.44,342.06,156.69,180.19,14.26,16.399999999999999]
["Nightsave Rural","NR",null,null,"NRN",null,null,null,null,0,null,0,null,0,0,0,0,0]
["Nightsave Rural","NR",null,null,"NRN",null,null,null,null,0,null,0,null,0,0,0,0,0]
["Nightsave Rural","NR",1,1,"NR11N",null,null,"> 300km and \n≤ 600km","< 500V",92.51,106.39,71.900000000000006,82.69,310.64999999999998,357.25,164.72,189.43,15.55,17.88]
["Nightsave Rural","NR",1,2,"NR12N",null,null,null,"≥ 500V & ≤ 22kV",91.46,105.18,71.09,81.75,301.07,346.23,158.87,182.7,14.31,16.46]
["Nightsave Rural","NR",null,null,"NRN",null,null,null,null,0,null,0,null,0,0,0,0,0]
["Nightsave Rural","NR",null,null,"NRN",null,null,null,null,0,null,0,null,0,0,0,0,0]
["Nightsave Rural","NR",2,1,"NR21N",null,null,"> 600km and \n≤ 900km","< 500V",93.44,107.46,72.599999999999994,83.49,314.38,361.54,166.94,191.98,15.7,18.059999999999999]
["Nightsave Rural","NR",2,2,"NR22N",null,null,null,"≥ 500V & ≤ 22kV",92.36,106.21,71.8,82.57,304.68,350.38,161.06,185.22,14.41,16.57]
["Nightsave Rural","NR",null,null,"NRN",null,null,null,null,0,null,0,null,0,0,0,0,0]
["Nightsave Rural","NR",null,null,"NRN",null,null,null,null,0,null,0,null,0,0,0,0,0]
["Nightsave Rural","NR",3,1,"NR31N",null,null,"> 900km","< 500V",94.37,108.53,73.33,84.33,318.2,{"$f":"ROUND(N20 * (1 + VAT), 2)","v":365.93},169.23,{"$f":"ROUND(P20 * (1 + VAT), 2)","v":194.61},15.74,18.100000000000001]
["Nightsave Rural","NR",3,2,"NR32N",null,null,null,"≥ 500V & ≤ 22kV",93.25,107.24,72.5,83.38,308.39999999999998,354.66,163.31,187.81,14.44,16.61]
[]
[]
[]
[]
[null,null,null,null,null,null,null,"Customer categories",null,"Service charge  \n[R/account/day]",null,"Administration charge  [R/POD/day]"]
[]
["Tariff","Tariff nameBillcode","Tx zone","Voltage","Billcode",null,null,null,null,null,"VAT incl",null,"VAT incl"]
["Nightsave Rural","NR",0,1,{"$f":"B29&C29&D29&IF($A$2=\"Non-municipal\",\"N\",IF($A$2=\"Municiple\",\"Y\",\"error\"))","v":"NR01N"},null,null,"≤ 100 kVA",null,21.34,{"$f":"ROUND(J29 * (1 + VAT), 2)","v":24.54},6.06,{"$f":"ROUND(L29 * (1 + VAT), 2)","v":6.97}]
["Nightsave Rural","NR",0,1,"NR01N",null,null,"> 100 kVA & ≤ 500 kVA",null,72.760000000000005,{"$f":"ROUND(J30 * (1 + VAT), 2)","v":83.67},33.74,{"$f":"ROUND(L30 * (1 + VAT), 2)","v":38.799999999999997},null,null,"Ancillary service charge [c/kWh]",null,"Network demand charge [c/kWh]  in all time-of-use periods"]
["Nightsave Rural","NR",0,1,"NR01N",null,null,"> 500 kVA & ≤ 1 MVA",null,223.85,{"$f":"ROUND(J31 * (1 + VAT), 2)","v":257.43},51.78,{"$f":"ROUND(L31 * (1 + VAT), 2)","v":59.55},null,"Voltage",null,"VAT incl",null,"VAT incl"]
["Nightsave Rural","NR",0,1,"NR01N",null,null,"> 1 MVA",null,223.85,{"$f":"ROUND(J32 * (1 + VAT), 2)","v":257.43},96.08,{"$f":"ROUND(L32 * (1 + VAT), 2)","v":110.49},null,"< 500V",0.48,{"$f":"ROUND(P32 * (1 + VAT), 2)","v":0.55000000000000004},30.88,{"$f":"ROUND(R32 * (1 + VAT), 2)","v":35.51}]
["Nightsave Rural","NR",0,1,"NR01N",null,null,"Key customers",null,4387.25,{"$f":"ROUND(J33 * (1 + VAT), 2)","v":5045.34},96.08,{"$f":"ROUND(L33 * (1 + VAT), 2)","v":110.49},null,"≥ 500V & ≤ 22kV",0.48,{"$f":"ROUND(P33 * (1 + VAT), 2)","v":0.55000000000000004},27.07,{"$f":"ROUND(R33 * (1 + VAT), 2)","v":31.13}]
["Nightsave Rural","NR",0,2,"NR02N"]

{"sheet":"Nightsave Rural Munic ","index":20,"n_rows":33,"n_cols":33,"rows_kept":33,"cut":false,"hidden":false,"merged":[[1,6,1,19],[3,9,3,12],[3,13,3,16],[3,17,5,18],[4,7,6,7],[4,9,5,10],[4,11,5,12],[4,13,5,14],[4,15,5,16],[29,15,29,16],[29,17,29,18],[30,7,30,8],[7,7,10,7],[11,7,14,7],[15,7,18,7],[19,7,22,7],[25,7,26,8],[25,9,26,10],[25,11,26,12],[31,7,31,8],[32,7,32,8],[27,7,27,8],[28,7,28,8],[29,7,29,8]]}
[null,null,null,null,null,null,"Back to menu",null,null,null,null,null,null,null,null,null,null,null,{"$error":"#REF!"}]
["Municiple",null,null,null,null,null,"Nightsave Rural - Local Authority",null,null,null,null,null,null,null,null,null,null,null,null,null,null,null,null,null,null,null,null,null,null,null,null,{"$f":"SUM(#REF!,#REF!,#REF!,#REF!,#REF!,#REF!,#REF!,#REF!,#REF!,#REF!,#REF!,#REF!,#REF!,#REF!,#REF!)","v":{"$error":"#REF!"}},"check value"]
[]
[null,null,null,null,null,null,null,null,null,"Active energy charge [c/kWh]",null,null,null,"Energy demand charges [R/kVA/m]",null,null,null,"Network capacity charges [R/kVA/m]"]
[null,null,null,null,null,null,null,"Transmission zone",null,"High demand season \n[Jun - Aug]",null,"Low demand season \n[Sep - May]",null,"High demand season \n[Jun - Aug]",null,"Low demand season \n[Sep - May]"]
[null,null,null,null,null,null,null,null,"Voltage"]
["Tariff","Tariff nameBillcode","Tx zone","Voltage","Billcode",null,null,null,null,"","VAT incl",null,"VAT incl","","VAT incl",null,"VAT incl",null,"VAT incl"]
["Nightsave Rural","NR",0,1,{"$f":"B8&C8&D8&IF($A$2=\"Non-municipal\",\"N\",IF($A$2=\"Municiple\",\"Y\",\"error\"))","v":"NR01Y"},null,null,"≤ 300km","< 500V",93.71,{"$f":"ROUND(J8 * (1 + VAT), 2)","v":107.77},72.819999999999993,{"$f":"ROUND(L8 * (1 + VAT), 2)","v":83.74},306.66000000000003,{"$f":"ROUND(N8 * (1 + VAT), 2)","v":352.66},162.32,{"$f":"ROUND(P8 * (1 + VAT), 2)","v":186.67},15.66,{"$f":"ROUND(R8 * (1 + VAT), 2)","v":18.010000000000002}]
["Nightsave Rural","NR",0,2,{"$f":"B9&C9&D9&IF($A$2=\"Non-municipal\",\"N\",IF($A$2=\"Municiple\",\"Y\",\"error\"))","v":"NR02Y"},null,null,null,"≥ 500V & ≤ 22kV",92.61,106.5,72,82.8,297.17,341.75,156.52000000000001,180,14.38,16.54]
["Nightsave Rural","NR",null,null,"NRY",null,null,null,null,0,null,0,null,0,0,0,0,0]
["Nightsave Rural","NR",null,null,"NRY",null,null,null,null,0,null,0,null,0,0,0,0,0]
["Nightsave Rural","NR",1,1,"NR11Y",null,null,"> 300km and \n≤ 600km","< 500V",94.65,108.85,73.56,84.59,310.39,356.95,164.56,189.24,15.69,18.04]
["Nightsave Rural","NR",1,2,"NR12Y",null,null,null,"≥ 500V & ≤ 22kV",93.53,107.56,72.709999999999994,83.62,300.81,345.93,158.71,182.52,14.44,16.61]
["Nightsave Rural","NR",null,null,"NRY",null,null,null,null,0,null,0,null,0,0,0,0,0]
["Nightsave Rural","NR",null,null,"NRY",null,null,null,null,0,null,0,null,0,0,0,0,0]
["Nightsave Rural","NR",2,1,"NR21Y",null,null,"> 600km and \n≤ 900km","< 500V",95.56,109.89,74.260000000000005,85.4,314.10000000000002,361.22,166.77,191.79,15.84,18.22]
["Nightsave Rural","NR",2,2,"NR22Y",null,null,null,"≥ 500V & ≤ 22kV",94.45,108.62,73.44,84.46,304.42,350.08,160.91999999999999,185.06,14.53,16.71]
["Nightsave Rural","NR",null,null,"NRY",null,null,null,null,0,null,0,null,0,0,0,0,0]
["Nightsave Rural","NR",null,null,"NRY",null,null,null,null,0,null,0,null,0,0,0,0,0]
["Nightsave Rural","NR",3,1,"NR31Y",null,null,"> 900km","< 500V",96.53,111.01,74.989999999999995,86.24,317.91000000000003,365.6,169.07,194.43,15.87,18.25]
["Nightsave Rural","NR",3,2,"NR32Y",null,null,null,"≥ 500V & ≤ 22kV",95.38,109.69,74.14,85.26,308.13,354.35,163.16,187.63,14.54,16.72]
[]
[]
[]
[]
[null,null,null,null,null,null,null,"Customer categories",null,"Service charge  \n[R/account/day]",null,"Administration charge  [R/POD/day]"]
[]
["Tariff","Tariff nameBillcode","Tx zone","Voltage","Billcode",null,null,null,null,null,"VAT incl",null,"VAT incl"]
["Nightsave Rural","NR",0,1,{"$f":"B29&C29&D29&IF($A$2=\"Non-municipal\",\"N\",IF($A$2=\"Municiple\",\"Y\",\"error\"))","v":"NR01Y"},null,null,"≤ 100 kVA",null,21.22,{"$f":"ROUND(J29 * (1 + VAT), 2)","v":24.4},6.02,{"$f":"ROUND(L29 * (1 + VAT), 2)","v":6.92}]
["Nightsave Rural","NR",0,1,{"$f":"B30&C30&D30&IF($A$2=\"Non-municipal\",\"N\",IF($A$2=\"Municiple\",\"Y\",\"error\"))","v":"NR01Y"},null,null,"> 100 kVA & ≤ 500 kVA",null,72.37,{"$f":"ROUND(J30 * (1 + VAT), 2)","v":83.23},33.549999999999997,{"$f":"ROUND(L30 * (1 + VAT), 2)","v":38.58},null,null,"Ancillary service charge [c/kWh]",null,"Network demand charge [c/kWh]  in all time-of-use periods"]
["Nightsave Rural","NR",0,1,{"$f":"B31&C31&D31&IF($A$2=\"Non-municipal\",\"N\",IF($A$2=\"Municiple\",\"Y\",\"error\"))","v":"NR01Y"},null,null,"> 500 kVA & ≤ 1 MVA",null,222.64,{"$f":"ROUND(J31 * (1 + VAT), 2)","v":256.04000000000002},51.48,{"$f":"ROUND(L31 * (1 + VAT), 2)","v":59.2},null,"Voltage",null,"VAT incl",null,"VAT incl"]
["Nightsave Rural","NR",0,1,{"$f":"B32&C32&D32&IF($A$2=\"Non-municipal\",\"N\",IF($A$2=\"Municiple\",\"Y\",\"error\"))","v":"NR01Y"},null,null,"> 1 MVA",null,222.64,{"$f":"ROUND(J32 * (1 + VAT), 2)","v":256.04000000000002},95.55,{"$f":"ROUND(L32 * (1 + VAT), 2)","v":109.88},null,"< 500V",0.48,{"$f":"ROUND(P32 * (1 + VAT), 2)","v":0.55000000000000004},31.16,{"$f":"ROUND(R32 * (1 + VAT), 2)","v":35.83}]
["Nightsave Rural","NR",0,1,{"$f":"B33&C33&D33&IF($A$2=\"Non-municipal\",\"N\",IF($A$2=\"Municiple\",\"Y\",\"error\"))","v":"NR01Y"},null,null,"Key customers",null,4363.1099999999997,{"$f":"ROUND(J33 * (1 + VAT), 2)","v":5017.58},95.55,{"$f":"ROUND(L33 * (1 + VAT), 2)","v":109.88},null,"≥ 500V & ≤ 22kV",0.48,{"$f":"ROUND(P33 * (1 + VAT), 2)","v":0.55000000000000004},27.27,{"$f":"ROUND(R33 * (1 + VAT), 2)","v":31.36}]

{"sheet":"Ruraflex NLA","index":21,"n_rows":34,"n_cols":33,"rows_kept":34,"cut":false,"hidden":false,"merged":[[1,6,1,23],[3,21,5,22],[7,7,10,7],[3,9,3,20],[4,7,6,7],[4,9,4,14],[4,15,4,20],[5,9,5,10],[5,11,5,12],[5,13,5,14],[5,15,5,16],[5,17,5,18],[5,19,5,20],[28,7,28,8],[28,14,28,15],[11,7,14,7],[15,7,18,7],[19,7,22,7],[25,7,26,8],[25,9,26,10],[25,11,26,12],[25,16,25,17],[25,18,25,19],[26,14,26,15],[27,7,27,8],[27,14,27,15],[32,7,32,8],[29,7,29,8],[30,7,30,8],[30,14,30,17],[31,7,31,8],[31,14,31,15],[31,16,31,17]]}
[null,null,null,null,null,null,"Back to menu"]
["Non-municipal",null,null,null,null,null,"Ruraflex - Non-local Authority",null,null,null,null,null,null,null,null,null,null,null,null,null,null,null,null,null,null,null,null,null,null,null,null,{"$f":"SUM(#REF!,#REF!,#REF!,#REF!,#REF!,#REF!,#REF!,#REF!,#REF!,#REF!,#REF!,#REF!)","v":{"$error":"#REF!"}},"check value"]
[]
[null,null,null,null,null,null,null,null,null,"Active energy charge [c/kWh]",null,null,null,null,null,null,null,null,null,null,null,"Network capacity charges [R/kVA/m]"]
[null,null,null,null,null,null,null,"Transmission zone",null,"High demand season [Jun - Aug]",null,null,null,null,null,"Low demand season [Sep - May]"]
[null,null,null,null,null,null,null,null,"Voltage","Peak",null,"Standard",null,"Off Peak",null,"Peak",null,"Standard",null,"Off Peak"]
["Tariff","Tariff nameBillcode","Tx zone","Voltage","Billcode",null,null,null,null,"","VAT incl",null,"VAT incl",null,"VAT incl",null,"VAT incl",null,"VAT incl",null,"VAT incl",null,"VAT incl"]
["Ruraflex","Ru",0,1,{"$f":"B8&C8&D8&IF($A$2=\"Non-municipal\",\"N\",IF($A$2=\"Municiple\",\"Y\",\"error\"))","v":"Ru01N"},null,null,"≤ 300km","< 500V",375.58,{"$f":"ROUND(J8 * (1 + VAT), 2)","v":431.92},113.78,{"$f":"ROUND(L8 * (1 + VAT), 2)","v":130.85},61.8,{"$f":"ROUND(N8 * (1 + VAT), 2)","v":71.069999999999993},122.52,{"$f":"ROUND(P8 * (1 + VAT), 2)","v":140.9},84.31,{"$f":"ROUND(R8 * (1 + VAT), 2)","v":96.96},53.49,{"$f":"ROUND(T8 * (1 + VAT), 2)","v":61.51},21.69,{"$f":"ROUND(V8 * (1 + VAT), 2)","v":24.94}]
["Ruraflex","Ru",0,2,{"$f":"B9&C9&D9&IF($A$2=\"Non-municipal\",\"N\",IF($A$2=\"Municiple\",\"Y\",\"error\"))","v":"Ru02N"},null,null,null,"≥ 500V & ≤ 22kV",371.87,427.65,112.66,129.56,61.17,70.349999999999994,121.32,139.52000000000001,83.48,96,52.94,60.88,19.88,22.86]
["Ruraflex","Ru",null,null,"RuN",null,null,null,null,0,null,0,null,0,null,0,null,0,null,0,null,0]
["Ruraflex","Ru",null,null,"RuN",null,null,null,null,0,null,0,null,0,null,0,null,0,null,0,null,0]
["Ruraflex","Ru",1,1,"Ru11N",null,null,"> 300km and \n≤ 600km","< 500V",379.35,436.25,114.92,132.16,62.41,71.77,123.74,142.30000000000001,85.17,97.95,54.04,62.15,21.75,25.01]
["Ruraflex","Ru",1,2,"Ru12N",null,null,null,"≥ 500V & ≤ 22kV",375.57,431.91,113.77,130.84,61.8,71.069999999999993,122.52,140.9,84.3,96.95,53.49,61.51,20,23]
["Ruraflex","Ru",null,null,"RuN",null,null,null,null,0,null,0,null,0,null,0,null,0,null,0,null,0]
["Ruraflex","Ru",null,null,"RuN",null,null,null,null,0,null,0,null,0,null,0,null,0,null,0,null,0]
["Ruraflex","Ru",2,1,"Ru21N",null,null,"> 600km and \n≤ 900km","< 500V",383.15,440.62,116.08,133.49,63.03,72.48,124.99,143.74,86.01,98.91,54.58,62.77,21.87,25.15]
["Ruraflex","Ru",2,2,"Ru22N",null,null,null,"≥ 500V & ≤ 22kV",379.33,436.23,114.9,132.13999999999999,62.41,71.77,123.74,142.30000000000001,85.17,97.95,54.04,62.15,20.09,23.1]
["Ruraflex","Ru",null,null,"RuN",null,null,null,null,0,null,0,null,0,null,0,null,0,null,0,null,0]
["Ruraflex","Ru",null,null,"RuN",null,null,null,null,0,null,0,null,0,null,0,null,0,null,0,null,0]
["Ruraflex","Ru",3,1,"Ru31N",null,null,"> 900km","< 500V",386.97,445.02,117.23,134.81,63.65,73.2,126.19,145.12,86.87,99.9,55.12,63.39,21.96,25.25]
["Ruraflex","Ru",3,2,"Ru32N",null,null,null,"≥ 500V & ≤ 22kV",383.14,440.61,116.08,133.49,63.03,72.48,124.99,143.74,86.01,98.91,54.58,62.77,20.100000000000001,23.12]
[null,null,null,null,null,null,null,null,null,null,null,null,null,0]
[null,null,null,null,null,null,null,null,null,null,null,null,null,0]
[]
[]
[null,null,null,null,null,null,null,"Customer categories",null,"Service charge  [R/account/day]",null,"Administration charge  [R/POD/day]",null,null,null,null,"Ancillary service charge [c/kWh]",null,"Network demand charge [c/kWh]  in all time-of-use periods"]
[null,null,null,null,null,null,null,null,null,null,null,null,null,null,"Voltage",null,null,"VAT incl",null,"VAT incl"]
["Tariff","Tariff nameBillcode","Tx zone","Voltage","Billcode",null,null,null,null,null,"VAT incl",null,"VAT incl",null,"< 500V",null,0.48,{"$f":"ROUND(Q28 * (1 + VAT), 2)","v":0.55000000000000004},30.88,{"$f":"ROUND(S28 * (1 + VAT), 2)","v":35.51}]
["Ruraflex","Ru",0,1,{"$f":"B29&C29&D29&IF($A$2=\"Non-municipal\",\"N\",IF($A$2=\"Municiple\",\"Y\",\"error\"))","v":"Ru01N"},null,null,"≤ 100 kVA",null,21.34,{"$f":"ROUND(J29 * (1 + VAT), 2)","v":24.54},6.06,{"$f":"ROUND(L29 * (1 + VAT), 2)","v":6.97},null,"≥ 500V & < 22kV",null,0.48,{"$f":"ROUND(Q29 * (1 + VAT), 2)","v":0.55000000000000004},27.07,{"$f":"ROUND(S29 * (1 + VAT), 2)","v":31.13}]
["Ruraflex","Ru",0,1,{"$f":"B30&C30&D30&IF($A$2=\"Non-municipal\",\"N\",IF($A$2=\"Municiple\",\"Y\",\"error\"))","v":"Ru01N"},null,null,"> 100 kVA & ≤ 500 kVA",null,72.760000000000005,{"$f":"ROUND(J30 * (1 + VAT), 2)","v":83.67},33.74,{"$f":"ROUND(L30 * (1 + VAT), 2)","v":38.799999999999997}]
["Ruraflex","Ru",0,1,{"$f":"B31&C31&D31&IF($A$2=\"Non-municipal\",\"N\",IF($A$2=\"Municiple\",\"Y\",\"error\"))","v":"Ru01N"},null,null,"> 500 kVA & ≤ 1 MVA",null,223.85,{"$f":"ROUND(J31 * (1 + VAT), 2)","v":257.43},51.78,{"$f":"ROUND(L31 * (1 + VAT), 2)","v":59.55},null,"Reactive energy charge  [c/kVArh]"]
["Ruraflex","Ru",0,1,{"$f":"B32&C32&D32&IF($A$2=\"Non-municipal\",\"N\",IF($A$2=\"Municiple\",\"Y\",\"error\"))","v":"Ru01N"},null,null,"> 1 MVA",null,223.85,{"$f":"ROUND(J32 * (1 + VAT), 2)","v":257.43},96.08,{"$f":"ROUND(L32 * (1 + VAT), 2)","v":110.49},null,"High season",null,"Low season"]
["Ruraflex","Ru",0,1,{"$f":"B33&C33&D33&IF($A$2=\"Non-municipal\",\"N\",IF($A$2=\"Municiple\",\"Y\",\"error\"))","v":"Ru01N"},null,null,"Key customers",null,4387.25,{"$f":"ROUND(J33 * (1 + VAT), 2)","v":5045.34},96.08,{"$f":"ROUND(L33 * (1 + VAT), 2)","v":110.49},null,null,"VAT incl",null,"VAT incl"]
[null,null,null,null,null,null,null,null,null,null,null,null,null,null,10.43,{"$f":"ROUND(O34 * (1 + VAT), 2)","v":11.99},0,{"$f":"ROUND(Q34 * (1 + VAT), 2)","v":0}]

{"sheet":"Ruraflex Munic ","index":22,"n_rows":34,"n_cols":33,"rows_kept":34,"cut":false,"hidden":false,"merged":[[1,6,1,23],[3,21,5,22],[7,7,10,7],[3,9,3,20],[4,7,6,7],[4,9,4,14],[4,15,4,20],[5,9,5,10],[5,11,5,12],[5,13,5,14],[5,15,5,16],[5,17,5,18],[5,19,5,20],[28,7,28,8],[28,14,28,15],[11,7,14,7],[15,7,18,7],[19,7,22,7],[25,7,26,8],[25,9,26,10],[25,11,26,12],[25,16,25,17],[25,18,25,19],[26,14,26,15],[27,7,27,8],[27,14,27,15],[32,7,32,8],[29,7,29,8],[30,7,30,8],[30,14,30,17],[31,7,31,8],[31,14,31,15],[31,16,31,17]]}
[null,null,null,null,null,null,"Back to menu"]
["Municiple",null,null,null,null,null,"Ruraflex - Local Authority",null,null,null,null,null,null,null,null,null,null,null,null,null,null,null,null,null,null,null,null,null,null,null,null,{"$f":"SUM(#REF!,#REF!,#REF!,#REF!,#REF!,#REF!,#REF!,#REF!,#REF!,#REF!,#REF!,#REF!)","v":{"$error":"#REF!"}},"check value"]
[]
[null,null,null,null,null,null,null,null,null,"Active energy charge [c/kWh]",null,null,null,null,null,null,null,null,null,null,null,"Network capacity charges [R/kVA/m]"]
[null,null,null,null,null,null,null,"Transmission zone",null,"High demand season [Jun - Aug]",null,null,null,null,null,"Low demand season [Sep - May]"]
[null,null,null,null,null,null,null,null,"Voltage","Peak",null,"Standard",null,"Off Peak",null,"Peak",null,"Standard",null,"Off Peak"]
["Tariff","Tariff nameBillcode","Tx zone","Voltage","Billcode",null,null,null,null,"","VAT incl",null,"VAT incl",null,"VAT incl",null,"VAT incl",null,"VAT incl",null,"VAT incl",null,"VAT incl"]
["Ruraflex","Ru",0,1,{"$f":"B8&C8&D8&IF($A$2=\"Non-municipal\",\"N\",IF($A$2=\"Municiple\",\"Y\",\"error\"))","v":"Ru01Y"},null,null,"≤ 300km","< 500V",384.21,{"$f":"ROUND(J8 * (1 + VAT), 2)","v":441.84},116.38,{"$f":"ROUND(L8 * (1 + VAT), 2)","v":133.84},63.21,{"$f":"ROUND(N8 * (1 + VAT), 2)","v":72.69},125.34,{"$f":"ROUND(P8 * (1 + VAT), 2)","v":144.13999999999999},86.26,{"$f":"ROUND(R8 * (1 + VAT), 2)","v":99.2},54.72,{"$f":"ROUND(T8 * (1 + VAT), 2)","v":62.93},21.85,{"$f":"ROUND(V8 * (1 + VAT), 2)","v":25.13}]
["Ruraflex","Ru",0,2,{"$f":"B9&C9&D9&IF($A$2=\"Non-municipal\",\"N\",IF($A$2=\"Municiple\",\"Y\",\"error\"))","v":"Ru02Y"},null,null,null,"≥ 500V & ≤ 22kV",380.39,437.45,115.24,132.53,62.57,71.959999999999994,124.11,142.72999999999999,85.38,98.19,54.17,62.3,20.05,23.06]
["Ruraflex","Ru",null,null,"RuY",null,null,null,null,0,null,0,null,0,null,0,null,0,null,0,null,0]
["Ruraflex","Ru",null,null,"RuY",null,null,null,null,0,null,0,null,0,null,0,null,0,null,0,null,0]
["Ruraflex","Ru",1,1,"Ru11Y",null,null,"> 300km and \n≤ 600km","< 500V",388.03,446.23,117.57,135.21,63.81,73.38,126.56,145.54,87.12,100.19,55.28,63.57,21.94,25.23]
["Ruraflex","Ru",1,2,"Ru12Y",null,null,null,"≥ 500V & ≤ 22kV",384.2,441.83,116.36,133.81,63.21,72.69,125.34,144.13999999999999,86.24,99.18,54.72,62.93,20.16,23.18]
["Ruraflex","Ru",null,null,"RuY",null,null,null,null,0,null,0,null,0,null,0,null,0,null,0,null,0]
["Ruraflex","Ru",null,null,"RuY",null,null,null,null,0,null,0,null,0,null,0,null,0,null,0,null,0]
["Ruraflex","Ru",2,1,"Ru21Y",null,null,"> 600km and \n≤ 900km","< 500V",391.93,450.72,118.71,136.52000000000001,64.47,74.14,127.83,147,87.96,101.15,55.83,64.2,22.06,25.37]
["Ruraflex","Ru",2,2,"Ru22Y",null,null,null,"≥ 500V & ≤ 22kV",388.01,446.21,117.55,135.18,63.81,73.38,126.56,145.54,87.12,100.19,55.28,63.57,20.260000000000002,23.3]
["Ruraflex","Ru",null,null,"RuY",null,null,null,null,0,null,0,null,0,null,0,null,0,null,0,null,0]
["Ruraflex","Ru",null,null,"RuY",null,null,null,null,0,null,0,null,0,null,0,null,0,null,0,null,0]
["Ruraflex","Ru",3,1,"Ru31Y",null,null,"> 900km","< 500V",395.84,455.22,119.94,137.93,65.08,74.84,129.09,148.44999999999999,88.88,102.21,56.38,64.84,22.13,25.45]
["Ruraflex","Ru",3,2,"Ru32Y",null,null,null,"≥ 500V & ≤ 22kV",391.92,450.71,118.71,136.52000000000001,64.47,74.14,127.83,147,87.96,101.15,55.83,64.2,20.27,23.31]
[null,null,null,null,null,null,null,null,null,null,null,null,null,0]
[null,null,null,null,null,null,null,null,null,null,null,null,null,0]
[]
[]
[null,null,null,null,null,null,null,"Customer categories",null,"Service charge  [R/account/day]",null,"Administration charge  [R/POD/day]",null,null,null,null,"Ancillary service charge [c/kWh]",null,"Network demand charge [c/kWh]  in all time-of-use periods"]
[null,null,null,null,null,null,null,null,null,null,null,null,null,null,"Voltage",null,null,"VAT incl",null,"VAT incl"]
["Tariff","Tariff nameBillcode","Tx zone","Voltage","Billcode",null,null,null,null,null,"VAT incl",null,"VAT incl",null,"< 500V",null,0.48,{"$f":"ROUND(Q28 * (1 + VAT), 2)","v":0.55000000000000004},31.16,{"$f":"ROUND(S28 * (1 + VAT), 2)","v":35.83}]
["Ruraflex","Ru",0,1,{"$f":"B29&C29&D29&IF($A$2=\"Non-municipal\",\"N\",IF($A$2=\"Municiple\",\"Y\",\"error\"))","v":"Ru01Y"},null,null,"≤ 100 kVA",null,21.22,{"$f":"ROUND(J29 * (1 + VAT), 2)","v":24.4},6.02,{"$f":"ROUND(L29 * (1 + VAT), 2)","v":6.92},null,"≥ 500V & < 22kV",null,0.48,{"$f":"ROUND(Q29 * (1 + VAT), 2)","v":0.55000000000000004},27.27,{"$f":"ROUND(S29 * (1 + VAT), 2)","v":31.36}]
["Ruraflex","Ru",0,1,{"$f":"B30&C30&D30&IF($A$2=\"Non-municipal\",\"N\",IF($A$2=\"Municiple\",\"Y\",\"error\"))","v":"Ru01Y"},null,null,"> 100 kVA & ≤ 500 kVA",null,72.37,{"$f":"ROUND(J30 * (1 + VAT), 2)","v":83.23},33.549999999999997,{"$f":"ROUND(L30 * (1 + VAT), 2)","v":38.58}]
["Ruraflex","Ru",0,1,{"$f":"B31&C31&D31&IF($A$2=\"Non-municipal\",\"N\",IF($A$2=\"Municiple\",\"Y\",\"error\"))","v":"Ru01Y"},null,null,"> 500 kVA & ≤ 1 MVA",null,222.64,{"$f":"ROUND(J31 * (1 + VAT), 2)","v":256.04000000000002},51.48,{"$f":"ROUND(L31 * (1 + VAT), 2)","v":59.2},null,"Reactive energy charge  [c/kVArh]"]
["Ruraflex","Ru",0,1,{"$f":"B32&C32&D32&IF($A$2=\"Non-municipal\",\"N\",IF($A$2=\"Municiple\",\"Y\",\"error\"))","v":"Ru01Y"},null,null,"> 1 MVA",null,222.64,{"$f":"ROUND(J32 * (1 + VAT), 2)","v":256.04000000000002},95.55,{"$f":"ROUND(L32 * (1 + VAT), 2)","v":109.88},null,"High season",null,"Low season"]
["Ruraflex","Ru",0,1,{"$f":"B33&C33&D33&IF($A$2=\"Non-municipal\",\"N\",IF($A$2=\"Municiple\",\"Y\",\"error\"))","v":"Ru01Y"},null,null,"Key customers",null,4363.1099999999997,{"$f":"ROUND(J33 * (1 + VAT), 2)","v":5017.58},95.55,{"$f":"ROUND(L33 * (1 + VAT), 2)","v":109.88},null,null,"VAT incl",null,"VAT incl"]
[null,null,null,null,null,null,null,null,null,null,null,null,null,null,10.36,{"$f":"ROUND(O34 * (1 + VAT), 2)","v":11.91},0,{"$f":"ROUND(Q34 * (1 + VAT), 2)","v":0}]

{"sheet":"Ruraflex Gen NLA","index":23,"n_rows":36,"n_cols":33,"rows_kept":36,"cut":false,"hidden":false,"merged":[[34,7,34,8],[31,7,31,8],[32,7,32,8],[32,14,32,17],[33,7,33,8],[33,14,33,15],[33,16,33,17],[25,16,26,17],[23,7,23,8],[27,7,27,8],[28,7,28,8],[32,18,32,19],[29,7,29,8],[29,14,29,15],[30,7,30,8],[30,14,30,15],[11,7,14,7],[15,7,18,7],[19,7,22,7],[27,9,28,10],[27,11,28,12],[1,6,1,23],[27,14,28,15],[7,7,10,7],[3,9,3,20],[3,21,3,22],[4,7,6,7],[4,9,4,14],[4,15,4,20],[4,21,5,22],[5,9,5,10],[5,11,5,12],[5,13,5,14],[5,15,5,16],[5,17,5,18],[5,19,5,20],[27,16,27,17]]}
[null,null,null,null,null,null,"Back to menu",null,null,null,null,null,null,null,null,null,null,null,null,null,null,null,{"$error":"#REF!"}]
["Non-municipal",null,null,null,null,null,"Ruraflex Gen - Non-Local Authority",null,null,null,null,null,null,null,null,null,null,null,null,null,null,null,null,null,null,null,null,null,null,null,null,{"$f":"SUM(#REF!,#REF!,#REF!,#REF!,#REF!,#REF!,#REF!,#REF!,#REF!,#REF!,#REF!,#REF!)","v":{"$error":"#REF!"}},"check value"]
[]
[null,null,null,null,null,null,null,null,null,"Active energy charge for loads [c/kWh]",null,null,null,null,null,null,null,null,null,null,null,"Network capacity charges [R/kVA/m]"]
[null,null,null,null,null,null,null,"Transmission zone",null,"High demand season [Jun - Aug]",null,null,null,null,null,"Low demand season [Sep - May]"]
[null,null,null,null,null,null,null,null,"Voltage","Peak",null,"Standard",null,"Off Peak",null,"Peak",null,"Standard",null,"Off Peak"]
["Tariff","Tariff nameBillcode","Tx zone","Voltage","Billcode",null,null,null,null,"","VAT incl",null,"VAT incl",null,"VAT incl",null,"VAT incl",null,"VAT incl",null,"VAT incl",null,"VAT incl"]
["Genflex rural","GR",0,1,{"$f":"B8&C8&D8&IF($A$2=\"Non-municipal\",\"N\",IF($A$2=\"Municiple\",\"Y\",\"error\"))","v":"GR01N"},null,null,"≤ 300km","< 500V",375.58,{"$f":"ROUND(J8 * (1 + VAT), 2)","v":431.92},113.78,{"$f":"ROUND(L8 * (1 + VAT), 2)","v":130.85},61.8,{"$f":"ROUND(N8 * (1 + VAT), 2)","v":71.069999999999993},122.52,{"$f":"ROUND(P8 * (1 + VAT), 2)","v":140.9},84.31,{"$f":"ROUND(R8 * (1 + VAT), 2)","v":96.96},53.49,{"$f":"ROUND(T8 * (1 + VAT), 2)","v":61.51},21.69,{"$f":"ROUND(V8 * (1 + VAT), 2)","v":24.94}]
["Genflex rural","GR",0,2,{"$f":"B9&C9&D9&IF($A$2=\"Non-municipal\",\"N\",IF($A$2=\"Municiple\",\"Y\",\"error\"))","v":"GR02N"},null,null,null,"≥ 500V & ≤ 22kV",371.87,427.65,112.66,129.56,61.17,70.349999999999994,121.32,139.52000000000001,83.48,96,52.94,60.88,19.88,22.86]
["Genflex rural","GR",null,null,"GRN",null,null,null,null,0,null,0,null,0,null,0,null,0,null,0,null,0]
["Genflex rural","GR",null,null,"GRN",null,null,null,null,0,null,0,null,0,null,0,null,0,null,0,null,0]
["Genflex rural","GR",1,1,"GR11N",null,null,"> 300km and \n≤ 600km","< 500V",379.35,436.25,114.92,132.16,62.41,71.77,123.74,142.30000000000001,85.17,97.95,54.04,62.15,21.75,25.01]
["Genflex rural","GR",1,2,"GR12N",null,null,null,"≥ 500V & ≤ 22kV",375.57,431.91,113.77,130.84,61.8,71.069999999999993,122.52,140.9,84.3,96.95,53.49,61.51,20,23]
["Genflex rural","GR",null,null,"GRN",null,null,null,null,0,null,0,null,0,null,0,null,0,null,0,null,0]
["Genflex rural","GR",null,null,"GRN",null,null,null,null,0,null,0,null,0,null,0,null,0,null,0,null,0]
["Genflex rural","GR",2,1,"GR21N",null,null,"> 600km and \n≤ 900km","< 500V",383.15,440.62,116.08,133.49,63.03,72.48,124.99,143.74,86.01,98.91,54.58,62.77,21.87,25.15]
["Genflex rural","GR",2,2,"GR22N",null,null,null,"≥ 500V & ≤ 22kV",379.33,436.23,114.9,132.13999999999999,62.41,71.77,123.74,142.30000000000001,85.17,97.95,54.04,62.15,20.09,23.1]
["Genflex rural","GR",null,null,"GRN",null,null,null,null,0,null,0,null,0,null,0,null,0,null,0,null,0]
["Genflex rural","GR",null,null,"GRN",null,null,null,null,0,null,0,null,0,null,0,null,0,null,0,null,0]
["Genflex rural","GR",3,1,"GR31N",null,null,"> 900km","< 500V",386.97,445.02,117.23,134.81,63.65,73.2,126.19,145.12,86.87,99.9,55.12,63.39,21.96,25.25]
["Genflex rural","GR",3,2,"GR32N",null,null,null,"≥ 500V & ≤ 22kV",383.14,440.61,116.08,133.49,63.03,72.48,124.99,143.74,86.01,98.91,54.58,62.77,20.100000000000001,23.12]
[null,null,null,null,null,null,null,null,null,null,null,null,null,0]
[null,null,null,null,null,null,null,null,null,null,null,null,null,0]
["Gen-purchase","NLPurchADJ",0,4,{"$f":"B24&C24&D24&IF($A$2=\"Non-municipal\",\"N\",IF($A$2=\"Municiple\",\"Y\",\"error\"))","v":"NLPurchADJ04N"}]
[]
[null,null,null,null,null,null,null,null,null,null,null,null,null,null,null,null,"Ancillary service charge for loads and generators"]
[]
[null,null,null,null,null,null,null,"Customer categories",null,"Service charge  [R/account/day]",null,"Administration charge  [R/POD/day]",null,null,"Voltage",null," [c/kWh]"]
[null,null,null,null,null,null,null,"[kVA or MVA = loads]",null,null,null,null,null,null,null,null,null,"VAT incl"]
["Tariff","Tariff nameBillcode","Tx zone","Voltage","Billcode",null,null,"[kW or MW = generators]",null,null,"VAT incl",null,"VAT incl",null,"< 500V",null,0.48,{"$f":"ROUND(Q30 * (1 + VAT), 2)","v":0.55000000000000004}]
["Genflex rural","GR",0,1,{"$f":"B31&C31&D31&IF($A$2=\"Non-municipal\",\"N\",IF($A$2=\"Municiple\",\"Y\",\"error\"))","v":"GR01N"},null,null,"≤ 100 kVA/kW",null,21.34,{"$f":"ROUND(J31 * (1 + VAT), 2)","v":24.54},6.06,{"$f":"ROUND(L31 * (1 + VAT), 2)","v":6.97},null,"≥ 500V & < 22kV",null,0.48,{"$f":"ROUND(Q31 * (1 + VAT), 2)","v":0.55000000000000004}]
["Genflex rural","GR",0,1,{"$f":"B32&C32&D32&IF($A$2=\"Non-municipal\",\"N\",IF($A$2=\"Municiple\",\"Y\",\"error\"))","v":"GR01N"},null,null,"> 100 KVA/kW & ≤ 500 kVA/kW",null,72.760000000000005,{"$f":"ROUND(J32 * (1 + VAT), 2)","v":83.67},33.74,{"$f":"ROUND(L32 * (1 + VAT), 2)","v":38.799999999999997}]
["Genflex rural","GR",0,1,{"$f":"B33&C33&D33&IF($A$2=\"Non-municipal\",\"N\",IF($A$2=\"Municiple\",\"Y\",\"error\"))","v":"GR01N"},null,null,"> 500 kVA/kW & ≤ 1 MVA/MW",null,223.85,{"$f":"ROUND(J33 * (1 + VAT), 2)","v":257.43},51.78,{"$f":"ROUND(L33 * (1 + VAT), 2)","v":59.55},null,"Reactive energy charge  [c/kVArh]",null,null,null,"Network demand charge [c/kWh] for loads  in all time-of-use periods\n"]
["Genflex rural","GR",0,1,{"$f":"B34&C34&D34&IF($A$2=\"Non-municipal\",\"N\",IF($A$2=\"Municiple\",\"Y\",\"error\"))","v":"GR01N"},null,null,"> 1 MVA/MW",null,223.85,{"$f":"ROUND(J34 * (1 + VAT), 2)","v":257.43},96.08,{"$f":"ROUND(L34 * (1 + VAT), 2)","v":110.49},null,"High season",null,"Low season",null,null,"VAT incl"]
["Genflex rural","GR",0,1,{"$f":"B35&C35&D35&IF($A$2=\"Non-municipal\",\"N\",IF($A$2=\"Municiple\",\"Y\",\"error\"))","v":"GR01N"},null,null,"Key customers",null,4387.25,{"$f":"ROUND(J35 * (1 + VAT), 2)","v":5045.34},96.08,{"$f":"ROUND(L35 * (1 + VAT), 2)","v":110.49},null,null,"VAT incl",null,"VAT incl",30.88,{"$f":"ROUND(S35 * (1 + VAT), 2)","v":35.51}]
[null,null,null,null,null,null,null,null,null,null,null,null,null,null,10.43,{"$f":"ROUND(O36 * (1 + VAT), 2)","v":11.99},0,{"$f":"ROUND(Q36 * (1 + VAT), 2)","v":0},27.07,{"$f":"ROUND(S36 * (1 + VAT), 2)","v":31.13}]

{"sheet":"Landrate NLA","index":24,"n_rows":13,"n_cols":19,"rows_kept":13,"cut":false,"hidden":false,"merged":[[1,6,1,19],[3,17,3,18],[11,7,11,8],[3,9,3,10],[3,11,3,12],[3,13,3,14],[3,15,3,16],[5,7,5,8],[6,7,6,8],[7,7,7,8],[8,7,8,8],[9,7,9,8],[10,7,10,8]]}
[null,null,null,null,null,null,null,"Back to menu"]
["Non-municipal",null,null,null,null,null,"Landrate - Non-local Authority"]
[]
[null,null,null,null,null,null,null,null,null,"Energy charge [c/kWh]",null,"Ancillary service charge [c/kWh]",null,"Network demand charge [c/kWh]",null,"Network capacity charge \n[R/POD/day]",null,"Service charge  \n[R/POD/day]"]
["Tariff","Tariff nameBillcode","Tx zone","Voltage","Billcode",null,null,null,null,null,"VAT incl",null,"VAT incl",null,"VAT incl",null,"VAT incl",null,"VAT incl"]
["Landrate 1","L1",0,1,{"$f":"B6&C6&D6&IF($A$2=\"Non-municipal\",\"N\",IF($A$2=\"Municiple\",\"Y\",\"error\"))","v":"L101N"},null,null,"Landrate 1",null,123.58,{"$f":"ROUND(J6 * (1 + VAT), 2)","v":142.12},0.48,{"$f":"ROUND(L6 * (1 + VAT), 2)","v":0.55000000000000004},30.88,{"$f":"ROUND(N6 * (1 + VAT), 2)","v":35.51},33.01,{"$f":"ROUND(P6 * (1 + VAT), 2)","v":37.96},27.41,{"$f":"ROUND(R6 * (1 + VAT), 2)","v":31.52}]
["Landrate 2","L2",0,1,{"$f":"B7&C7&D7&IF($A$2=\"Non-municipal\",\"N\",IF($A$2=\"Municiple\",\"Y\",\"error\"))","v":"L201N"},null,null,"Landrate 2",null,123.58,142.12,0.48,{"$f":"ROUND(L7 * (1 + VAT), 2)","v":0.55000000000000004},30.88,{"$f":"ROUND(N7 * (1 + VAT), 2)","v":35.51},50.74,{"$f":"ROUND(P7 * (1 + VAT), 2)","v":58.35},27.41,{"$f":"ROUND(R7 * (1 + VAT), 2)","v":31.52}]
["Landrate 3","L3",0,1,"L301N",null,null,"Landrate 3",null,123.58,142.12,0.48,{"$f":"ROUND(L8 * (1 + VAT), 2)","v":0.55000000000000004},30.88,{"$f":"ROUND(N8 * (1 + VAT), 2)","v":35.51},81.11,{"$f":"ROUND(P8 * (1 + VAT), 2)","v":93.28},27.41,{"$f":"ROUND(R8 * (1 + VAT), 2)","v":31.52}]
["Landrate 4","L4",0,1,"L401N",null,null,"Landrate 4",null,266.92,306.95999999999998,0.48,{"$f":"ROUND(L9 * (1 + VAT), 2)","v":0.55000000000000004},30.88,{"$f":"ROUND(N9 * (1 + VAT), 2)","v":35.51},26.28,{"$f":"ROUND(P9 * (1 + VAT), 2)","v":30.22},0,{"$f":"ROUND(R9 * (1 + VAT), 2)","v":0}]
["Landlight","Lt",0,1,{"$f":"B10&C10&D10&IF($A$2=\"Non-municipal\",\"N\",IF($A$2=\"Municiple\",\"Y\",\"error\"))","v":"Lt01N"},null,null,"Landlight 20A",null,355.35,408.65]
[null,"Lt60",0,1,{"$f":"B11&C11&D11&IF($A$2=\"Non-municipal\",\"N\",IF($A$2=\"Municiple\",\"Y\",\"error\"))","v":"Lt6001N"},null,null,"Landlight 60A",null,458.09,526.79999999999995]
["Landrate Dx","Ld",0,1,"Ld01N",null,null,"Landrate Dx*",null,null,null,null,null,null,null,null,null,58.783900000000003,{"$f":"ROUND(R12 * (1 + VAT), 2)","v":67.599999999999994}]
[null,null,null,null,null,null,null,"*R/day fixed charge inclusive of the following charges; energy, ancillary service, network demand, network capacity and service charge."]

{"sheet":"Landrate Munic ","index":25,"n_rows":11,"n_cols":19,"rows_kept":11,"cut":false,"hidden":false,"merged":[[9,7,9,8],[3,9,3,10],[3,11,3,12],[3,13,3,14],[3,15,3,16],[1,6,1,19],[5,7,5,8],[6,7,6,8],[7,7,7,8],[8,7,8,8],[3,17,3,18]]}
[null,null,null,null,null,null,null,"Back to menu"]
["Municiple",null,null,null,null,null,"Landrate - Local Authority"]
[]
[null,null,null,null,null,null,null,null,null,"Energy charge [c/kWh]",null,"Ancillary service charge [c/kWh]",null,"Network demand charge [c/kWh]",null,"Network capacity charge [R/POD/day]",null,"Service charge  [R/POD/day]"]
["Tariff","Tariff nameBillcode","Tx zone","Voltage","Billcode",null,null,null,null,null,"VAT incl",null,"VAT incl",null,"VAT incl",null,"VAT incl",null,"VAT incl"]
["Landrate 1","L1",0,1,{"$f":"B6&C6&D6&IF($A$2=\"Non-municipal\",\"N\",IF($A$2=\"Municiple\",\"Y\",\"error\"))","v":"L101Y"},null,null,"Landrate 1",null,126.41,{"$f":"ROUND(J6 * (1 + VAT), 2)","v":145.37},0.48,{"$f":"ROUND(L6 * (1 + VAT), 2)","v":0.55000000000000004},31.16,{"$f":"ROUND(N6 * (1 + VAT), 2)","v":35.83},33.28,{"$f":"ROUND(P6 * (1 + VAT), 2)","v":38.270000000000003},27.24,{"$f":"ROUND(R6 * (1 + VAT), 2)","v":31.33}]
["Landrate 2","L2",0,1,{"$f":"B7&C7&D7&IF($A$2=\"Non-municipal\",\"N\",IF($A$2=\"Municiple\",\"Y\",\"error\"))","v":"L201Y"},null,null,"Landrate 2",null,126.41,{"$f":"ROUND(J7 * (1 + VAT), 2)","v":145.37},0.48,{"$f":"ROUND(L7 * (1 + VAT), 2)","v":0.55000000000000004},31.16,{"$f":"ROUND(N7 * (1 + VAT), 2)","v":35.83},51.15,{"$f":"ROUND(P7 * (1 + VAT), 2)","v":58.82},27.24,{"$f":"ROUND(R7 * (1 + VAT), 2)","v":31.33}]
["Landrate 3","L3",0,1,{"$f":"B8&C8&D8&IF($A$2=\"Non-municipal\",\"N\",IF($A$2=\"Municiple\",\"Y\",\"error\"))","v":"L301Y"},null,null,"Landrate 3",null,126.41,{"$f":"ROUND(J8 * (1 + VAT), 2)","v":145.37},0.48,{"$f":"ROUND(L8 * (1 + VAT), 2)","v":0.55000000000000004},31.16,{"$f":"ROUND(N8 * (1 + VAT), 2)","v":35.83},81.790000000000006,{"$f":"ROUND(P8 * (1 + VAT), 2)","v":94.06},27.24,{"$f":"ROUND(R8 * (1 + VAT), 2)","v":31.33}]
["Landrate 4","L4",0,1,{"$f":"B9&C9&D9&IF($A$2=\"Non-municipal\",\"N\",IF($A$2=\"Municiple\",\"Y\",\"error\"))","v":"L401Y"},null,null,"Landrate 4",null,273.02999999999997,{"$f":"ROUND(J9 * (1 + VAT), 2)","v":313.98},0.48,{"$f":"ROUND(L9 * (1 + VAT), 2)","v":0.55000000000000004},31.16,{"$f":"ROUND(N9 * (1 + VAT), 2)","v":35.83},26.5,{"$f":"ROUND(P9 * (1 + VAT), 2)","v":30.48}]
["Landrate Dx","Ld",0,1,{"$f":"B10&C10&D10&IF($A$2=\"Non-municipal\",\"N\",IF($A$2=\"Municiple\",\"Y\",\"error\"))","v":"Ld01Y"},null,null,"Landrate Dx*",null,null,null,null,null,null,null,null,null,58.936199999999999,{"$f":"ROUND(R10 * (1 + VAT), 2)","v":67.78}]
[null,null,null,null,null,null,null,"*R/day fixed charge inclusive of the following charges; energy, ancillary service, network demand, network capacity and service charge."]

{"sheet":"TOuS Original","index":26,"n_rows":109,"n_cols":14,"rows_kept":109,"cut":false,"hidden":true,"merged":[[103,12,103,13],[89,1,89,2],[90,1,90,2],[91,1,91,2],[93,1,93,3],[93,5,93,7],[103,10,104,11],[88,1,88,2],[73,3,74,4],[73,5,74,6],[73,7,74,8],[75,1,75,2],[76,1,79,2],[82,1,82,6],[83,1,85,2],[83,3,84,4],[83,5,84,6],[86,1,86,2],[87,1,87,2],[72,1,72,8],[56,3,57,4],[56,5,57,6],[58,1,58,2],[59,1,59,2],[60,1,60,2],[63,1,63,4],[64,3,65,4],[66,1,66,2],[67,1,67,2],[68,1,68,2],[69,1,69,2],[55,1,55,6],[35,1,42,1],[41,2,42,2],[45,1,45,8],[46,3,47,4],[46,5,47,6],[46,7,47,8],[48,1,48,2],[49,1,49,2],[50,1,50,2],[51,1,51,2],[52,1,52,2],[3,1,4,2],[3,3,3,4],[11,1,12,2],[11,3,11,4],[19,1,30,1],[28,2,30,2]]}
[]
[]
[]
[null,"Reliability service charge urban",null,"Charge\n[c/kWh]"]
[null,null,null,null,"VAT incl"]
[null,"< 500V",null,0.27,{"$f":"ROUND(D6 * (1 + VAT), 2)","v":0.31}]
[null,"≥ 500V & < 66kV",null,0.26,{"$f":"ROUND(D7 * (1 + VAT), 2)","v":0.3}]
[null,"≥ 66kV & ≤ 132kV",null,0.25,{"$f":"ROUND(D8 * (1 + VAT), 2)","v":0.28999999999999998}]
[null,"> 132kV",null,0.23,{"$f":"ROUND(D9 * (1 + VAT), 2)","v":0.26}]
[]
[]
[null,"Reliability service charge rural",null,"Charge                                           [c/kWh]"]
[null,null,null,null,"VAT incl"]
[null,"< 500V",null,0.27,{"$f":"ROUND(D14 * (1 + VAT), 2)","v":0.31}]
[null,"≥ 500V & ≤ 22kV",null,0.27,{"$f":"ROUND(D15 * (1 + VAT), 2)","v":0.31}]
[]
[]
[null,null,"Transmission zone","Voltage","R/kVA"]
[null,null,null,null,null,"VAT incl"]
[null,"ETUoS\nurban","≤ 300km","< 500V",11.364385961984476,{"$f":"ROUND(E20 * (1 + VAT), 2)","v":13.07}]
[null,null,null,"≥ 500V & < 66kV",11.194005362854275,12.87]
[null,null,null,"≥ 66kV & ≤ 132kV",10.836206104680851,12.46]
[null,null,"> 300km & ≤ 600km","< 500V",11.466614321462599,13.19]
[null,null,null,"≥ 500V & < 66kV",11.313271782245415,13.01]
[null,null,null,"≥ 66kV & ≤ 132kV",10.955472524071991,12.6]
[null,null,"> 600km & ≤ 900km","< 500V",11.585880740853739,13.32]
[null,null,null,"≥ 500V & < 66kV",11.432538201636557,13.15]
[null,null,null,"≥ 66kV & ≤ 132kV",11.057700883550114,12.72]
[null,null,"> 900km","< 500V",11.705147160244881,13.46]
[null,null,null,"≥ 500V & < 66kV",11.551804621027699,13.28]
[null,null,null,"≥ 66kV & ≤ 132kV",11.176967302941254,12.85]
[]
[]
[null,null,"Transmission zone","Voltage","R/kVA"]
[null,null,null,null,null,"VAT incl"]
[null,"ETUoS\nrural","≤ 300km","< 500V",11.773299399896962,{"$f":"ROUND(E36 * (1 + VAT), 2)","v":13.54}]
[null,null,null,"≥ 500V & < 66kV",11.671071040418839,13.42]
[null,null,"> 300km & ≤ 600km","< 500V",11.892565819288103,13.68]
[null,null,null,"≥ 500V & < 66kV",11.790337459809981,13.56]
[null,null,"> 600km & ≤ 900km","< 500V",12.011832238679244,13.81]
[null,null,null,"≥ 500V & < 66kV",11.909603879201123,13.7]
[null,null,"> 900km","< 500V",12.131098658070385,13.95]
[null,null,null,"≥ 500V & < 66kV",12.028870298592263,13.83]
[]
[]
[null,"Distribution network charges urban"]
[null,null,null,"Network access charge    [R/kVA/m]",null,"Network demand charge [R/kVA/m]",null,"Urban low voltage subsidy charge [R/kVA/m]"]
[]
[null,"Voltage ",null,null,"VAT incl",null,"VAT incl",null,"VAT incl"]
[null,"< 500V",null,{"$f":"#REF!","v":{"$error":"#REF!"}},{"$f":"ROUND(D50 * (1 + VAT), 2)","v":{"$error":"#REF!"}},{"$f":"#REF!","v":{"$error":"#REF!"}},{"$f":"ROUND(F50 * (1 + VAT), 2)","v":{"$error":"#REF!"}},{"$f":"#REF!","v":{"$error":"#REF!"}},{"$f":"ROUND(H50 * (1 + VAT), 2)","v":{"$error":"#REF!"}}]
[null,"≥ 500V & < 66kV",null,{"$f":"#REF!","v":{"$error":"#REF!"}},{"$f":"ROUND(D51 * (1 + VAT), 2)","v":{"$error":"#REF!"}},{"$f":"#REF!","v":{"$error":"#REF!"}},{"$f":"ROUND(F51 * (1 + VAT), 2)","v":{"$error":"#REF!"}},{"$f":"#REF!","v":{"$error":"#REF!"}},{"$f":"ROUND(H51 * (1 + VAT), 2)","v":{"$error":"#REF!"}}]
[null,"≥ 66kV & ≤ 132kV",null,{"$f":"#REF!","v":{"$error":"#REF!"}},{"$f":"ROUND(D52 * (1 + VAT), 2)","v":{"$error":"#REF!"}},{"$f":"#REF!","v":{"$error":"#REF!"}},{"$f":"ROUND(F52 * (1 + VAT), 2)","v":{"$error":"#REF!"}},{"$f":"#REF!","v":{"$error":"#REF!"}},{"$f":"ROUND(H52 * (1 + VAT), 2)","v":{"$error":"#REF!"}}]
[null,"> 132kV",null,{"$f":"#REF!","v":{"$error":"#REF!"}},{"$f":"ROUND(D53 * (1 + VAT), 2)","v":{"$error":"#REF!"}},{"$f":"#REF!","v":{"$error":"#REF!"}},{"$f":"ROUND(F53 * (1 + VAT), 2)","v":{"$error":"#REF!"}},{"$f":"#REF!","v":{"$error":"#REF!"}},{"$f":"ROUND(H53 * (1 + VAT), 2)","v":{"$error":"#REF!"}}]
[]
[]
[null,"Distribution network charges rural"]
[null,null,null,"Network access charge [R/kVA/m]",null,"Network demand charge [c/kWh]"]
[]
[null,"Voltage",null,null,"VAT incl",null,"VAT incl"]
[null,"< 500V",null,6.2016647953894406,{"$f":"ROUND(D60 * (1 + VAT), 2)","v":7.13},19.673247251813724,{"$f":"ROUND(F60 * (1 + VAT), 2)","v":22.62}]
[null,"≥ 500V & ≤ 22kV",null,2.2975559127207621,{"$f":"ROUND(D61 * (1 + VAT), 2)","v":2.64},17.238867254434076,{"$f":"ROUND(F61 * (1 + VAT), 2)","v":19.82}]
[]
[]
[null,"Distribution network charges for Generators"]
[null,null,null,"Network access charge    [R/MW/m]"]
[]
[null,"Voltage ",null,null,"VAT incl"]
[null,"< 500V"]
[null,"≥ 500V & < 66kV"]
[null,"≥ 66kV & ≤ 132kV",null,9.4,{"$f":"ROUND(D70 * (1 + VAT), 2)","v":10.81}]
[]
[]
[null,"Electrification and rural network subsidy charge [c/kWh]"]
[null,null,null,"Rural network subsidy charge            [c/kWh]",null,"Electrification networks subsidy charge  [c/kWh]",null,"Total electrification and rural network subsidy charge [c/kWh]"]
[]
[null,"Tariff",null,null,"VAT incl",null,"VAT incl",null,"VAT incl"]
[null,"Megaflex, Miniflex, Nightsave Urban Large, Nightsave Urban Small, Businessrate \n"]
[null,null,null,2.68,{"$f":"ROUND(D78 * (1 + VAT), 2)","v":3.08},0.91,{"$f":"ROUND(F78 * (1 + VAT), 2)","v":1.05},3.59,{"$f":" ROUND(H78 * (1 + VAT), 2)","v":4.13}]
[]
[]
[]
[]
[null,"Service and admin charges"]
[null,"Customer categories",null,"Service charge  [R/account/day]",null,"Administration charge  [R/POD/day]"]
[]
[null,null,null,null,"VAT incl",null,"VAT incl"]
[null,"≤ 100 kVA",null,9.49,{"$f":"ROUND(D87 * (1 + VAT), 2)","v":10.91},2.08,{"$f":"ROUND(F87 * (1 + VAT), 2)","v":2.39}]
[null,"> 100 kVA & ≤ 500 kVA",null,43.38,{"$f":"ROUND(D88 * (1 + VAT), 2)","v":49.89},12.16,{"$f":"ROUND(F88 * (1 + VAT), 2)","v":13.98}]
[null,"> 500 kVA & ≤ 1 MVA",null,133.5,{"$f":"ROUND(D89 * (1 + VAT), 2)","v":153.53},24.17,{"$f":"ROUND(F89 * (1 + VAT), 2)","v":27.8}]
[null,"> 1 MVA",null,133.5,{"$f":"ROUND(D90 * (1 + VAT), 2)","v":153.53},60.17,{"$f":"ROUND(F90 * (1 + VAT), 2)","v":69.2}]
[null,"Key customers",null,2616.06,{"$f":"ROUND(D91 * (1 + VAT), 2)","v":3008.47},83.55,{"$f":"ROUND(F91 * (1 + VAT), 2)","v":96.08}]
[]
[]
[null,"Distribution loss factors",null,null,null,"Transmission loss factors for loads"]
[null,"Voltage","Urban\nloss factor","Rural\nloss factor",null,"Distance from\nJohannesburg","Zone","Loss\nfactor"]
[null,"< 500V",{"$f":"'Loss Factors'!O6","v":1.1111},{"$f":"'Loss Factors'!P6","v":1.1527000000000001},null,"0 to 300 km",0,{"$f":"'Loss Factors'!T6","v":1.0106999999999999}]
[null,"≥ 500V & < 66kV",{"$f":"'Loss Factors'!O7","v":1.0956999999999999},{"$f":"'Loss Factors'!P7","v":1.1412},null,"301 to 600 km",1,{"$f":"'Loss Factors'!T7","v":1.0207999999999999}]
[null,"≥ 66kV & ≤ 132kV",{"$f":"'Loss Factors'!O8","v":1.0610999999999999},null,null,"601 to 900 km",2,{"$f":"'Loss Factors'!T8","v":1.0309999999999999}]
[null,"> 132kV",{"$f":"'Loss Factors'!O9","v":1},null,null,"> 900 km",3,{"$f":"'Loss Factors'!T9","v":1.0412999999999999}]
[]
[]
[]
[]
[null,null,null,null,null,null,null,null,null,null,"TUoS  [ > 132kV]",null,"Charge\nR/kVA"]
[null,null,null,null,null,null,null,null,null,null,null,null,null,"VAT incl"]
[null,null,null,null,null,null,null,null,null,null,null,"≤ 300km",{"$f":"#REF!","v":{"$error":"#REF!"}},{"$f":"ROUND(M106 * (1 + VAT), 2)","v":{"$error":"#REF!"}}]
[null,null,null,null,null,null,null,null,null,null,null,"> 300km & ≤ 600km",{"$f":"#REF!","v":{"$error":"#REF!"}},{"$f":"ROUND(M107 * (1 + VAT), 2)","v":{"$error":"#REF!"}}]
[null,null,null,null,null,null,null,null,null,null,null,"> 600km & ≤ 900km",{"$f":"#REF!","v":{"$error":"#REF!"}},{"$f":"ROUND(M108 * (1 + VAT), 2)","v":{"$error":"#REF!"}}]
[null,null,null,null,null,null,null,null,null,null,null,"> 900km",{"$f":"#REF!","v":{"$error":"#REF!"}},{"$f":"ROUND(M109 * (1 + VAT), 2)","v":{"$error":"#REF!"}}]

{"sheet":" TUoS NLA","index":27,"n_rows":68,"n_cols":13,"rows_kept":68,"cut":false,"hidden":false,"merged":[[63,7,65,8],[63,9,63,10],[66,7,66,8],[67,7,67,8],[35,7,36,8],[35,9,36,9],[45,7,46,8],[45,9,45,10],[53,7,54,8],[53,9,53,10],[27,7,27,9],[15,7,17,8],[15,9,17,10],[15,11,17,12],[18,7,18,8],[19,7,19,8],[20,7,20,8],[21,7,21,8],[22,7,22,8],[23,7,23,8],[24,7,24,8],[25,7,25,8],[14,7,14,12],[2,7,2,13],[5,7,5,10],[6,9,7,10],[8,7,8,8],[9,7,11,8]]}
[null,null,null,null,null,null,null,"Back to menu"]
["Non-municipal"]
[null,null,null,null,null,null,null," TUoS (Transmission use of system) charges\n(> 132 KV or direct Transmission connected) network charge for loads"]
[]
[]
[null,null,null,null,null,null,null,"Electrification and rural network subsidy charge\n [c/kWh]"]
[null,null,null,null,null,null,null,null,null,"Electrification and rural network subsidy charge [c/kWh]"]
[]
["Tariff","Tariff nameBillcode","Tx zone","Voltage","Billcode",null,null,"Tariff",null,null,"VAT incl"]
[null,null,null,null,null,null,null,"Megaflex, Miniflex, Nightsave Urban Large, Nightsave Urban Small, Businessrate \n"]
["Megaflex","Me",0,1,{"$f":"B11&C11&D11&IF($A$2=\"Non-municipal\",\"N\",IF($A$2=\"Municiple\",\"Y\",\"error\"))","v":"Me01N"},null,null,null,null,9.2200000000000006,{"$f":"ROUND(J11 * (1 + VAT), 2)","v":10.6}]
[]
[]
[]
[null,null,null,null,null,null,null,"Service and admin charges"]
[null,null,null,null,null,null,null,"Utilised capacity/maximum export capacity",null,"Service charge\n[R/account/day]",null,"Administration charge\n[R/POD/day]"]
[]
[]
[null,null,null,null,null,null,null,"[kVA/MVA = loads]"]
["Tariff","Tariff nameBillcode","Tx zone","Voltage","Billcode",null,null,"[kW/MW = generators]",null,null,"VAT incl",null,"VAT incl"]
["Miniflex","Mi",0,1,{"$f":"B21&C21&D21&IF($B$28=\"Non-municipal\",\"N\",IF($B$28=\"Municiple\",\"Y\",\"error\"))","v":"Mi01N"},null,null,"≤ 100 kVA/kW",null,16.850000000000001,{"$f":"ROUND(J21 * (1+ VAT), 2)","v":19.38},3.7,{"$f":"ROUND(L21 * (1+ VAT), 2)","v":4.26}]
["Miniflex","Mi",0,1,{"$f":"B22&C22&D22&IF($B$28=\"Non-municipal\",\"N\",IF($B$28=\"Municiple\",\"Y\",\"error\"))","v":"Mi01N"},null,null,"> 100 kVA/kW & ≤ 500 kVA/kW",null,76.94,{"$f":"ROUND(J22 * (1+ VAT), 2)","v":88.48},21.58,{"$f":"ROUND(L22 * (1+ VAT), 2)","v":24.82}]
["Miniflex","Mi",0,1,{"$f":"B23&C23&D23&IF($B$28=\"Non-municipal\",\"N\",IF($B$28=\"Municiple\",\"Y\",\"error\"))","v":"Mi01N"},null,null,"> 500 kVA/kW & ≤ 1 MVA/MW",null,236.74,{"$f":"ROUND(J23 * (1+ VAT), 2)","v":272.25},42.85,{"$f":"ROUND(L23 * (1+ VAT), 2)","v":49.28}]
["Miniflex","Mi",0,1,{"$f":"B24&C24&D24&IF($B$28=\"Non-municipal\",\"N\",IF($B$28=\"Municiple\",\"Y\",\"error\"))","v":"Mi01N"},null,null,"> 1 MVA/MW",null,236.74,{"$f":"ROUND(J24 * (1+ VAT), 2)","v":272.25},106.69,{"$f":"ROUND(L24 * (1+ VAT), 2)","v":122.69}]
["Miniflex","Mi",0,1,{"$f":"B25&C25&D25&IF($B$28=\"Non-municipal\",\"N\",IF($B$28=\"Municiple\",\"Y\",\"error\"))","v":"Mi01N"},null,null,"Key customers or Transmission connected generators",null,4639.2,{"$f":"ROUND(J25 * (1+ VAT), 2)","v":5335.08},148.16,{"$f":"ROUND(L25 * (1+ VAT), 2)","v":170.38}]
[]
[]
[null,"Non-municipal",null,null,null,null,null,"Transmission loss factors for loads"]
["Tariff","Tariff nameBillcode","Tx zone","Voltage","Billcode",null,null,"Distance from\nJohannesburg","Zone","Loss\nfactor"]
["Transmission loss factor","TxLoss",0,4,{"$f":"B30&C30&D30&IF($B$28=\"Non-municipal\",\"N\",IF($B$28=\"Municiple\",\"Y\",\"error\"))","v":"TxLoss04N"},null,null,"≤ 300km",0,1.0106999999999999]
["Transmission loss factor","TxLoss",1,4,{"$f":"B31&C31&D31&IF($B$28=\"Non-municipal\",\"N\",IF($B$28=\"Municiple\",\"Y\",\"error\"))","v":"TxLoss14N"},null,null,"> 300km & ≤ 600km",1,1.0207999999999999]
["Transmission loss factor","TxLoss",2,4,{"$f":"B32&C32&D32&IF($B$28=\"Non-municipal\",\"N\",IF($B$28=\"Municiple\",\"Y\",\"error\"))","v":"TxLoss24N"},null,null,"> 600km & ≤ 900km",2,1.0309999999999999]
["Transmission loss factor","TxLoss",3,4,{"$f":"B33&C33&D33&IF($B$28=\"Non-municipal\",\"N\",IF($B$28=\"Municiple\",\"Y\",\"error\"))","v":"TxLoss34N"},null,null,"> 900km",3,1.0412999999999999]
[]
[]
[null,null,null,null,null,null,null,"Loss factors for Transmission connected generators",null,"Loss factor"]
["Tariff","Tariff nameBillcode","Tx zone","Voltage","Billcode"]
["TUoS network charges for Transmission connected generators","GenTUOS","Cape",4,{"$f":"B38&C38&D38&IF($A$2=\"Non-municipal\",\"N\",IF($A$2=\"Municiple\",\"Y\",\"error\"))","v":"GenTUOSCape4N"},null,null,null,"Cape",0.97099999999999997]
["TUoS network charges for Transmission connected generators","GenTUOS","Karoo",4,"GenTUOSKaroo4N",null,null,null,"Karoo",0.995]
["TUoS network charges for Transmission connected generators","GenTUOS","Kwazulu-Natal",4,"GenTUOSKwazulu-Natal4N",null,null,null,"Kwazulu-Natal",1.004]
["TUoS network charges for Transmission connected generators","GenTUOS","Vaal",4,"GenTUOSVaal4N",null,null,null,"Vaal",1.02]
["TUoS network charges for Transmission connected generators","GenTUOS","Waterburg",4,"GenTUOSWaterburg4N",null,null,null,"Waterberg",1.0229999999999999]
["TUoS network charges for Transmission connected generators","GenTUOS","Mpumalanga",4,"GenTUOSMpumalanga4N",null,null,null,"Mpumalanga",1.0209999999999999]
[]
[]
[null,null,null,null,null,null,null,"TUoS network charge for Transmission connected loads",null,"Network capacity charge\n[R/kVA]"]
["Tariff","Tariff nameBillcode","Tx zone","Voltage","Billcode",null,null,null,null,null,"VAT incl"]
["WEPS","We",0,1,{"$f":"B48&C48&D48&IF($A$2=\"Non-municipal\",\"N\",IF($A$2=\"Municiple\",\"Y\",\"error\"))","v":"We01N"},null,null,null,"≤ 300km",11.67,{"$f":"ROUND(J48 * (1+ VAT), 2)","v":13.42}]
["WEPS","We",0,2,{"$f":"B49&C49&D49&IF($A$2=\"Non-municipal\",\"N\",IF($A$2=\"Municiple\",\"Y\",\"error\"))","v":"We02N"},null,null,null,"> 300km & ≤ 600km",11.78,{"$f":"ROUND(J49 * (1+ VAT), 2)","v":13.55}]
["WEPS","We",0,3,{"$f":"B50&C50&D50&IF($A$2=\"Non-municipal\",\"N\",IF($A$2=\"Municiple\",\"Y\",\"error\"))","v":"We03N"},null,null,null,"> 600km & ≤ 900km",11.95,{"$f":"ROUND(J50 * (1+ VAT), 2)","v":13.74}]
["WEPS","We",0,4,{"$f":"B51&C51&D51&IF($A$2=\"Non-municipal\",\"N\",IF($A$2=\"Municiple\",\"Y\",\"error\"))","v":"We04N"},null,null,null,"> 900km",12.04,{"$f":"ROUND(J51 * (1+ VAT), 2)","v":13.85}]
[]
[]
[null,null,null,null,null,null,null,"TUoS network charges for Transmission connected generators",null,"Network charge\n[R/kW]"]
["Tariff","Tariff nameBillcode","Tx zone","Voltage","Billcode",null,null,null,null,null,"VAT incl"]
["TUoS network charges for Transmission connected generators","GenTUOS","Cape",4,{"$f":"B56&C56&D56&IF($A$2=\"Non-municipal\",\"N\",IF($A$2=\"Municiple\",\"Y\",\"error\"))","v":"GenTUOSCape4N"},null,null,null,"Cape",0,{"$f":"ROUND(J56 * (1+ VAT), 2)","v":0}]
["TUoS network charges for Transmission connected generators","GenTUOS","Karoo",4,"GenTUOSKaroo4N",null,null,null,"Karoo",0,0]
["TUoS network charges for Transmission connected generators","GenTUOS","Kwazulu-Natal",4,"GenTUOSKwazulu-Natal4N",null,null,null,"Kwazulu-Natal",2.4500000000000002,2.82]
["TUoS network charges for Transmission connected generators","GenTUOS","Vaal",4,"GenTUOSVaal4N",null,null,null,"Vaal",8.16,9.3800000000000008]
["TUoS network charges for Transmission connected generators","GenTUOS","Waterburg",4,"GenTUOSWaterburg4N",null,null,null,"Waterberg",10.45,12.02]
["TUoS network charges for Transmission connected generators","GenTUOS","Mpumalanga",4,"GenTUOSMpumalanga4N",null,null,null,"Mpumalanga",9.6999999999999993,11.16]
[]
[]
[null,null,null,null,null,null,null,"TUoS ancillary service charge for Transmission connected loads and generators",null,"Ancillary service charge\n[c/kWh]"]
[]
["Tariff","Tariff nameBillcode","Tx zone","Voltage","Billcode",null,null,null,null,null,"VAT incl"]
["TUoS network charges for Transmission connected generators","GenTUOS","Cape",4,{"$f":"B67&C67&D67&IF($A$2=\"Non-municipal\",\"N\",IF($A$2=\"Municiple\",\"Y\",\"error\"))","v":"GenTUOSCape4N"},null,null,"Generators",null,0.42,{"$f":"ROUND(J67 * (1+ VAT), 2)","v":0.48}]
["TUoS network charges for Transmission connected generators","GenTUOS","Cape",4,{"$f":"B68&C68&D68&IF($A$2=\"Non-municipal\",\"N\",IF($A$2=\"Municiple\",\"Y\",\"error\"))","v":"GenTUOSCape4N"},null,null,"Loads",null,0.42,{"$f":"ROUND(J68 * (1+ VAT), 2)","v":0.48}]

{"sheet":"DUoS NLA","index":28,"n_rows":125,"n_cols":21,"rows_kept":125,"cut":false,"hidden":false,"merged":[[99,11,101,12],[102,7,102,8],[108,7,108,8],[103,7,103,8],[104,7,104,8],[105,7,105,8],[106,7,106,8],[107,7,107,8],[66,7,66,10],[69,7,69,8],[70,7,70,8],[71,7,71,8],[72,7,72,8],[67,9,68,10],[49,9,50,10],[61,7,61,8],[59,11,60,12],[58,7,58,12],[59,9,60,10],[49,11,50,12],[51,7,51,8],[31,8,33,8],[22,7,33,7],[62,7,62,8],[63,7,63,8],[55,7,55,8],[54,7,54,8],[110,7,110,9],[110,11,110,13],[76,13,77,14],[79,17,82,18],[76,19,77,20],[79,7,82,8],[96,7,96,8],[86,7,88,8],[92,7,92,8],[93,7,93,8],[85,7,85,12],[78,7,78,8],[90,7,90,8],[98,7,98,12],[99,7,101,8],[99,9,101,10],[94,7,94,8],[95,7,95,8],[91,7,91,8],[89,7,89,8],[76,11,77,12],[76,9,77,10],[76,17,78,18],[74,17,75,20],[74,7,75,14],[3,7,3,13],[86,9,88,10],[86,11,88,12],[48,7,48,14],[38,7,45,7],[44,8,45,8],[52,7,52,8],[53,7,53,8],[49,13,50,14],[6,9,6,10],[6,7,7,8],[14,7,15,8],[14,9,14,10]]}
[]
["Non-Municipal",null,null,null,null,null,null,"Back to menu"]
[]
[null,null,null,null,null,null,null,"DUoS (Distribution use of system) charges"]
[]
[]
[null,null,null,null,null,null,null,"DUoS ancillary service charge Urbanp",null,"Charge\n[c/kWh]"]
["Tariff","Tariff nameBillcode","Tx zone","Voltage","Billcode",null,null,null,null,null,"VAT incl"]
["Gen-DUoS urban","NEGenDUoSU",0,1,{"$f":"B9&C9&D9&IF($A$2=\"Non-municipal\",\"N\",IF($A$2=\"Municiple\",\"Y\",\"error\"))","v":"NEGenDUoSU01N"},null,null,"< 500V",null,0.48,{"$f":"ROUND(J9 * (1 + VAT), 2)","v":0.55000000000000004}]
["Gen-DUoS urban","NEGenDUoSU",0,2,{"$f":"B10&C10&D10&IF($A$2=\"Non-municipal\",\"N\",IF($A$2=\"Municiple\",\"Y\",\"error\"))","v":"NEGenDUoSU02N"},null,null,"≥ 500V & < 66kV",null,0.47,{"$f":"ROUND(J10 * (1 + VAT), 2)","v":0.54}]
["Gen-DUoS urban","NEGenDUoSU",0,3,{"$f":"B11&C11&D11&IF($A$2=\"Non-municipal\",\"N\",IF($A$2=\"Municiple\",\"Y\",\"error\"))","v":"NEGenDUoSU03N"},null,null,"≥ 66kV & ≤ 132kV",null,0.45,{"$f":"ROUND(J11 * (1 + VAT), 2)","v":0.52}]
[]
[]
[]
[null,null,null,null,null,null,null,"DUoS ancillary service charge Ruralp",null,"Charge                                           [c/kWh]"]
["Tariff","Tariff nameBillcode","Tx zone","Voltage","Billcode",null,null,null,null,null,"VAT incl"]
["Gen-DUoS rural","NEGenDUoSR",0,1,{"$f":"B17&C17&D17&IF($A$2=\"Non-municipal\",\"N\",IF($A$2=\"Municiple\",\"Y\",\"error\"))","v":"NEGenDUoSR01N"},null,null,"< 500V",null,0.48,{"$f":"ROUND(J17 * (1 + VAT), 2)","v":0.55000000000000004}]
["Gen-DUoS rural","NEGenDUoSR",0,2,{"$f":"B18&C18&D18&IF($A$2=\"Non-municipal\",\"N\",IF($A$2=\"Municiple\",\"Y\",\"error\"))","v":"NEGenDUoSR02N"},null,null,"≥ 500V & ≤ 22kV",null,0.48,{"$f":"ROUND(J18 * (1 + VAT), 2)","v":0.55000000000000004}]
[]
[]
[null,null,null,null,null,null,null,null,"Transmission zone","Voltage","[R/kVA]"]
["Tariff","Tariff nameBillcode","Tx zone","Voltage","Billcode",null,null,null,null,null,null,"VAT incl"]
[null,null,null,null,null,null,null,"ETUoS\nurban","≤ 300km","< 500V",10.38,{"$f":"ROUND(K23 * (1 + VAT), 2)","v":11.94}]
[null,null,null,null,null,null,null,null,null,"≥ 500V & < 66kV",9.48,10.9]
[null,null,null,null,null,null,null,null,null,"≥ 66kV & ≤ 132kV",9.23,10.61]
[null,null,null,null,null,null,null,null,"> 300km & ≤ 600km","< 500V",10.45,12.02]
[null,null,null,null,null,null,null,null,null,"≥ 500V & < 66kV",9.57,11.01]
[null,null,null,null,null,null,null,null,null,"≥ 66kV & ≤ 132kV",9.3000000000000007,10.7]
[null,null,null,null,null,null,null,null,"> 600km & ≤ 900km","< 500V",10.57,12.16]
[null,null,null,null,null,null,null,null,null,"≥ 500V & < 66kV",9.66,11.11]
[null,null,null,null,null,null,null,null,null,"≥ 66kV & ≤ 132kV",9.36,10.76]
[null,null,null,null,null,null,null,null,"> 900km","< 500V",10.64,12.24]
[null,null,null,null,null,null,null,null,null,"≥ 500V & < 66kV",9.77,11.24]
[null,null,null,null,null,null,null,null,null,"≥ 66kV & ≤ 132kV",9.4499999999999993,10.87]
[]
[]
[null,null,null,null,null,null,null,null,"Transmission zone","Voltage","[R/kVA]"]
["Tariff","Tariff nameBillcode","Tx zone","Voltage","Billcode",null,null,null,null,null,null,"VAT incl"]
[null,null,null,null,null,null,null,"ETUoS\nrural","≤ 300km","< 500V",21.69,{"$f":"ROUND(K39 * (1 + VAT), 2)","v":24.94}]
[null,null,null,null,null,null,null,null,null,"≥ 500V & < 66kV",19.88,22.86]
[null,null,null,null,null,null,null,null,"> 300km & ≤ 600km","< 500V",21.75,25.01]
[null,null,null,null,null,null,null,null,null,"≥ 500V & < 66kV",20,23]
[null,null,null,null,null,null,null,null,"> 600km & ≤ 900km","< 500V",21.87,25.15]
[null,null,null,null,null,null,null,null,null,"≥ 500V & < 66kV",20.09,23.1]
[null,null,null,null,null,null,null,null,"> 900km","< 500V",21.96,25.25]
[null,null,null,null,null,null,null,null,null,"≥ 500V & < 66kV",20.100000000000001,23.12]
[]
[]
[null,null,null,null,null,null,null,"DUoS network charges for urbanp loads"]
[null,null,null,null,null,null,null,null,null,"Network capacity charge    [R/kVA/m]",null,"Network demand charge \n[R/kVA/m]",null,"Urban low voltage subsidy charge [R/kVA/m]"]
[]
["Tariff","Tariff nameBillcode","Tx zone","Voltage","Billcode",null,null,"Voltage ",null,null,"VAT incl",null,"VAT incl",null,"VAT incl"]
["Gen-DUoS urban","NEGenDUoSU",0,1,{"$f":"B53&C53&D53&IF($A$2=\"Non-municipal\",\"N\",IF($A$2=\"Municiple\",\"Y\",\"error\"))","v":"NEGenDUoSU01N"},null,null,"< 500V",null,20.62,{"$f":"ROUND(J53 * (1 + VAT), 2)","v":23.71},39.1,{"$f":"ROUND(L53 * (1 + VAT), 2)","v":44.97},0,{"$f":"ROUND(N53 * (1 + VAT), 2)","v":0}]
["Gen-DUoS urban","NEGenDUoSU",0,2,{"$f":"B54&C54&D54&IF($A$2=\"Non-municipal\",\"N\",IF($A$2=\"Municiple\",\"Y\",\"error\"))","v":"NEGenDUoSU02N"},null,null,"≥ 500V & < 66kV",null,18.91,{"$f":"ROUND(J54 * (1 + VAT), 2)","v":21.75},35.869999999999997,{"$f":"ROUND(L54 * (1 + VAT), 2)","v":41.25},0,{"$f":"ROUND(N54 * (1 + VAT), 2)","v":0}]
["Gen-DUoS urban","NEGenDUoSU",0,3,{"$f":"B55&C55&D55&IF($A$2=\"Non-municipal\",\"N\",IF($A$2=\"Municiple\",\"Y\",\"error\"))","v":"NEGenDUoSU03N"},null,null,"≥ 66kV & ≤ 132kV",null,6.75,{"$f":"ROUND(J55 * (1 + VAT), 2)","v":7.76},12.51,{"$f":"ROUND(L55 * (1 + VAT), 2)","v":14.39},16.66,{"$f":"ROUND(N55 * (1 + VAT), 2)","v":19.16}]
["Gen-DUoS urban","NEGenDUoSU",0,4,{"$f":"B56&C56&D56&IF($A$2=\"Non-municipal\",\"N\",IF($A$2=\"Municiple\",\"Y\",\"error\"))","v":"NEGenDUoSU04N"},null,null,"> 132kV",null,0,{"$f":"ROUND(J56 * (1 + VAT), 2)","v":0},0,{"$f":"ROUND(L56 * (1 + VAT), 2)","v":0},16.66,{"$f":"ROUND(N56 * (1 + VAT), 2)","v":19.16}]
[]
[]
[null,null,null,null,null,null,null,"DUoS network charges ruralp loads"]
[null,null,null,null,null,null,null,null,null,"Network capacity charge [R/kVA/m]",null,"Network demand charge [c/kWh]"]
[]
["Tariff","Tariff nameBillcode","Tx zone","Voltage","Billcode",null,null,"Voltage",null,null,"VAT incl",null,"VAT incl"]
["Gen-DUoS rural","NEGenDUoSR",0,1,{"$f":"B63&C63&D63&IF($A$2=\"Non-municipal\",\"N\",IF($A$2=\"Municiple\",\"Y\",\"error\"))","v":"NEGenDUoSR01N"},null,null,"< 500V",null,21.69,{"$f":"ROUND(J63 * (1 + VAT), 2)","v":24.94},30.88,{"$f":"ROUND(L63 * (1 + VAT), 2)","v":35.51}]
["Gen-DUoS rural","NEGenDUoSR",0,2,{"$f":"B64&C64&D64&IF($A$2=\"Non-municipal\",\"N\",IF($A$2=\"Municiple\",\"Y\",\"error\"))","v":"NEGenDUoSR02N"},null,null,"≥ 500V & ≤ 22kV",null,19.88,{"$f":"ROUND(J64 * (1 + VAT), 2)","v":22.86},27.07,{"$f":"ROUND(L64 * (1 + VAT), 2)","v":31.13}]
[]
[]
[null,null,null,null,null,null,null,"DUoS network charges for generators"]
[null,null,null,null,null,null,null,null,null,"Network capacity charge    [R/kW/m]"]
[]
["Tariff","Tariff nameBillcode","Tx zone","Voltage","Billcode",null,null,"Voltage ",null,null,"VAT incl"]
["Gen-DUoS urban","NEGenDUoSU",0,1,{"$f":"B71&C71&D71&IF($A$2=\"Non-municipal\",\"N\",IF($A$2=\"Municiple\",\"Y\",\"error\"))","v":"NEGenDUoSU01N"},null,null,"< 500V"]
["Gen-DUoS urban","NEGenDUoSU",0,2,{"$f":"B72&C72&D72&IF($A$2=\"Non-municipal\",\"N\",IF($A$2=\"Municiple\",\"Y\",\"error\"))","v":"NEGenDUoSU02N"},null,null,"≥ 500V & < 66kV"]
["Gen-DUoS urban","NEGenDUoSU",0,3,{"$f":"B73&C73&D73&IF($A$2=\"Non-municipal\",\"N\",IF($A$2=\"Municiple\",\"Y\",\"error\"))","v":"NEGenDUoSU03N"},null,null,"≥ 66kV & ≤ 132kV",null,16.68,{"$f":"ROUND(J73 * (1 + VAT), 2)","v":19.18}]
[]
[null,null,null,null,null,null,null,"DUoS electrification and rural network subsidy charge [c/kWh]",null,null,null,null,null,null,null,null,null,"DUoS electrification and rural network subsidy charge [c/kWh]"]
[]
[null,null,null,null,null,null,null,null,null,"Rural network subsidy charge            [c/kWh]",null,"Electrification networks subsidy charge [c/kWh]",null,"Total electrification and rural network subsidy charge [c/kWh]",null,null,null,"Tariff",null,"Electrification and rural network subsidy charge [c/kWh]"]
[]
["Tariff","Tariff nameBillcode","Tx zone","Voltage","Billcode",null,null,"Tariff",null,null,"VAT incl",null,"VAT incl",null,"VAT incl",null,null,null,null,null,"VAT incl"]
[null,null,null,null,null,null,null,"Megaflex, Miniflex, Nightsave Urban Large, Nightsave Urban Small, Businessrate \n",null,null,null,null,null,null,null,null,null,"Megaflex, Miniflex, Nightsave Urban Large, Nightsave Urban Small, Businessrate \n"]
["Megaflex","Me",0,1,{"$f":"B81&C81&D81&IF($A$2=\"Non-municipal\",\"N\",IF($A$2=\"Municiple\",\"Y\",\"error\"))","v":"Me01N"},null,null,null,null,6.12,{"$f":"ROUND(J81 * (1 + VAT), 2)","v":7.04},3.1,{"$f":"ROUND(L81 * (1 + VAT), 2)","v":3.57},{"$f":"SUM(J81, L81)","v":9.2200000000000006},{"$f":" ROUND(N81 * (1 + VAT), 2)","v":10.6},null,null,null,null,9.2200000000000006,{"$f":" ROUND(T81 * (1 + VAT), 2)","v":10.6}]
[0.66370106761565839]
[0.33629893238434161]
[]
[]
[null,null,null,null,null,null,null,"DUoS service and administration charges (urbanp )"]
[null,null,null,null,null,null,null,"Customer categories \nutilised capacity / maximum export capacity",null,"Service charge\n[R/account/day]",null,"Administration charge\n[R/POD/day]"]
[]
[]
[null,null,null,null,null,null,null,"[kVA or MVA = loads]"]
["Tariff","Tariff nameBillcode","Tx zone","Voltage","Billcode",null,null,"[kW or MW = generators]",null,null,"VAT incl",null,"VAT incl"]
["Miniflex","Mi",0,1,{"$f":"B92&C92&D92&IF($A$2=\"Non-municipal\",\"N\",IF($A$2=\"Municiple\",\"Y\",\"error\"))","v":"Mi01N"},null,null,"≤ 100 kVA/kW",null,16.850000000000001,{"$f":"ROUND(J92 * (1 + VAT), 2)","v":19.38},3.7,{"$f":"ROUND(L92 * (1 + VAT), 2)","v":4.26}]
["Miniflex","Mi",0,1,{"$f":"B93&C93&D93&IF($A$2=\"Non-municipal\",\"N\",IF($A$2=\"Municiple\",\"Y\",\"error\"))","v":"Mi01N"},null,null,"> 100 kVA/kW & ≤ 500 kVA/kW",null,76.94,{"$f":"ROUND(J93 * (1 + VAT), 2)","v":88.48},21.58,{"$f":"ROUND(L93 * (1 + VAT), 2)","v":24.82}]
["Miniflex","Mi",0,1,{"$f":"B94&C94&D94&IF($A$2=\"Non-municipal\",\"N\",IF($A$2=\"Municiple\",\"Y\",\"error\"))","v":"Mi01N"},null,null,"> 500 kVA/kW & ≤ 1 MVA/MW",null,236.74,{"$f":"ROUND(J94 * (1 + VAT), 2)","v":272.25},42.85,{"$f":"ROUND(L94 * (1 + VAT), 2)","v":49.28}]
["Miniflex","Mi",0,1,{"$f":"B95&C95&D95&IF($A$2=\"Non-municipal\",\"N\",IF($A$2=\"Municiple\",\"Y\",\"error\"))","v":"Mi01N"},null,null,"> 1 MVA/MW",null,236.74,{"$f":"ROUND(J95 * (1 + VAT), 2)","v":272.25},106.69,{"$f":"ROUND(L95 * (1 + VAT), 2)","v":122.69}]
["Miniflex","Mi",0,1,{"$f":"B96&C96&D96&IF($A$2=\"Non-municipal\",\"N\",IF($A$2=\"Municiple\",\"Y\",\"error\"))","v":"Mi01N"},null,null,"Key customers or Transmission connected",null,4639.2,{"$f":"ROUND(J96 * (1 + VAT), 2)","v":5335.08},148.16,{"$f":"ROUND(L96 * (1 + VAT), 2)","v":170.38}]
[]
[]
[null,null,null,null,null,null,null,"DUoS service and administration charges (ruralp)"]
[null,null,null,null,null,null,null,"Customer categories \nutilised capacity / maximum export capacity",null,"Service charge\n[R/account/day]",null,"Administration charge\n[R/POD/day]"]
[]
[]
[null,null,null,null,null,null,null,"[kVA or MVA = loads]"]
["Tariff","Tariff nameBillcode","Tx zone","Voltage","Billcode",null,null,"[kW or MW = generators]",null,null,"VAT incl",null,"VAT incl"]
["Ruraflex","Ru",0,1,{"$f":"B105&C105&D105&IF($A$2=\"Non-municipal\",\"N\",IF($A$2=\"Municiple\",\"Y\",\"error\"))","v":"Ru01N"},null,null,"≤ 100 kVA/kW",null,21.34,{"$f":"ROUND(J105 * (1 + VAT), 2)","v":24.54},6.06,{"$f":"ROUND(L105 * (1 + VAT), 2)","v":6.97}]
["Ruraflex","Ru",0,1,{"$f":"B106&C106&D106&IF($A$2=\"Non-municipal\",\"N\",IF($A$2=\"Municiple\",\"Y\",\"error\"))","v":"Ru01N"},null,null,"> 100 kVA/kW & ≤ 500 kVA/kW",null,72.760000000000005,{"$f":"ROUND(J106 * (1 + VAT), 2)","v":83.67},33.74,{"$f":"ROUND(L106 * (1 + VAT), 2)","v":38.799999999999997}]
["Ruraflex","Ru",0,1,{"$f":"B107&C107&D107&IF($A$2=\"Non-municipal\",\"N\",IF($A$2=\"Municiple\",\"Y\",\"error\"))","v":"Ru01N"},null,null,"> 500 kVA/kW & ≤ 1 MVA/MW",null,223.85,{"$f":"ROUND(J107 * (1 + VAT), 2)","v":257.43},51.78,{"$f":"ROUND(L107 * (1 + VAT), 2)","v":59.55}]
["Ruraflex","Ru",0,1,{"$f":"B108&C108&D108&IF($A$2=\"Non-municipal\",\"N\",IF($A$2=\"Municiple\",\"Y\",\"error\"))","v":"Ru01N"},null,null,"> 1 MVA/MW",null,223.85,{"$f":"ROUND(J108 * (1 + VAT), 2)","v":257.43},96.08,{"$f":"ROUND(L108 * (1 + VAT), 2)","v":110.49}]
["Ruraflex","Ru",0,1,{"$f":"B109&C109&D109&IF($A$2=\"Non-municipal\",\"N\",IF($A$2=\"Municiple\",\"Y\",\"error\"))","v":"Ru01N"},null,null,"Key customers",null,4387.25,{"$f":"ROUND(J109 * (1 + VAT), 2)","v":5045.34},96.08,{"$f":"ROUND(L109 * (1 + VAT), 2)","v":110.49}]
[]
[null,null,null,null,null,null,null,"Distribution loss factors",null,null,null,"Transmission loss factors for loads"]
["Tariff","Tariff nameBillcode","Tx zone","Voltage","Billcode",null,null,"Voltage","Urbanp\nloss factor","Ruralp\nloss factor",null,"Distance from\nJohannesburg","Zone","Loss\nfactor"]
["Distribution loss factor - Urban","DxLossUrb",0,1,{"$f":"B113&C113&D113&IF($A$2=\"Non-municipal\",\"N\",IF($A$2=\"Municiple\",\"Y\",\"error\"))","v":"DxLossUrb01N"},null,null,"< 500V",1.1111,1.1527000000000001,null,"≤ 300km",0,1.0106999999999999]
["Distribution loss factor - Urban","DxLossUrb",0,2,{"$f":"B114&C114&D114&IF($A$2=\"Non-municipal\",\"N\",IF($A$2=\"Municiple\",\"Y\",\"error\"))","v":"DxLossUrb02N"},null,null,"≥ 500V & < 66kV",1.0956999999999999,1.1412,null,"> 300km & ≤ 600km",1,1.0207999999999999]
["Distribution loss factor - Urban","DxLossUrb",0,3,{"$f":"B115&C115&D115&IF($A$2=\"Non-municipal\",\"N\",IF($A$2=\"Municiple\",\"Y\",\"error\"))","v":"DxLossUrb03N"},null,null,"≥ 66kV & ≤ 132kV",1.0610999999999999,null,null,"> 600km & ≤ 900km",2,1.0309999999999999]
["Distribution loss factor - Urban","DxLossUrb",0,4,{"$f":"B116&C116&D116&IF($A$2=\"Non-municipal\",\"N\",IF($A$2=\"Municiple\",\"Y\",\"error\"))","v":"DxLossUrb04N"},null,null,"> 132kV",1,null,null,"> 900km",3,1.0412999999999999]
[]
["Distribution loss factor - Rural","DxLossRur",0,1,{"$f":"B118&C118&D118&IF($A$2=\"Non-municipal\",\"N\",IF($A$2=\"Municiple\",\"Y\",\"error\"))","v":"DxLossRur01N"}]
["Distribution loss factor - Rural","DxLossRur",0,2,{"$f":"B119&C119&D119&IF($A$2=\"Non-municipal\",\"N\",IF($A$2=\"Municiple\",\"Y\",\"error\"))","v":"DxLossRur02N"}]
[]
[]
["Transmission loss factor","TxLoss",0,4,{"$f":"B122&C122&D122&IF($A$2=\"Non-municipal\",\"N\",IF($A$2=\"Municiple\",\"Y\",\"error\"))","v":"TxLoss04N"}]
["Transmission loss factor","TxLoss",1,4,{"$f":"B123&C123&D123&IF($A$2=\"Non-municipal\",\"N\",IF($A$2=\"Municiple\",\"Y\",\"error\"))","v":"TxLoss14N"}]
["Transmission loss factor","TxLoss",2,4,{"$f":"B124&C124&D124&IF($A$2=\"Non-municipal\",\"N\",IF($A$2=\"Municiple\",\"Y\",\"error\"))","v":"TxLoss24N"}]
["Transmission loss factor","TxLoss",3,4,{"$f":"B125&C125&D125&IF($A$2=\"Non-municipal\",\"N\",IF($A$2=\"Municiple\",\"Y\",\"error\"))","v":"TxLoss34N"}]

{"sheet":"Loss Factors","index":29,"n_rows":19,"n_cols":38,"rows_kept":19,"cut":false,"hidden":false,"merged":[[1,13,1,19],[3,13,3,15],[3,17,3,19],[11,13,12,14],[11,15,12,15]]}
[null,null,null,null,null,null,null,null,null,null,null,null,null,"Back to menu",null,null,null,null,null,null,null,null,null,null,null,null,null,null,null,null,null,null,null,null,null,null,null,0.15]
[null,null,null,null,null,null,null,null,null,null,null,null,null,"Loss factors"]
["Non-municipal"]
[null,null,null,null,null,null,null,null,null,null,null,null,null,"Distribution loss factors",null,null,null,"Transmission loss factors for loads"]
["Tariff","Tariff nameBillcode","Tx zone","Voltage","Billcode",null,"Tariff","Tariff nameBillcode","Tx zone","Voltage","Billcode",null,null,"Voltage","Urban\nloss factor","Rural\nloss factor",null,"Distance from\nJohannesburg","Zone","Loss\nfactor"]
["Distribution loss factor - Urban","DxLossUrb",0,1,{"$f":"B6&C6&D6&IF($A$3=\"Non-municipal\",\"N\",IF($A$3=\"Municiple\",\"Y\",\"error\"))","v":"DxLossUrb01N"},null,"Transmission loss factor","TxLoss",0,4,{"$f":"H6&I6&J6&IF($A$3=\"Non-municipal\",\"N\",IF($A$3=\"Municiple\",\"Y\",\"error\"))","v":"TxLoss04N"},null,null,"< 500V",1.1111,1.1527000000000001,null,"≤ 300km",0,1.0106999999999999]
["Distribution loss factor - Urban","DxLossUrb",0,2,{"$f":"B7&C7&D7&IF($A$3=\"Non-municipal\",\"N\",IF($A$3=\"Municiple\",\"Y\",\"error\"))","v":"DxLossUrb02N"},null,"Transmission loss factor","TxLoss",1,4,{"$f":"H7&I7&J7&IF($A$3=\"Non-municipal\",\"N\",IF($A$3=\"Municiple\",\"Y\",\"error\"))","v":"TxLoss14N"},null,null,"≥ 500V & < 66kV",1.0956999999999999,1.1412,null,"> 300km & ≤ 600km",1,1.0207999999999999]
["Distribution loss factor - Urban","DxLossUrb",0,3,{"$f":"B8&C8&D8&IF($A$3=\"Non-municipal\",\"N\",IF($A$3=\"Municiple\",\"Y\",\"error\"))","v":"DxLossUrb03N"},null,"Transmission loss factor","TxLoss",2,4,{"$f":"H8&I8&J8&IF($A$3=\"Non-municipal\",\"N\",IF($A$3=\"Municiple\",\"Y\",\"error\"))","v":"TxLoss24N"},null,null,"≥ 66kV & ≤ 132kV",1.0610999999999999,null,null,"> 600km & ≤ 900km",2,1.0309999999999999]
["Distribution loss factor - Urban","DxLossUrb",0,4,{"$f":"B9&C9&D9&IF($A$3=\"Non-municipal\",\"N\",IF($A$3=\"Municiple\",\"Y\",\"error\"))","v":"DxLossUrb04N"},null,"Transmission loss factor","TxLoss",3,4,{"$f":"H9&I9&J9&IF($A$3=\"Non-municipal\",\"N\",IF($A$3=\"Municiple\",\"Y\",\"error\"))","v":"TxLoss34N"},null,null,"> 132kV/Transmission connected",1,null,null,"> 900km",3,1.0412999999999999]
[]
["Distribution loss factor - Rural","DxLossRur",0,1,{"$f":"B11&C11&D11&IF($A$3=\"Non-municipal\",\"N\",IF($A$3=\"Municiple\",\"Y\",\"error\"))","v":"DxLossRur01N"}]
["Distribution loss factor - Rural","DxLossRur",0,2,{"$f":"B12&C12&D12&IF($A$3=\"Non-municipal\",\"N\",IF($A$3=\"Municiple\",\"Y\",\"error\"))","v":"DxLossRur02N"},null,null,null,null,null,null,null,null,"Loss factors for Transmission connected generators",null,"Loss factor"]
["Tariff","Tariff nameBillcode","Tx zone","Voltage","Billcode"]
["TUoS network charges for Transmission connected generators","GenTUOS","Cape",4,{"$f":"B14&C14&D14&IF($A$3=\"Non-municipal\",\"N\",IF($A$3=\"Municiple\",\"Y\",\"error\"))","v":"GenTUOSCape4N"},null,null,null,null,null,null,null,null,null,"Cape",0.97099999999999997]
["TUoS network charges for Transmission connected generators","GenTUOS","Karoo",4,"GenTUOSKaroo4N",null,null,null,null,null,null,null,null,null,"Karoo",0.995]
["TUoS network charges for Transmission connected generators","GenTUOS","Kwazulu-Natal",4,"GenTUOSKwazulu-Natal4N",null,null,null,null,null,null,null,null,null,"Kwazulu-Natal",1.004]
["TUoS network charges for Transmission connected generators","GenTUOS","Vaal",4,"GenTUOSVaal4N",null,null,null,null,null,null,null,null,null,"Vaal",1.02]
["TUoS network charges for Transmission connected generators","GenTUOS","Waterburg",4,"GenTUOSWaterburg4N",null,null,null,null,null,null,null,null,null,"Waterburg",1.0229999999999999]
["TUoS network charges for Transmission connected generators","GenTUOS","Mpumalanga",4,"GenTUOSMpumalanga4N",null,null,null,null,null,null,null,null,null,"Mpumalanga",1.0209999999999999]

{"sheet":" Excess NCC NLA","index":30,"n_rows":62,"n_cols":40,"rows_kept":62,"cut":false,"hidden":false,"merged":[[13,36,16,36],[17,36,20,36],[21,36,24,36],[3,36,3,39],[5,38,5,39],[6,36,8,36],[6,38,7,39],[9,36,12,36],[52,24,52,26],[54,25,54,26],[54,19,54,20],[52,18,52,20],[6,32,7,33],[41,18,44,18],[41,24,44,24],[41,30,44,30],[45,18,48,18],[45,24,48,24],[45,30,48,30],[33,18,36,18],[33,24,36,24],[33,30,36,30],[37,18,40,18],[37,24,40,24],[29,20,29,21],[29,26,29,27],[37,30,40,30],[29,32,29,33],[30,18,32,18],[30,20,31,21],[30,24,32,24],[30,26,31,27],[30,30,32,30],[30,32,31,33],[17,18,20,18],[17,24,20,24],[17,30,20,30],[21,18,24,18],[21,24,24,24],[21,30,24,30],[9,24,12,24],[9,30,12,30],[13,18,16,18],[13,24,16,24],[13,30,16,30],[1,17,1,34],[3,18,3,21],[27,18,27,21],[3,23,3,27],[3,29,3,33],[27,23,27,27],[27,29,27,33],[5,20,5,21],[5,26,5,27],[5,32,5,33],[6,18,8,18],[6,20,7,21],[6,24,8,24],[6,26,7,27],[6,30,8,30],[9,18,12,18]]}
[null,null,null,null,null,null,null,null,null,null,null,null,null,null,null,null,null,null,"Back to menu"]
[null,null,null,null,null,null,null,null,null,null,null,null,null,null,null,null,null,"Excess network capacity charges (NCC)   - Non-Local Authority"]
[]
["Non-municipal",null,null,null,null,null,null,null,null,null,null,null,null,null,null,null,null,null,"Urban - Excess NCC\nMegaflex/Megaflex Gen\n[non local authorities]",null,null,null,null,"Urban - Excess NCC\nNightsave Urban Large\n[non local authorities]",null,null,null,null,null,"Urban - Excess NCC\nMiniflex\n[non local authorities]",null,null,null,null,null,null,"Urban - Excess NCC\nWEPS\n[non local authorities]"]
[]
[null,null,null,null,null,null,null,null,null,null,null,null,null,null,null,null,null,null,null,null,"Excess NCC[R/kVA/m]",null,null,null,null,null,"Excess NCC[R/kVA/m]",null,null,null,null,null,"Excess NCC[R/kVA/m]",null,null,null,null,null,"Excess NCC[R/kVA/m]"]
[null,null,null,null,null,null,null,null,null,null,null,null,null,null,null,null,null,null,"Transmission zone",null,null,null,null,null,"Transmission zone",null,null,null,null,null,"Transmission zone",null,null,null,null,null,"Transmission zone"]
[null,null,null,null,null,null,null,null,null,null,null,null,null,null,null,null,null,null,null,"Voltage",null,null,null,null,null,"Voltage",null,null,null,null,null,"Voltage",null,null,null,null,null,"Voltage"]
["Tariff","Tariff nameBillcode","Tx zone","Voltage","Billcode",null,"Tariff","Tariff nameBillcode","Tx zone","Voltage","Billcode",null,"Tariff","Tariff nameBillcode","Tx zone","Voltage","Billcode",null,null,null,null,"VAT incl",null,null,null,null,null,"VAT incl",null,null,null,null,null,"VAT incl",null,null,null,null,null,"VAT incl"]
["Excess NAC Megaflex","ExNACMe",0,1,{"$f":"B10&C10&D10&IF($A$4=\"Non-municipal\",\"N\",IF($A$4=\"Municiple\",\"Y\",\"error\"))","v":"ExNACMe01N"},null,"Excess NAC Nightsave Large","ExNACNL",0,1,{"$f":"H10&I10&J10&IF($A$4=\"Non-municipal\",\"N\",IF($A$4=\"Municiple\",\"Y\",\"error\"))","v":"ExNACNL01N"},null,"Excess NAC Miniflex","ExNACMi",0,1,{"$f":"N10&O10&P10&IF($A$4=\"Non-municipal\",\"N\",IF($A$4=\"Municiple\",\"Y\",\"error\"))","v":"ExNACMi01N"},null,"≤ 300km","< 500V",31,{"$f":"ROUND(U10 * (1 + VAT), 2)","v":35.65},null,null,"≤ 300km","< 500V",31,{"$f":"ROUND(AA10 * (1 + VAT), 2)","v":35.65},null,null,"≤ 300km","< 500V",30.96,{"$f":"ROUND(AG10 * (1 + VAT), 2)","v":35.6},null,null,"≤ 300km","< 500V",31,{"$f":"ROUND(AM10 * (1 + VAT), 2)","v":35.65}]
["Excess NAC Megaflex","ExNACMe",0,2,{"$f":"B11&C11&D11&IF($A$4=\"Non-municipal\",\"N\",IF($A$4=\"Municiple\",\"Y\",\"error\"))","v":"ExNACMe02N"},null,"Excess NAC Nightsave Large","ExNACNL",0,2,{"$f":"H11&I11&J11&IF($A$4=\"Non-municipal\",\"N\",IF($A$4=\"Municiple\",\"Y\",\"error\"))","v":"ExNACNL02N"},null,"Excess NAC Miniflex","ExNACMi",0,2,{"$f":"N11&O11&P11&IF($A$4=\"Non-municipal\",\"N\",IF($A$4=\"Municiple\",\"Y\",\"error\"))","v":"ExNACMi02N"},null,null,"≥ 500V & < 66kV",28.39,32.65,null,null,null,"≥ 500V & < 66kV",28.39,32.65,null,null,null,"≥ 500V & < 66kV",28.38,32.64,null,null,null,"≥ 500V & < 66kV",28.39,32.65]
["Excess NAC Megaflex","ExNACMe",0,3,"ExNACMe03N",null,"Excess NAC Nightsave Large","ExNACNL",0,3,"ExNACNL03N",null,"Excess NAC Miniflex","ExNACMi",0,3,"ExNACMi03N",null,null,"≥ 66kV & ≤ 132kV",32.64,37.54,null,null,null,"≥ 66kV & ≤ 132kV",32.64,37.54,null,null,null,"≥ 66kV & ≤ 132kV",32.6,37.49,null,null,null,"≥ 66kV & ≤ 132kV",32.64,37.54]
["Excess NAC Megaflex","ExNACMe",0,4,"ExNACMe04N",null,"Excess NAC Nightsave Large","ExNACNL",0,4,"ExNACNL04N",null,"Excess NAC Miniflex","ExNACMi",0,4,"ExNACMi04N",null,null,"> 132kV*",28.33,32.58,null,null,null,"> 132kV*",28.33,32.58,null,null,null,"> 132kV*",28.28,32.520000000000003,null,null,null,"> 132kV*",28.33,32.58]
["Excess NAC Megaflex","ExNACMe",1,1,"ExNACMe11N",null,"Excess NAC Nightsave Large","ExNACNL",1,1,"ExNACNL11N",null,"Excess NAC Miniflex","ExNACMi",1,1,"ExNACMi11N",null,"> 300km and \n≤ 600km","< 500V",31.07,35.729999999999997,null,null,"> 300km and \n≤ 600km","< 500V",31.07,35.729999999999997,null,null,"> 300km and \n≤ 600km","< 500V",31.04,35.700000000000003,null,null,"> 300km and \n≤ 600km","< 500V",31.07,35.729999999999997]
["Excess NAC Megaflex","ExNACMe",1,2,"ExNACMe12N",null,"Excess NAC Nightsave Large","ExNACNL",1,2,"ExNACNL12N",null,"Excess NAC Miniflex","ExNACMi",1,2,"ExNACMi12N",null,null,"≥ 500V & < 66kV",28.48,32.75,null,null,null,"≥ 500V & < 66kV",28.48,32.75,null,null,null,"≥ 500V & < 66kV",28.46,32.729999999999997,null,null,null,"≥ 500V & < 66kV",28.48,32.75]
["Excess NAC Megaflex","ExNACMe",1,3,"ExNACMe13N",null,"Excess NAC Nightsave Large","ExNACNL",1,3,"ExNACNL13N",null,"Excess NAC Miniflex","ExNACMi",1,3,"ExNACMi13N",null,null,"≥ 66kV & ≤ 132kV",32.71,37.619999999999997,null,null,null,"≥ 66kV & ≤ 132kV",32.71,37.619999999999997,null,null,null,"≥ 66kV & ≤ 132kV",32.659999999999997,37.56,null,null,null,"≥ 66kV & ≤ 132kV",32.71,37.619999999999997]
["Excess NAC Megaflex","ExNACMe",1,4,"ExNACMe14N",null,"Excess NAC Nightsave Large","ExNACNL",1,4,"ExNACNL14N",null,"Excess NAC Miniflex","ExNACMi",1,4,"ExNACMi14N",null,null,"> 132kV*",28.439999999999998,32.71,null,null,null,"> 132kV*",28.439999999999998,32.71,null,null,null,"> 132kV*",28.4,32.659999999999997,null,null,null,"> 132kV*",28.439999999999998,32.71]
["Excess NAC Megaflex","ExNACMe",2,1,"ExNACMe21N",null,"Excess NAC Nightsave Large","ExNACNL",2,1,"ExNACNL21N",null,"Excess NAC Miniflex","ExNACMi",2,1,"ExNACMi21N",null,"> 600km and \n≤ 900km","< 500V",31.19,35.869999999999997,null,null,"> 600km and \n≤ 900km","< 500V",31.19,35.869999999999997,null,null,"> 600km and \n≤ 900km","< 500V",31.18,35.86,null,null,"> 600km and \n≤ 900km","< 500V",31.19,35.869999999999997]
["Excess NAC Megaflex","ExNACMe",2,2,"ExNACMe22N",null,"Excess NAC Nightsave Large","ExNACNL",2,2,"ExNACNL22N",null,"Excess NAC Miniflex","ExNACMi",2,2,"ExNACMi22N",null,null,"≥ 500V & < 66kV",28.57,32.86,null,null,null,"≥ 500V & < 66kV",28.57,32.86,null,null,null,"≥ 500V & < 66kV",28.55,32.83,null,null,null,"≥ 500V & < 66kV",28.57,32.86]
["Excess NAC Megaflex","ExNACMe",2,3,"ExNACMe23N",null,"Excess NAC Nightsave Large","ExNACNL",2,3,"ExNACNL23N",null,"Excess NAC Miniflex","ExNACMi",2,3,"ExNACMi23N",null,null,"≥ 66kV & ≤ 132kV",32.769999999999996,37.69,null,null,null,"≥ 66kV & ≤ 132kV",32.769999999999996,37.69,null,null,null,"≥ 66kV & ≤ 132kV",32.760000000000005,37.67,null,null,null,"≥ 66kV & ≤ 132kV",32.769999999999996,37.69]
["Excess NAC Megaflex","ExNACMe",2,4,"ExNACMe24N",null,"Excess NAC Nightsave Large","ExNACNL",2,4,"ExNACNL24N",null,"Excess NAC Miniflex","ExNACMi",2,4,"ExNACMi24N",null,null,"> 132kV*",28.61,32.9,null,null,null,"> 132kV*",28.61,32.9,null,null,null,"> 132kV*",28.57,32.86,null,null,null,"> 132kV*",28.61,32.9]
["Excess NAC Megaflex","ExNACMe",3,1,"ExNACMe31N",null,"Excess NAC Nightsave Large","ExNACNL",3,1,"ExNACNL31N",null,"Excess NAC Miniflex","ExNACMi",3,1,"ExNACMi31N",null,"> 900km","< 500V",31.26,35.950000000000003,null,null,"> 900km","< 500V",31.26,35.950000000000003,null,null,"> 900km","< 500V",31.21,35.89,null,null,"> 900km","< 500V",31.26,35.950000000000003]
["Excess NAC Megaflex","ExNACMe",3,2,"ExNACMe32N",null,"Excess NAC Nightsave Large","ExNACNL",3,2,"ExNACNL32N",null,"Excess NAC Miniflex","ExNACMi",3,2,"ExNACMi32N",null,null,"≥ 500V & < 66kV",28.68,32.979999999999997,null,null,null,"≥ 500V & < 66kV",28.68,32.979999999999997,null,null,null,"≥ 500V & < 66kV",28.65,32.950000000000003,null,null,null,"≥ 500V & < 66kV",28.68,32.979999999999997]
["Excess NAC Megaflex","ExNACMe",3,3,"ExNACMe33N",null,"Excess NAC Nightsave Large","ExNACNL",3,3,"ExNACNL33N",null,"Excess NAC Miniflex","ExNACMi",3,3,"ExNACMi33N",null,null,"≥ 66kV & ≤ 132kV",32.86,37.79,null,null,null,"≥ 66kV & ≤ 132kV",32.86,37.79,null,null,null,"≥ 66kV & ≤ 132kV",32.82,37.74,null,null,null,"≥ 66kV & ≤ 132kV",32.86,37.79]
["Excess NAC Megaflex","ExNACMe",3,4,"ExNACMe34N",null,"Excess NAC Nightsave Large","ExNACNL",3,4,"ExNACNL34N",null,"Excess NAC Miniflex","ExNACMi",3,4,"ExNACMi34N",null,null,"> 132kV*",28.7,33.01,null,null,null,"> 132kV*",28.7,33.01,null,null,null,"> 132kV*",28.65,32.950000000000003,null,null,null,"> 132kV*",28.7,33.01]
[null,null,null,null,null,null,null,null,null,null,null,null,null,null,null,null,null,null,null,"* 132 kV or Transmission connected",null,null,null,null,null,"* 132 kV or Transmission connected",null,null,null,null,null,"* 132 kV or Transmission connected",null,null,null,null,null,"* 132 kV or Transmission connected"]
[]
[null,null,null,null,null,null,null,null,null,null,null,null,null,null,null,null,null,null,"Urban - Excess NCC\nNightsave Urban Small\n[non local authorities]",null,null,null,null,"Rural - Excess NCC\nNightsave Rural\n[non local authorities]",null,null,null,null,null,"Rural - Excess NCC\nRuraflex/Ruraflex Gen\n[non local authorities]"]
[]
[null,null,null,null,null,null,null,null,null,null,null,null,null,null,null,null,null,null,null,null,"Excess NCC[R/kVA/m]",null,null,null,null,null,"Excess NCC[R/kVA/m]",null,null,null,null,null,"Excess NCC[R/kVA/m]"]
[null,null,null,null,null,null,null,null,null,null,null,null,null,null,null,null,null,null,"Transmission zone",null,null,null,null,null,"Transmission zone",null,null,null,null,null,"Transmission zone"]
[null,null,null,null,null,null,null,null,null,null,null,null,null,null,null,null,null,null,null,"Voltage",null,null,null,null,null,"Voltage",null,null,null,null,null,"Voltage"]
["Tariff","Tariff nameBillcode","Tx zone","Voltage","Billcode",null,"Tariff","Tariff nameBillcode","Tx zone","Voltage","Billcode",null,"Tariff","Tariff nameBillcode","Tx zone","Voltage","Billcode",null,null,null,null,"VAT incl",null,null,null,null,null,"VAT incl",null,null,null,null,null,"VAT incl"]
["Excess NAC Nightsave Small","ExNACNS",0,1,{"$f":"B34&C34&D34&IF($A$4=\"Non-municipal\",\"N\",IF($A$4=\"Municiple\",\"Y\",\"error\"))","v":"ExNACNS01N"},null,"Excess NAC Nightsave Rural","ExNACNR",0,1,{"$f":"H34&I34&J34&IF($A$4=\"Non-municipal\",\"N\",IF($A$4=\"Municiple\",\"Y\",\"error\"))","v":"ExNACNR01N"},null,"Excess NAC Ruraflex","ExNACRu",0,1,{"$f":"N34&O34&P34&IF($A$4=\"Non-municipal\",\"N\",IF($A$4=\"Municiple\",\"Y\",\"error\"))","v":"ExNACRu01N"},null,"≤ 300km","< 500V",31,{"$f":"ROUND(U34 * (1 + VAT), 2)","v":35.65},null,null,"≤ 300km","< 500V",15.52,{"$f":"ROUND(AA34 * (1 + VAT), 2)","v":17.850000000000001},null,null,"≤ 300km","< 500V",21.69,{"$f":"ROUND(AG34 * (1 + VAT), 2)","v":24.94}]
["Excess NAC Nightsave Small","ExNACNS",0,2,{"$f":"B35&C35&D35&IF($A$4=\"Non-municipal\",\"N\",IF($A$4=\"Municiple\",\"Y\",\"error\"))","v":"ExNACNS02N"},null,"Excess NAC Nightsave Rural","ExNACNR",0,2,{"$f":"H35&I35&J35&IF($A$4=\"Non-municipal\",\"N\",IF($A$4=\"Municiple\",\"Y\",\"error\"))","v":"ExNACNR02N"},null,"Excess NAC Ruraflex","ExNACRu",0,2,{"$f":"N35&O35&P35&IF($A$4=\"Non-municipal\",\"N\",IF($A$4=\"Municiple\",\"Y\",\"error\"))","v":"ExNACRu02N"},null,null,"≥ 500V & < 66kV",28.39,32.65,null,null,null,"≥ 500V & ≤ 22kV",14.26,16.399999999999999,null,null,null,"≥ 500V & ≤ 22kV",19.88,22.86]
["Excess NAC Nightsave Small","ExNACNS",0,3,"ExNACNS03N",null,"Excess NAC Nightsave Rural","ExNACNR",0,3,"ExNACNR03N",null,"Excess NAC Ruraflex","ExNACRu",0,3,"ExNACRu03N",null,null,"≥ 66kV & ≤ 132kV",32.64,37.54]
["Excess NAC Nightsave Small","ExNACNS",0,4,"ExNACNS04N",null,"Excess NAC Nightsave Rural","ExNACNR",0,4,"ExNACNR04N",null,"Excess NAC Ruraflex","ExNACRu",0,4,"ExNACRu04N",null,null,"> 132kV*",28.33,32.58]
["Excess NAC Nightsave Small","ExNACNS",1,1,"ExNACNS11N",null,"Excess NAC Nightsave Rural","ExNACNR",1,1,"ExNACNR11N",null,"Excess NAC Ruraflex","ExNACRu",1,1,"ExNACRu11N",null,"> 300km and \n≤ 600km","< 500V",31.07,35.729999999999997,null,null,"> 300km and \n≤ 600km","< 500V",15.55,{"$f":"ROUND(AA38 * (1 + VAT), 2)","v":17.88},null,null,"> 300km and \n≤ 600km","< 500V",21.75,{"$f":"ROUND(AG38 * (1 + VAT), 2)","v":25.01}]
["Excess NAC Nightsave Small","ExNACNS",1,2,"ExNACNS12N",null,"Excess NAC Nightsave Rural","ExNACNR",1,2,"ExNACNR12N",null,"Excess NAC Ruraflex","ExNACRu",1,2,"ExNACRu12N",null,null,"≥ 500V & < 66kV",28.48,32.75,null,null,null,"≥ 500V & ≤ 22kV",14.31,16.46,null,null,null,"≥ 500V & ≤ 22kV",20,23]
["Excess NAC Nightsave Small","ExNACNS",1,3,"ExNACNS13N",null,"Excess NAC Nightsave Rural","ExNACNR",1,3,"ExNACNR13N",null,"Excess NAC Ruraflex","ExNACRu",1,3,"ExNACRu13N",null,null,"≥ 66kV & ≤ 132kV",32.71,37.619999999999997]
["Excess NAC Nightsave Small","ExNACNS",1,4,"ExNACNS14N",null,"Excess NAC Nightsave Rural","ExNACNR",1,4,"ExNACNR14N",null,"Excess NAC Ruraflex","ExNACRu",1,4,"ExNACRu14N",null,null,"> 132kV*",28.439999999999998,32.71]
["Excess NAC Nightsave Small","ExNACNS",2,1,"ExNACNS21N",null,"Excess NAC Nightsave Rural","ExNACNR",2,1,"ExNACNR21N",null,"Excess NAC Ruraflex","ExNACRu",2,1,"ExNACRu21N",null,"> 600km and \n≤ 900km","< 500V",31.19,35.869999999999997,null,null,"> 600km and \n≤ 900km","< 500V",15.7,{"$f":"ROUND(AA42 * (1 + VAT), 2)","v":18.059999999999999},null,null,"> 600km and \n≤ 900km","< 500V",21.87,{"$f":"ROUND(AG42 * (1 + VAT), 2)","v":25.15}]
["Excess NAC Nightsave Small","ExNACNS",2,2,"ExNACNS22N",null,"Excess NAC Nightsave Rural","ExNACNR",2,2,"ExNACNR22N",null,"Excess NAC Ruraflex","ExNACRu",2,2,"ExNACRu22N",null,null,"≥ 500V & < 66kV",28.57,32.86,null,null,null,"≥ 500V & ≤ 22kV",14.41,16.57,null,null,null,"≥ 500V & ≤ 22kV",20.09,23.1]
["Excess NAC Nightsave Small","ExNACNS",2,3,"ExNACNS23N",null,"Excess NAC Nightsave Rural","ExNACNR",2,3,"ExNACNR23N",null,"Excess NAC Ruraflex","ExNACRu",2,3,"ExNACRu23N",null,null,"≥ 66kV & ≤ 132kV",32.769999999999996,37.69]
["Excess NAC Nightsave Small","ExNACNS",2,4,"ExNACNS24N",null,"Excess NAC Nightsave Rural","ExNACNR",2,4,"ExNACNR24N",null,"Excess NAC Ruraflex","ExNACRu",2,4,"ExNACRu24N",null,null,"> 132kV*",28.61,32.9]
["Excess NAC Nightsave Small","ExNACNS",3,1,"ExNACNS31N",null,"Excess NAC Nightsave Rural","ExNACNR",3,1,"ExNACNR31N",null,"Excess NAC Ruraflex","ExNACRu",3,1,"ExNACRu31N",null,"> 900km","< 500V",31.26,35.950000000000003,null,null,"> 900km","< 500V",15.74,{"$f":"ROUND(AA46 * (1 + VAT), 2)","v":18.100000000000001},null,null,"> 900km","< 500V",21.96,{"$f":"ROUND(AG46 * (1 + VAT), 2)","v":25.25}]
["Excess NAC Nightsave Small","ExNACNS",3,2,"ExNACNS32N",null,"Excess NAC Nightsave Rural","ExNACNR",3,2,"ExNACNR32N",null,"Excess NAC Ruraflex","ExNACRu",3,2,"ExNACRu32N",null,null,"≥ 500V & < 66kV",28.68,32.979999999999997,null,null,null,"≥ 500V & ≤ 22kV",14.44,16.61,null,null,null,"≥ 500V & ≤ 22kV",20.100000000000001,23.12]
["Excess NAC Nightsave Small","ExNACNS",3,3,"ExNACNS33N",null,"Excess NAC Nightsave Rural","ExNACNR",3,3,"ExNACNR33N",null,"Excess NAC Ruraflex","ExNACRu",3,3,"ExNACRu33N",null,null,"≥ 66kV & ≤ 132kV",32.86,37.79]
["Excess NAC Nightsave Small","ExNACNS",3,4,"ExNACNS34N",null,"Excess NAC Nightsave Rural","ExNACNR",3,4,"ExNACNR34N",null,"Excess NAC Ruraflex","ExNACRu",3,4,"ExNACRu34N",null,null,"> 132kV*",28.7,33.01]
[null,null,null,null,null,null,null,null,null,null,null,null,null,null,null,null,null,null,null,"* 132 kV or Transmission connected"]
[]
[]
[null,null,null,null,null,null,null,null,null,null,null,null,null,null,null,null,null,null,"Excess MEC- Transmission connected generators",null,null,null,null,null,"Excess MEC- Distribution connected Generators"]
[]
[null,null,null,null,null,null,null,null,null,null,null,null,null,null,null,null,null,null,null,"Excess Network capacity charge[R/kW/m]",null,null,null,null,null,"Excess Network capacity charge[R/kW/m]"]
[null,null,null,null,null,null,null,null,null,null,null,null,null,null,null,null,null,null,null,null,"VAT incl",null,null,null,null,null,"VAT incl"]
[null,null,null,null,null,null,null,null,null,null,null,null,null,null,null,null,null,null,"Cape",{"$f":"T58","v":2.4500000000000002},{"$f":"ROUND(T57 * (1 + VAT), 2)","v":2.82},null,null,null,"Voltage "]
[null,null,null,null,null,null,null,null,null,null,null,null,null,null,null,null,null,null,"Karoo",{"$f":"T59","v":2.4500000000000002},2.82,null,null,null,"< 500V",0,{"$f":"ROUND(Z58 * (1 + VAT), 2)","v":0}]
[null,null,null,null,null,null,null,null,null,null,null,null,null,null,null,null,null,null,"Kwazulu-Natal",{"$f":"' TUoS NLA'!J58","v":2.4500000000000002},2.82,null,null,null,"≥ 500V & < 66kV",{"$f":"Z60","v":16.68},{"$f":"ROUND(Z59 * (1 + VAT), 2)","v":19.18}]
[null,null,null,null,null,null,null,null,null,null,null,null,null,null,null,null,null,null,"Vaal",{"$f":"' TUoS NLA'!J59","v":8.16},9.3800000000000008,null,null,null,"≥ 66kV & ≤ 132kV",{"$f":"'DUoS NLA'!J73","v":16.68},{"$f":"ROUND(Z60 * (1 + VAT), 2)","v":19.18}]
[null,null,null,null,null,null,null,null,null,null,null,null,null,null,null,null,null,null,"Waterberg",{"$f":"' TUoS NLA'!J60","v":10.45},12.02]
[null,null,null,null,null,null,null,null,null,null,null,null,null,null,null,null,null,null,"Mpumalanga",{"$f":"' TUoS NLA'!J61","v":9.6999999999999993},11.16]

{"sheet":"Excess NCC Munic","index":31,"n_rows":50,"n_cols":40,"rows_kept":50,"cut":false,"hidden":false,"merged":[[13,36,16,36],[17,36,20,36],[21,36,24,36],[3,36,3,39],[5,38,5,39],[6,36,8,36],[6,38,7,39],[9,36,12,36],[6,32,7,33],[3,18,3,21],[3,23,3,27],[3,29,3,33],[5,20,5,21],[5,26,5,27],[5,32,5,33],[6,18,8,18],[6,20,7,21],[6,24,8,24],[6,26,7,27],[6,30,8,30],[9,18,12,18],[9,24,12,24],[9,30,12,30],[13,18,16,18],[13,24,16,24],[13,30,16,30],[17,18,20,18],[17,24,20,24],[17,30,20,30],[21,18,24,18],[21,24,24,24],[21,30,24,30],[27,29,27,33],[29,20,29,21],[29,26,29,27],[29,32,29,33],[30,18,32,18],[30,20,31,21],[30,24,32,24],[30,26,31,27],[30,30,32,30],[1,17,1,34],[41,18,44,18],[41,24,44,24],[41,30,44,30],[45,18,48,18],[45,24,48,24],[45,30,48,30],[33,18,36,18],[33,24,36,24],[33,30,36,30],[37,18,40,18],[37,24,40,24],[37,30,40,30],[30,32,31,33],[27,18,27,21],[27,23,27,27]]}
[null,null,null,null,null,null,null,null,null,null,null,null,null,null,null,null,null,null,"Back to menu"]
[null,null,null,null,null,null,null,null,null,null,null,null,null,null,null,null,null,"Excess network capacity charges (NCC)   - Non-Local Authority"]
[]
["Municiple",null,null,null,null,null,null,null,null,null,null,null,null,null,null,null,null,null,"Urban - Excess NCC\nMegaflex\n[Local authorities]",null,null,null,null,"Urban - Excess NCC\nNightsave Urban Large\n[Local authorities]",null,null,null,null,null,"Urban - Excess NCC\nMiniflex\n[Local authorities]",null,null,null,null,null,null,"Urban - Excess NCC\nWEPS\n[Local authorities]"]
[]
[null,null,null,null,null,null,null,null,null,null,null,null,null,null,null,null,null,null,null,null,"Excess NCC[R/kVA/m]",null,null,null,null,null,"Excess NCC[R/kVA/m]",null,null,null,null,null,"Excess NCC[R/kVA/m]",null,null,null,null,null,"Excess NCC[R/kVA/m]"]
[null,null,null,null,null,null,null,null,null,null,null,null,null,null,null,null,null,null,"Transmission zone",null,null,null,null,null,"Transmission zone",null,null,null,null,null,"Transmission zone",null,null,null,null,null,"Transmission zone"]
[null,null,null,null,null,null,null,null,null,null,null,null,null,null,null,null,null,null,null,"Voltage",null,null,null,null,null,"Voltage",null,null,null,null,null,"Voltage",null,null,null,null,null,"Voltage"]
["Tariff","Tariff nameBillcode","Tx zone","Voltage","Billcode",null,"Tariff","Tariff nameBillcode","Tx zone","Voltage","Billcode",null,"Tariff","Tariff nameBillcode","Tx zone","Voltage","Billcode",null,null,null,null,"VAT incl",null,null,null,null,null,"VAT incl",null,null,null,null,null,"VAT incl",null,null,null,null,null,"VAT incl"]
["Excess NAC Megaflex","ExNACMe",0,1,{"$f":"B10&C10&D10&IF($A$4=\"Non-municipal\",\"N\",IF($A$4=\"Municiple\",\"Y\",\"error\"))","v":"ExNACMe01Y"},null,"Excess NAC Nightsave Large","ExNACNL",0,1,{"$f":"H10&I10&J10&IF($A$4=\"Non-municipal\",\"N\",IF($A$4=\"Municiple\",\"Y\",\"error\"))","v":"ExNACNL01Y"},null,"Excess NAC Miniflex","ExNACMi",0,1,{"$f":"N10&O10&P10&IF($A$4=\"Non-municipal\",\"N\",IF($A$4=\"Municiple\",\"Y\",\"error\"))","v":"ExNACMi01Y"},null,"≤ 300km","< 500V",30.96,{"$f":"ROUND(U10 * (1 + VAT), 2)","v":35.6},null,null,"≤ 300km","< 500V",30.96,{"$f":"ROUND(AA10 * (1 + VAT), 2)","v":35.6},null,null,"≤ 300km","< 500V",30.94,{"$f":"ROUND(AG10 * (1 + VAT), 2)","v":35.58},null,null,"≤ 300km","< 500V",30.96,{"$f":"ROUND(AM10 * (1 + VAT), 2)","v":35.6}]
["Excess NAC Megaflex","ExNACMe",0,2,{"$f":"B11&C11&D11&IF($A$4=\"Non-municipal\",\"N\",IF($A$4=\"Municiple\",\"Y\",\"error\"))","v":"ExNACMe02Y"},null,"Excess NAC Nightsave Large","ExNACNL",0,2,{"$f":"H11&I11&J11&IF($A$4=\"Non-municipal\",\"N\",IF($A$4=\"Municiple\",\"Y\",\"error\"))","v":"ExNACNL02Y"},null,"Excess NAC Miniflex","ExNACMi",0,2,{"$f":"N11&O11&P11&IF($A$4=\"Non-municipal\",\"N\",IF($A$4=\"Municiple\",\"Y\",\"error\"))","v":"ExNACMi02Y"},null,null,"≥ 500V & < 66kV",28.33,32.58,null,null,null,"≥ 500V & < 66kV",28.33,32.58,null,null,null,"≥ 500V & < 66kV",28.34,32.590000000000003,null,null,null,"≥ 500V & < 66kV",28.33,32.58]
["Excess NAC Megaflex","ExNACMe",0,3,"ExNACMe03Y",null,"Excess NAC Nightsave Large","ExNACNL",0,3,"ExNACNL03Y",null,"Excess NAC Miniflex","ExNACMi",0,3,"ExNACMi03Y",null,null,"≥ 66kV & ≤ 132kV",32.49,37.36,null,null,null,"≥ 66kV & ≤ 132kV",32.49,37.36,null,null,null,"≥ 66kV & ≤ 132kV",32.47,37.340000000000003,null,null,null,"≥ 66kV & ≤ 132kV",32.49,37.36]
["Excess NAC Megaflex","ExNACMe",0,4,"ExNACMe04Y",null,"Excess NAC Nightsave Large","ExNACNL",0,4,"ExNACNL04Y",null,"Excess NAC Miniflex","ExNACMi",0,4,"ExNACMi04Y",null,null,"> 132kV*",28.17,32.4,null,null,null,"> 132kV*",28.17,32.4,null,null,null,"> 132kV*",28.17,32.4,null,null,null,"> 132kV*",28.17,32.4]
["Excess NAC Megaflex","ExNACMe",1,1,"ExNACMe11Y",null,"Excess NAC Nightsave Large","ExNACNL",1,1,"ExNACNL11Y",null,"Excess NAC Miniflex","ExNACMi",1,1,"ExNACMi11Y",null,"> 300km and \n≤ 600km","< 500V",31,35.65,null,null,"> 300km and \n≤ 600km","< 500V",31,35.65,null,null,"> 300km and \n≤ 600km","< 500V",31,35.65,null,null,"> 300km and \n≤ 600km","< 500V",31,35.65]
["Excess NAC Megaflex","ExNACMe",1,2,"ExNACMe12Y",null,"Excess NAC Nightsave Large","ExNACNL",1,2,"ExNACNL12Y",null,"Excess NAC Miniflex","ExNACMi",1,2,"ExNACMi12Y",null,null,"≥ 500V & < 66kV",28.439999999999998,32.71,null,null,null,"≥ 500V & < 66kV",28.439999999999998,32.71,null,null,null,"≥ 500V & < 66kV",28.45,32.72,null,null,null,"≥ 500V & < 66kV",28.439999999999998,32.71]
["Excess NAC Megaflex","ExNACMe",1,3,"ExNACMe13Y",null,"Excess NAC Nightsave Large","ExNACNL",1,3,"ExNACNL13Y",null,"Excess NAC Miniflex","ExNACMi",1,3,"ExNACMi13Y",null,null,"≥ 66kV & ≤ 132kV",32.56,37.44,null,null,null,"≥ 66kV & ≤ 132kV",32.56,37.44,null,null,null,"≥ 66kV & ≤ 132kV",32.549999999999997,37.43,null,null,null,"≥ 66kV & ≤ 132kV",32.56,37.44]
["Excess NAC Megaflex","ExNACMe",1,4,"ExNACMe14Y",null,"Excess NAC Nightsave Large","ExNACNL",1,4,"ExNACNL14Y",null,"Excess NAC Miniflex","ExNACMi",1,4,"ExNACMi14Y",null,null,"> 132kV*",28.28,32.520000000000003,null,null,null,"> 132kV*",28.28,32.520000000000003,null,null,null,"> 132kV*",28.28,32.520000000000003,null,null,null,"> 132kV*",28.28,32.520000000000003]
["Excess NAC Megaflex","ExNACMe",2,1,"ExNACMe21Y",null,"Excess NAC Nightsave Large","ExNACNL",2,1,"ExNACNL21Y",null,"Excess NAC Miniflex","ExNACMi",2,1,"ExNACMi21Y",null,"> 600km and \n≤ 900km","< 500V",31.14,35.81,null,null,"> 600km and \n≤ 900km","< 500V",31.14,35.81,null,null,"> 600km and \n≤ 900km","< 500V",31.16,35.83,null,null,"> 600km and \n≤ 900km","< 500V",31.14,35.81]
["Excess NAC Megaflex","ExNACMe",2,2,"ExNACMe22Y",null,"Excess NAC Nightsave Large","ExNACNL",2,2,"ExNACNL22Y",null,"Excess NAC Miniflex","ExNACMi",2,2,"ExNACMi22Y",null,null,"≥ 500V & < 66kV",28.5,32.78,null,null,null,"≥ 500V & < 66kV",28.5,32.78,null,null,null,"≥ 500V & < 66kV",28.52,32.799999999999997,null,null,null,"≥ 500V & < 66kV",28.5,32.78]
["Excess NAC Megaflex","ExNACMe",2,3,"ExNACMe23Y",null,"Excess NAC Nightsave Large","ExNACNL",2,3,"ExNACNL23Y",null,"Excess NAC Miniflex","ExNACMi",2,3,"ExNACMi23Y",null,null,"≥ 66kV & ≤ 132kV",32.630000000000003,37.520000000000003,null,null,null,"≥ 66kV & ≤ 132kV",32.630000000000003,37.520000000000003,null,null,null,"≥ 66kV & ≤ 132kV",32.629999999999995,37.520000000000003,null,null,null,"≥ 66kV & ≤ 132kV",32.630000000000003,37.520000000000003]
["Excess NAC Megaflex","ExNACMe",2,4,"ExNACMe24Y",null,"Excess NAC Nightsave Large","ExNACNL",2,4,"ExNACNL24Y",null,"Excess NAC Miniflex","ExNACMi",2,4,"ExNACMi24Y",null,null,"> 132kV*",28.44,32.71,null,null,null,"> 132kV*",28.44,32.71,null,null,null,"> 132kV*",28.44,32.71,null,null,null,"> 132kV*",28.44,32.71]
["Excess NAC Megaflex","ExNACMe",3,1,"ExNACMe31Y",null,"Excess NAC Nightsave Large","ExNACNL",3,1,"ExNACNL31Y",null,"Excess NAC Miniflex","ExNACMi",3,1,"ExNACMi31Y",null,"> 900km","< 500V",31.19,35.869999999999997,null,null,"> 900km","< 500V",31.19,35.869999999999997,null,null,"> 900km","< 500V",31.18,35.86,null,null,"> 900km","< 500V",31.19,35.869999999999997]
["Excess NAC Megaflex","ExNACMe",3,2,"ExNACMe32Y",null,"Excess NAC Nightsave Large","ExNACNL",3,2,"ExNACNL32Y",null,"Excess NAC Miniflex","ExNACMi",3,2,"ExNACMi32Y",null,null,"≥ 500V & < 66kV",28.61,32.9,null,null,null,"≥ 500V & < 66kV",28.61,32.9,null,null,null,"≥ 500V & < 66kV",28.64,32.94,null,null,null,"≥ 500V & < 66kV",28.61,32.9]
["Excess NAC Megaflex","ExNACMe",3,3,"ExNACMe33Y",null,"Excess NAC Nightsave Large","ExNACNL",3,3,"ExNACNL33Y",null,"Excess NAC Miniflex","ExNACMi",3,3,"ExNACMi33Y",null,null,"≥ 66kV & ≤ 132kV",32.71,37.619999999999997,null,null,null,"≥ 66kV & ≤ 132kV",32.71,37.619999999999997,null,null,null,"≥ 66kV & ≤ 132kV",32.68,37.58,null,null,null,"≥ 66kV & ≤ 132kV",32.71,37.619999999999997]
["Excess NAC Megaflex","ExNACMe",3,4,"ExNACMe34Y",null,"Excess NAC Nightsave Large","ExNACNL",3,4,"ExNACNL34Y",null,"Excess NAC Miniflex","ExNACMi",3,4,"ExNACMi34Y",null,null,"> 132kV*",28.520000000000003,32.799999999999997,null,null,null,"> 132kV*",28.520000000000003,32.799999999999997,null,null,null,"> 132kV*",28.520000000000003,32.799999999999997,null,null,null,"> 132kV*",28.520000000000003,32.799999999999997]
[null,null,null,null,null,null,null,null,null,null,null,null,null,null,null,null,null,null,null,"* 132 kV or Transmission connected",null,null,null,null,null,"* 132 kV or Transmission connected",null,null,null,null,null,"* 132 kV or Transmission connected",null,null,null,null,null,"* 132 kV or Transmission connected"]
[]
[null,null,null,null,null,null,null,null,null,null,null,null,null,null,null,null,null,null,"Urban - Excess NCC\nNightsave Urban Small\n[Local authorities]",null,null,null,null,"Rural - Excess NCC\nNightsave Rural\n[Local authorities]",null,null,null,null,null,"Rural - Excess NCC\nRuraflex\n[Local authorities]"]
[]
[null,null,null,null,null,null,null,null,null,null,null,null,null,null,null,null,null,null,null,null,"Excess NCC[R/kVA/m]",null,null,null,null,null,"Excess NCC[R/kVA/m]",null,null,null,null,null,"Excess NCC[R/kVA/m]"]
[null,null,null,null,null,null,null,null,null,null,null,null,null,null,null,null,null,null,"Transmission zone",null,null,null,null,null,"Transmission zone",null,null,null,null,null,"Transmission zone"]
[null,null,null,null,null,null,null,null,null,null,null,null,null,null,null,null,null,null,null,"Voltage",null,null,null,null,null,"Voltage",null,null,null,null,null,"Voltage"]
["Tariff","Tariff nameBillcode","Tx zone","Voltage","Billcode",null,"Tariff","Tariff nameBillcode","Tx zone","Voltage","Billcode",null,"Tariff","Tariff nameBillcode","Tx zone","Voltage","Billcode",null,null,null,null,"VAT incl",null,null,null,null,null,"VAT incl",null,null,null,null,null,"VAT incl"]
["Excess NAC Nightsave Small","ExNACNS",0,1,{"$f":"B34&C34&D34&IF($A$4=\"Non-municipal\",\"N\",IF($A$4=\"Municiple\",\"Y\",\"error\"))","v":"ExNACNS01Y"},null,"Excess NAC Nightsave Rural","ExNACNR",0,1,{"$f":"H34&I34&J34&IF($A$4=\"Non-municipal\",\"N\",IF($A$4=\"Municiple\",\"Y\",\"error\"))","v":"ExNACNR01Y"},null,"Excess NAC Ruraflex","ExNACRu",0,1,{"$f":"N34&O34&P34&IF($A$4=\"Non-municipal\",\"N\",IF($A$4=\"Municiple\",\"Y\",\"error\"))","v":"ExNACRu01Y"},null,"≤ 300km","< 500V",30.96,{"$f":"ROUND(U34 * (1 + VAT), 2)","v":35.6},null,null,"≤ 300km","< 500V",15.66,{"$f":"ROUND(AA34 * (1 + VAT), 2)","v":18.010000000000002},null,null,"≤ 300km","< 500V",21.85,{"$f":"ROUND(AG34 * (1 + VAT), 2)","v":25.13}]
["Excess NAC Nightsave Small","ExNACNS",0,2,{"$f":"B35&C35&D35&IF($A$4=\"Non-municipal\",\"N\",IF($A$4=\"Municiple\",\"Y\",\"error\"))","v":"ExNACNS02Y"},null,"Excess NAC Nightsave Rural","ExNACNR",0,2,{"$f":"H35&I35&J35&IF($A$4=\"Non-municipal\",\"N\",IF($A$4=\"Municiple\",\"Y\",\"error\"))","v":"ExNACNR02Y"},null,"Excess NAC Ruraflex","ExNACRu",0,2,{"$f":"N35&O35&P35&IF($A$4=\"Non-municipal\",\"N\",IF($A$4=\"Municiple\",\"Y\",\"error\"))","v":"ExNACRu02Y"},null,null,"≥ 500V & < 66kV",28.33,32.58,null,null,null,"≥ 500V & ≤ 22kV",14.38,16.54,null,null,null,"≥ 500V & ≤ 22kV",20.05,23.06]
["Excess NAC Nightsave Small","ExNACNS",0,3,"ExNACNS03Y",null,"Excess NAC Nightsave Rural","ExNACNR",0,3,"ExNACNR03Y",null,"Excess NAC Ruraflex","ExNACRu",0,3,"ExNACRu03Y",null,null,"≥ 66kV & ≤ 132kV",32.49,37.36]
["Excess NAC Nightsave Small","ExNACNS",0,4,"ExNACNS04Y",null,"Excess NAC Nightsave Rural","ExNACNR",0,4,"ExNACNR04Y",null,"Excess NAC Ruraflex","ExNACRu",0,4,"ExNACRu04Y",null,null,"> 132kV*",28.17,32.4]
["Excess NAC Nightsave Small","ExNACNS",1,1,"ExNACNS11Y",null,"Excess NAC Nightsave Rural","ExNACNR",1,1,"ExNACNR11Y",null,"Excess NAC Ruraflex","ExNACRu",1,1,"ExNACRu11Y",null,"> 300km and \n≤ 600km","< 500V",31,35.65,null,null,"> 300km and \n≤ 600km","< 500V",15.69,{"$f":"ROUND(AA38 * (1 + VAT), 2)","v":18.04},null,null,"> 300km and \n≤ 600km","< 500V",21.94,{"$f":"ROUND(AG38 * (1 + VAT), 2)","v":25.23}]
["Excess NAC Nightsave Small","ExNACNS",1,2,"ExNACNS12Y",null,"Excess NAC Nightsave Rural","ExNACNR",1,2,"ExNACNR12Y",null,"Excess NAC Ruraflex","ExNACRu",1,2,"ExNACRu12Y",null,null,"≥ 500V & < 66kV",28.439999999999998,32.71,null,null,null,"≥ 500V & ≤ 22kV",14.44,16.61,null,null,null,"≥ 500V & ≤ 22kV",20.16,23.18]
["Excess NAC Nightsave Small","ExNACNS",1,3,"ExNACNS13Y",null,"Excess NAC Nightsave Rural","ExNACNR",1,3,"ExNACNR13Y",null,"Excess NAC Ruraflex","ExNACRu",1,3,"ExNACRu13Y",null,null,"≥ 66kV & ≤ 132kV",32.56,37.44]
["Excess NAC Nightsave Small","ExNACNS",1,4,"ExNACNS14Y",null,"Excess NAC Nightsave Rural","ExNACNR",1,4,"ExNACNR14Y",null,"Excess NAC Ruraflex","ExNACRu",1,4,"ExNACRu14Y",null,null,"> 132kV*",28.28,32.520000000000003]
["Excess NAC Nightsave Small","ExNACNS",2,1,"ExNACNS21Y",null,"Excess NAC Nightsave Rural","ExNACNR",2,1,"ExNACNR21Y",null,"Excess NAC Ruraflex","ExNACRu",2,1,"ExNACRu21Y",null,"> 600km and \n≤ 900km","< 500V",31.14,35.81,null,null,"> 600km and \n≤ 900km","< 500V",15.84,{"$f":"ROUND(AA42 * (1 + VAT), 2)","v":18.22},null,null,"> 600km and \n≤ 900km","< 500V",22.06,{"$f":"ROUND(AG42 * (1 + VAT), 2)","v":25.37}]
["Excess NAC Nightsave Small","ExNACNS",2,2,"ExNACNS22Y",null,"Excess NAC Nightsave Rural","ExNACNR",2,2,"ExNACNR22Y",null,"Excess NAC Ruraflex","ExNACRu",2,2,"ExNACRu22Y",null,null,"≥ 500V & < 66kV",28.5,32.78,null,null,null,"≥ 500V & ≤ 22kV",14.53,16.71,null,null,null,"≥ 500V & ≤ 22kV",20.260000000000002,23.3]
["Excess NAC Nightsave Small","ExNACNS",2,3,"ExNACNS23Y",null,"Excess NAC Nightsave Rural","ExNACNR",2,3,"ExNACNR23Y",null,"Excess NAC Ruraflex","ExNACRu",2,3,"ExNACRu23Y",null,null,"≥ 66kV & ≤ 132kV",32.630000000000003,37.520000000000003]
["Excess NAC Nightsave Small","ExNACNS",2,4,"ExNACNS24Y",null,"Excess NAC Nightsave Rural","ExNACNR",2,4,"ExNACNR24Y",null,"Excess NAC Ruraflex","ExNACRu",2,4,"ExNACRu24Y",null,null,"> 132kV*",28.44,32.71]
["Excess NAC Nightsave Small","ExNACNS",3,1,"ExNACNS31Y",null,"Excess NAC Nightsave Rural","ExNACNR",3,1,"ExNACNR31Y",null,"Excess NAC Ruraflex","ExNACRu",3,1,"ExNACRu31Y",null,"> 900km","< 500V",31.19,35.869999999999997,null,null,"> 900km","< 500V",15.87,{"$f":"ROUND(AA46 * (1 + VAT), 2)","v":18.25},null,null,"> 900km","< 500V",22.13,{"$f":"ROUND(AG46 * (1 + VAT), 2)","v":25.45}]
["Excess NAC Nightsave Small","ExNACNS",3,2,"ExNACNS32Y",null,"Excess NAC Nightsave Rural","ExNACNR",3,2,"ExNACNR32Y",null,"Excess NAC Ruraflex","ExNACRu",3,2,"ExNACRu32Y",null,null,"≥ 500V & < 66kV",28.61,32.9,null,null,null,"≥ 500V & ≤ 22kV",14.54,16.72,null,null,null,"≥ 500V & ≤ 22kV",20.27,23.31]
["Excess NAC Nightsave Small","ExNACNS",3,3,"ExNACNS33Y",null,"Excess NAC Nightsave Rural","ExNACNR",3,3,"ExNACNR33Y",null,"Excess NAC Ruraflex","ExNACRu",3,3,"ExNACRu33Y",null,null,"≥ 66kV & ≤ 132kV",32.71,37.619999999999997]
["Excess NAC Nightsave Small","ExNACNS",3,4,"ExNACNS34Y",null,"Excess NAC Nightsave Rural","ExNACNR",3,4,"ExNACNR34Y",null,"Excess NAC Ruraflex","ExNACRu",3,4,"ExNACRu34Y",null,null,"> 132kV*",28.520000000000003,32.799999999999997]
[null,null,null,null,null,null,null,null,null,null,null,null,null,null,null,null,null,null,null,"* 132 kV or Transmission connected"]

{"sheet":"Gen Reconciliatons","index":32,"n_rows":30,"n_cols":9,"rows_kept":30,"cut":false,"hidden":false,"merged":[[1,1,1,9],[3,2,3,4],[20,2,20,4],[22,2,25,2],[26,2,29,2],[5,2,8,2],[9,2,11,2],[12,2,14,2],[15,2,17,2],[3,6,3,8],[5,6,8,6],[9,6,11,6],[12,6,14,6],[15,6,17,6]]}
[]
[null,"Generator reconciliations"]
[]
[null,null,"Gen-wheeling tariff",null,null,null,"Gen-purchase tariff"]
[null,null,"Tariff name","Tariff rate","Source",null,"Tariff name","Tariff rate","Source"]
[null,null,"Gen-wheeling non Munic urban","Energy:                         ","WEPS energy rate excluding losses ",null,"Gen-purchase- urban","Energy:                         ","WEPS energy rate excluding losses "]
[null,null,null,"Affordability subsidy:     ","same as WEPS",null,null,"Affordability subsidy:     ","same as WEPS"]
[null,null,null,"Admin charge:               ","same as WEPS",null,null,"Admin charge:               ","same as WEPS"]
[null,null,null,"Other components:        ","not applicable",null,null,"Other components:        ","not applicable"]
[null,null,"Gen-wheeling non Munic rural","Energy:                         ","WEPS energy rate excluding losses ",null,"Gen-purchase-rural","Energy:                         ","WEPS energy rate excluding losses "]
[null,null,null,"Admin charge:               ","same as Ruraflex",null,null,"Admin charge:               ","same as Ruraflex"]
[null,null,null,"Other components:        ","not applicable",null,null,"Other components:        ","not applicable"]
[null,null,"Gen-wheeling Munic urban","Energy (Local):                         ","WEPS energy rate excluding losses (Local)",null,"Gen-purchase Munic urban","Energy:                         ","WEPS energy rate excluding losses(Local)"]
[null,null,null,"Admin charge:               ","same as WEPS (local)",null,null,"Admin charge:               ","same as WEPS (Local)"]
[null,null,null,"Other components:        ","not applicable",null,null,"Other components:        ","not applicable"]
[null,null,"Gen-wheeling Munic rural","Energy (Local):                         ","WEPS energy rate excluding losses (Local)",null,"Gen-purchase Munic rural","Energy:                         ","WEPS energy rate excluding losses(Local) "]
[null,null,null,"Admin charge:               ","same as same as Ruraflex (local)",null,null,"Admin charge:               ","same as Ruraflex (Local)"]
[null,null,null,"Other components:        ","not applicable",null,null,"Other components:        ","not applicable"]
[]
[]
[null,null,"Gen-offset tariff"]
[null,null,"Tariff name","Tariff rate","Source"]
[null,null,"Gen-offset urban","Energy:                         ","WEPS energy rate including losses (per Tx and voltage zone)"]
[null,null,null,"Affordability subsidy:     ","same as WEPS"]
[null,null,null,"Admin charge:               ","same as WEPS"]
[null,null,null,"Other components:        ","not applicable"]
[null,null,"Gen-offset rural","Energy:                         ","Ruraflex energy rate  (per Tx and voltage zone)"]
[null,null,null,"Affordability subsidy:     ","same as WEPS"]
[null,null,null,"Admin charge:               ","same as WEPS"]
[null,null,null,"Other components:        ","not applicable"]