{"text_format":"1","workbook":"xlsx","n_sheets":38,"sheets":["Menu","WEPS inc","WEPS Munic inc","Nightsave Large inc","Nightsave Large Munic inc","Nightsave Small inc","Nightsave Small Munic inc","Megaflex inc","Megaflex Munic inc ","Genflex Urban inc","Miniflex inc","Miniflex Munic inc ","Businessrate inc","Businessrate Munic inc","Public Lighting inc","Public Lighting Munic inc","Homepower inc","Homepower Munic inc","Homelight inc","Nightsave Rural inc","Nightsave Rural Munic inc ","Ruraflex inc","Ruraflex Munic inc","Genflex Rural inc","Landrate inc","Landrate Munic inc","Homeflex inc","TOuS Original","TOuS","DUoS","Loss Factors","Excess NAC","Excess NAC Munic","Miniflex CPD","Nightsave Small CPD","Ruraflex CPD","Nightsave Rural CPD","Env levy"],"not_rendered":{"charts":0,"images":0,"macros":0,"external_links":6,"defined_names":386,"comments":0,"pivot_tables":0},"unopened":[],"bounds":{"document_bytes":16777216,"sheet_cells":100000,"rows_first":2000,"rows_last":500,"rows_between":2000,"halvings":0,"cell_chars":16384,"cell_head_chars":4096},"cells_cut":0,"cells_raw":0,"read":"whole","date_system":"1900"}

{"sheet":"Menu","index":0,"n_rows":34,"n_cols":10,"rows_kept":34,"cut":false,"hidden":false,"merged":[[1,5,1,10],[7,32,7,35],[8,32,8,35],[12,35,12,36],[3,32,3,38],[6,32,6,35],[5,7,5,9],[3,5,3,10]]}
[]
[null,null,null,null,null,"This file contains the excel tables of the rates contained in the published Schedule fo Standard Prices for Eskom tariffs."]
[]
[null,null,null,null,null,"\n2015/16 SCHEDULE OF STANDARD PRICES FOR ESKOM TARIFFS \n\n1 April 2015 to 31 March 2016 for Non-Local Authority supplies, and\n1 July 2015 to 30 June 2016 for Local Authority supplies. "]
[]
[null,null,null,null,null,null,null,"Click on the arrow to select the tariff"]
[null,null,null,null,null,null,null,"Non-local authority",null,"Local Authority"]
[null,null,null,null,null,"ê","WEPS","u",null,"u"]
[null,null,null,null,null,"ê","Megaflex","u",null,"u"]
[null,null,null,null,null,"ê","Nightsave large Urban","u",null,"u"]
[null,null,null,null,null,"ê","Miniflex","u",null,"u"]
[null,null,null,null,null,"ê","Nightsave small ","u",null,"u"]
[null,null,null,null,null,"ê","Businessrate","u",null,"u"]
[null,null,null,null,null,"ê","Transflex 1","u",null,"n/a"]
[null,null,null,null,null,"ê","Transflex 2","u",null,"n/a"]
[null,null,null,null,null,"ê","Public lighting","u",null,"u"]
[null,null,null,null,null,"ê","Ruraflex","u",null,"u"]
[null,null,null,null,null,"ê","Nightsave rural","u",null,"u"]
[null,null,null,null,null,"ê","Landrate tariffs","u",null,"u"]
[null,null,null,null,null,"ê","Homepower tariffs","u",null,"u"]
[null,null,null,null,null,"ê","Homelight tariffs","u",null,"n/a"]
[null,null,null,null,null,"ê","Excess NAC charges","u",null,"u"]
[null,null,null,null,null,"ê","Loss factors","u",null,"u"]
[null,null,null,null,null,"ê","Transmission use of system charges","u",null,"n/a"]
[null,null,null,null,null,"ê","Distribution use of system charges","u",null,"n/a"]
[null,null,null,null,null,"ê","Genflex Urban","u",null,"n/a"]
[null,null,null,null,null,"ê","Genflex Rural","u",null,"n/a"]
[null,null,null,null,null,"ê","Muniflex Urban","n/a",null,"u"]
[null,null,null,null,null,"ê","Muniflex Rural","n/a",null,"u"]
[null,null,null,null,null,"ê","Homeflex","u",null,"n/a"]
[null,null,null,null,null,"ê","Miniflex CPDP","u","u","n/a"]
[null,null,null,null,null,"ê","Nightsave Small CPDP","u","u","n/a"]
[null,null,null,null,null,"ê","Ruraflex CPDP","u","u","n/a"]
[null,null,null,null,null,"ê","Nightsave Rural CPDP","u","u","n/a"]

{"sheet":"WEPS inc","index":1,"n_rows":61,"n_cols":23,"rows_kept":61,"cut":false,"hidden":false,"merged":[[3,21,5,22],[11,7,14,7],[1,6,1,16],[1,17,1,22],[3,9,3,20],[4,7,6,7],[4,9,4,14],[4,15,4,20],[5,9,5,10],[5,11,5,12],[5,13,5,14],[5,15,5,16],[5,17,5,18],[5,19,5,20],[7,7,10,7],[29,7,29,8],[29,16,29,17],[15,7,18,7],[19,7,22,7],[24,7,24,14],[25,7,26,8],[25,9,26,10],[25,11,26,12],[25,13,26,14],[26,18,26,19],[27,7,27,8],[27,16,27,17],[28,7,28,8],[28,16,28,17],[30,7,30,8],[30,16,30,17],[31,7,31,8],[31,16,31,17],[33,7,33,8],[33,9,34,10],[33,11,34,12],[33,16,33,19],[50,7,50,18],[35,7,35,8],[35,16,35,17],[35,18,35,19],[36,7,36,8],[37,7,37,8],[38,7,38,8],[39,7,39,8],[40,7,40,8],[43,7,43,8],[43,9,44,10],[45,9,45,10],[51,7,51,12],[51,13,51,18],[52,7,52,8],[52,9,52,10],[52,11,52,12],[52,13,52,14],[52,15,52,16],[52,17,52,18],[56,7,56,18],[57,7,57,12],[57,13,57,18],[58,7,58,8],[58,9,58,10],[58,11,58,12],[58,13,58,14],[58,15,58,16],[58,17,58,18]]}
[null,null,null,null,null,null,"Back to menu"]
["Non-municipal",null,null,null,null,null,"WEPS",null,null,null,null,null,null,null,null,null,null,"Non-local authority"]
[]
[null,null,null,null,null,null,null,null,null,"Active energy charge [c/kWh]",null,null,null,null,null,null,null,null,null,null,null,"Transmission network charges [R/kVA/m]"]
[null,null,null,null,null,null,null,"Transmission zone",null,"High demand season [Jun - Aug]",null,null,null,null,null,"Low demand season [Sep - May]"]
[null,null,null,null,null,null,null,null,"Voltage","Peak",null,"Standard",null,"Off Peak",null,"Peak",null,"Standard",null,"Off Peak"]
["Tariff","Tariff nameBillcode","Tx zone","Voltage","Billcode",null,null,null,null,null,"VAT incl",null,"VAT incl",null,"VAT incl",null,"VAT incl",null,"VAT incl",null,"VAT incl",null,"VAT incl"]
["WEPS","We",0,1,{"$f":"B8&C8&D8&IF($A$2=\"Non-municipal\",\"N\",IF($A$2=\"Municiple\",\"Y\",\"error\"))","v":"We01N"},null,null,"≤ 300km","< 500V",248.94,{"$f":"ROUND(J8 * (1 + VAT), 2)","v":283.79000000000002},75.739999999999995,{"$f":"ROUND(L8 * (1 + VAT), 2)","v":86.34},41.35,{"$f":"ROUND(N8 * (1 + VAT), 2)","v":47.14},81.52,{"$f":"ROUND(P8 * (1 + VAT), 2)","v":92.93},56.25,{"$f":"ROUND(R8 * (1 + VAT), 2)","v":64.13},35.86,{"$f":"ROUND(T8 * (1 + VAT), 2)","v":40.880000000000003},7.12,{"$f":"ROUND(V8 * (1 + VAT), 2)","v":8.1199999999999992}]
["WEPS","We",0,2,"We02N",null,null,null,"≥ 500V & < 66kV",245.03,{"$f":"ROUND(J9 * (1 + VAT), 2)","v":279.33},74.23,84.62,40.31,45.95,79.930000000000007,91.12,55.02,62.72,34.9,39.79,6.51,7.42]
["WEPS","We",0,3,"We03N",null,null,null,"≥ 66kV & ≤ 132kV",237.28,270.5,71.87,81.93,39.04,44.51,77.41,88.25,53.27,60.73,33.799999999999997,38.53,6.34,7.23]
["WEPS","We",0,4,"We04N",null,null,null,"> 132kV*",223.63,254.94,67.739999999999995,77.22,36.79,41.94,72.959999999999994,83.17,50.2,57.23,31.86,36.32,8.01,9.1300000000000008]
["WEPS","We",1,1,"We11N",null,null,"> 300km and \n≤ 600km","< 500V",250.97,286.11,76.040000000000006,86.69,41.29,47.07,81.87,93.33,56.36,64.25,35.76,40.770000000000003,7.18,8.19]
["WEPS","We",1,2,"We12N",null,null,null,"≥ 500V & < 66kV",247.48,282.13,74.97,85.47,40.71,46.41,80.739999999999995,92.04,55.56,63.34,35.25,40.19,6.57,7.49]
["WEPS","We",1,3,"We13N",null,null,null,"≥ 66kV & ≤ 132kV",239.61,273.16000000000003,72.58,82.74,39.409999999999997,44.93,78.16,89.1,53.79,61.32,34.119999999999997,38.9,6.39,7.28]
["WEPS","We",1,4,"We14N",null,null,null,"> 132kV*",225.86,257.48,68.430000000000007,78.010000000000005,37.14,42.34,73.67,83.98,50.7,57.8,32.159999999999997,36.659999999999997,8.09,9.2200000000000006]
["WEPS","We",2,1,"We21N",null,null,"> 600km and \n≤ 900km","< 500V",253.47,288.95999999999998,76.78,87.53,41.68,47.52,82.69,94.27,56.91,64.88,36.090000000000003,41.14,7.27,8.2899999999999991]
["WEPS","We",2,2,"We22N",null,null,null,"≥ 500V & < 66kV",249.96,284.95,75.73,86.33,41.12,46.88,81.540000000000006,92.96,56.12,63.98,35.6,40.58,6.63,7.56]
["WEPS","We",2,3,"We23N",null,null,null,"≥ 66kV & ≤ 132kV",242.05,275.94,73.33,83.6,39.81,45.38,78.95,90,54.34,61.95,34.47,39.299999999999997,6.43,7.33]
["WEPS","We",2,4,"We24N",null,null,null,"> 132kV*",228.14,260.08,69.099999999999994,78.77,37.54,42.8,74.42,84.84,51.22,58.39,32.5,37.049999999999997,8.1999999999999993,9.35]
["WEPS","We",3,1,"We31N",null,null,"> 900km","< 500V",256.02,291.86,77.58,88.44,42.12,48.02,83.53,95.22,57.48,65.53,36.479999999999997,41.59,7.29,8.31]
["WEPS","We",3,2,"We32N",null,null,null,"≥ 500V & < 66kV",252.45,287.79000000000002,76.47,87.18,41.51,47.32,82.34,93.87,56.66,64.59,35.950000000000003,40.98,6.71,7.65]
["WEPS","We",3,3,"We33N",null,null,null,"≥ 66kV & ≤ 132kV",244.48,278.70999999999998,74.06,84.43,40.21,45.84,79.739999999999995,90.9,54.89,62.57,34.82,39.69,6.48,7.39]
["WEPS","We",3,4,"We34N",null,null,null,"> 132kV*",230.37,262.62,69.819999999999993,79.59,37.93,43.24,75.19,85.72,51.76,59.01,32.86,37.46,8.26,9.42]
[null,null,null,null,null,null,null,null,"* 132 kV or Transmission connected"]
[null,null,null,null,null,null,null,"Distribution network charges"]
[null,null,null,null,null,null,null,null,null,"Network capacity charge [R/kVA/m]",null,"Network demand charge [R/kVA/m]",null,"Urban low voltage subsidy charge [R/kVA/m]"]
[null,null,null,null,null,null,null,null,null,null,null,null,null,null,null,null,null,null,"Ancillary service charge [c/kWh]"]
["Tariff","Tariff nameBillcode","Tx zone","Voltage","Billcode",null,null,"Voltage",null,null,"VAT incl",null,"VAT incl",null,"VAT incl",null,"Voltage",null,null,"VAT incl"]
["WEPS","We",0,1,"We01N",null,null,"< 500V",null,14.15,{"$f":"ROUND(J29 * (1 + VAT), 2)","v":16.13},26.83,{"$f":"ROUND(L29 * (1 + VAT), 2)","v":30.59},0,{"$f":"ROUND(N29 * (1 + VAT), 2)","v":0},null,"< 500V",null,0.33,{"$f":"ROUND(S29 * (1 + VAT), 2)","v":0.38}]
["WEPS","We",0,2,"We02N",null,null,"≥ 500V & < 66kV",null,12.98,{"$f":"ROUND(J30 * (1 + VAT), 2)","v":14.8},24.62,{"$f":"ROUND(L30 * (1 + VAT), 2)","v":28.07},0,{"$f":"ROUND(N30 * (1 + VAT), 2)","v":0},null,"≥ 500V & < 66kV",null,0.32,{"$f":"ROUND(S30 * (1 + VAT), 2)","v":0.36}]
["WEPS","We",0,3,"We03N",null,null,"≥ 66kV & ≤ 132kV",null,4.63,{"$f":"ROUND(J31 * (1 + VAT), 2)","v":5.28},8.58,{"$f":"ROUND(L31 * (1 + VAT), 2)","v":9.7799999999999994},11.43,{"$f":"ROUND(N31 * (1 + VAT), 2)","v":13.03},null,"≥ 66kV & ≤ 132kV",null,0.3,{"$f":"ROUND(S31 * (1 + VAT), 2)","v":0.34}]
["WEPS","We",0,4,"We04N",null,null,"> 132kV / Transmission connected",null,0,{"$f":"ROUND(J32 * (1 + VAT), 2)","v":0},0,{"$f":"ROUND(L32 * (1 + VAT), 2)","v":0},11.43,{"$f":"ROUND(N32 * (1 + VAT), 2)","v":13.03},null,"> 132kV / Transmission connected",null,0.28000000000000003,{"$f":"ROUND(S32 * (1 + VAT), 2)","v":0.32}]
[]
[null,null,null,null,null,null,null,"Customer categories",null,"Service charge  [R/account/day]",null,"Administration charge  [R/POD/day]",null,null,null,null,"Reactive energy charge  [c/kVArh]"]
[]
["Tariff","Tariff nameBillcode","Tx zone","Voltage","Billcode",null,null,null,null,null,"VAT incl",null,"VAT incl",null,null,null,"High season",null,"Low season"]
["WEPS","We",0,1,"We01N",null,null,"≤ 100 kVA",null,11.55,{"$f":"ROUND(J37 * (1 + VAT), 2)","v":13.17},2.54,{"$f":"ROUND(L37 * (1 + VAT), 2)","v":2.9},null,null,null,null,"VAT incl",null,"VAT incl"]
["WEPS","We",0,1,"We01N",null,null,"> 100 kVA & ≤ 500 kVA",null,52.8,{"$f":"ROUND(J38 * (1 + VAT), 2)","v":60.19},14.8,{"$f":"ROUND(L38 * (1 + VAT), 2)","v":16.87},null,null,null,11.44,{"$f":"ROUND(Q38 * (1 + VAT), 2)","v":13.04},0,{"$f":"ROUND(S38 * (1 + VAT), 2)","v":0}]
["WEPS","We",0,1,"We01N",null,null,"> 500 kVA & ≤ 1 MVA",null,162.47999999999999,{"$f":"ROUND(J39 * (1 + VAT), 2)","v":185.23},29.41,{"$f":"ROUND(L39 * (1 + VAT), 2)","v":33.53}]
["WEPS","We",0,1,"We01N",null,null,"> 1 MVA",null,162.47999999999999,{"$f":"ROUND(J40 * (1 + VAT), 2)","v":185.23},73.23,{"$f":"ROUND(L40 * (1 + VAT), 2)","v":83.48}]
["WEPS","We",0,1,"We01N",null,null,"Key customers",null,3183.88,{"$f":"ROUND(J41 * (1 + VAT), 2)","v":3629.62},101.68,{"$f":"ROUND(L41 * (1 + VAT), 2)","v":115.92}]
[]
[]
[null,null,null,null,null,null,null,"Electrification and rural network subsidy charge [c/kWh]",null,"Affordability subsidy charge [c/kWh] \nOnly payable by non-local authority tariffs"]
[]
[null,null,null,null,null,null,null,"All seasons",null,"All seasons"]
["Tariff","Tariff nameBillcode","Tx zone","Voltage","Billcode",null,null,null,"VAT incl",null,"VAT incl"]
["WEPS","We",0,1,"We01N",null,null,6.33,{"$f":"ROUND(H48 * (1 + VAT), 2)","v":7.22},2.44,{"$f":"ROUND(J48 * (1 + VAT), 2)","v":2.78}]
[]
[]
[null,null,null,null,null,null,null,"Active energy charge excluding losses   [c/kWh]"]
[null,null,null,null,null,null,null,"High demand season [Jun - Aug]",null,null,null,null,null,"Low demand season [Sep - May]"]
[null,null,null,null,null,null,null,"Peak",null,"Standard",null,"Off Peak",null,"Peak",null,"Standard",null,"Off Peak"]
["Tariff","Tariff nameBillcode","Tx zone","Voltage","Billcode",null,null,null,"VAT incl",null,"VAT incl",null,"VAT incl",null,"VAT incl",null,"VAT incl",null,"VAT incl"]
["WEPS","We",0,1,"We01N",null,null,{"$f":"ROUND(J11/'Loss Factors'!$T$6, 2)","v":221.26},{"$f":"ROUND(H55 * (1 + VAT), 2)","v":252.24},{"$f":"ROUND(L11/'Loss Factors'!$T$6, 2)","v":67.02},{"$f":"ROUND(J55 * (1 + VAT), 2)","v":76.400000000000006},{"$f":"ROUND(N11/'Loss Factors'!$T$6, 2)","v":36.4},{"$f":"ROUND(L55 * (1 + VAT), 2)","v":41.5},{"$f":"ROUND(P11/'Loss Factors'!$T$6, 2)","v":72.19},{"$f":"ROUND(N55 * (1 + VAT), 2)","v":82.3},{"$f":"ROUND(R11/'Loss Factors'!$T$6, 2)","v":49.67},{"$f":"ROUND(P55 * (1 + VAT), 2)","v":56.62},{"$f":"ROUND(T11/'Loss Factors'!$T$6, 2)","v":31.52},{"$f":"ROUND(R55 * (1 + VAT), 2)","v":35.93}]
[]
[null,null,null,null,null,null,null,"Active energy charge excluding losses and enviromental levy   [c/kWh]"]
[null,null,null,null,null,null,null,"High demand season [Jun - Aug]",null,null,null,null,null,"Low demand season [Sep - May]"]
[null,null,null,null,null,null,null,"Peak",null,"Standard",null,"Off Peak",null,"Peak",null,"Standard",null,"Off Peak"]
["Tariff","Tariff nameBillcode","Tx zone","Voltage","Billcode",null,null,null,"VAT incl",null,"VAT incl",null,"VAT incl",null,"VAT incl",null,"VAT incl",null,"VAT incl"]
["WEPS","We",0,1,"We01N",null,null,{"$f":"H55-ROUND('Env levy'!$C$8,2)","v":217.76999999999998},{"$f":"ROUND(H61 * (1 + VAT), 2)","v":248.26},{"$f":"J55-ROUND('Env levy'!$C$8,2)","v":63.529999999999994},{"$f":"ROUND(J61 * (1 + VAT), 2)","v":72.42},{"$f":"L55-ROUND('Env levy'!$C$8,2)","v":32.909999999999997},{"$f":"ROUND(L61 * (1 + VAT), 2)","v":37.520000000000003},{"$f":"N55-ROUND('Env levy'!$C$8,2)","v":68.7},{"$f":"ROUND(N61 * (1 + VAT), 2)","v":78.319999999999993},{"$f":"P55-ROUND('Env levy'!$C$8,2)","v":46.18},{"$f":"ROUND(P61 * (1 + VAT), 2)","v":52.65},{"$f":"R55-ROUND('Env levy'!$C$8,2)","v":28.03},{"$f":"ROUND(R61 * (1 + VAT), 2)","v":31.95}]

{"sheet":"WEPS Munic inc","index":2,"n_rows":61,"n_cols":23,"rows_kept":61,"cut":false,"hidden":false,"merged":[[3,21,5,22],[11,7,14,7],[1,6,1,16],[1,17,1,22],[3,9,3,20],[4,7,6,7],[4,9,4,14],[4,15,4,20],[5,9,5,10],[5,11,5,12],[5,13,5,14],[5,15,5,16],[5,17,5,18],[5,19,5,20],[7,7,10,7],[29,7,29,8],[29,16,29,17],[15,7,18,7],[19,7,22,7],[24,7,24,14],[25,7,26,8],[25,9,26,10],[25,11,26,12],[25,13,26,14],[26,18,26,19],[27,7,27,8],[27,16,27,17],[28,7,28,8],[28,16,28,17],[38,7,38,8],[30,7,30,8],[30,16,30,17],[31,7,31,8],[31,16,31,17],[33,7,33,8],[33,9,34,10],[33,11,34,12],[33,16,33,19],[35,7,35,8],[35,16,35,17],[35,18,35,19],[36,7,36,8],[37,7,37,8],[52,17,52,18],[39,7,39,8],[40,7,40,8],[43,7,43,8],[50,7,50,18],[51,7,51,12],[51,13,51,18],[52,7,52,8],[52,9,52,10],[52,11,52,12],[52,13,52,14],[52,15,52,16],[56,7,56,18],[57,7,57,12],[57,13,57,18],[58,7,58,8],[58,9,58,10],[58,11,58,12],[58,13,58,14],[58,15,58,16],[58,17,58,18]]}
[null,null,null,null,null,null,"Back to menu"]
["Municiple",null,null,null,null,null,"WEPS",null,null,null,null,null,null,null,null,null,null,"Local authority"]
[]
[null,null,null,null,null,null,null,null,null,"Active energy charge [c/kWh]",null,null,null,null,null,null,null,null,null,null,null,"Transmission network charges [R/kVA/m]"]
[null,null,null,null,null,null,null,"Transmission zone",null,"High demand season [Jun - Aug]",null,null,null,null,null,"Low demand season [Sep - May]"]
[null,null,null,null,null,null,null,null,"Voltage","Peak",null,"Standard",null,"Off Peak",null,"Peak",null,"Standard",null,"Off Peak"]
["Tariff","Tariff nameBillcode","Tx zone","Voltage","Billcode",null,null,null,null,null,"VAT incl",null,"VAT incl",null,"VAT incl",null,"VAT incl",null,"VAT incl",null,"VAT incl",null,"VAT incl"]
["WEPS","We",0,1,{"$f":"B8&C8&D8&IF($A$2=\"Non-municipal\",\"N\",IF($A$2=\"Municiple\",\"Y\",\"error\"))","v":"We01Y"},null,null,"≤ 300km","< 500V",258.52999999999997,{"$f":"ROUND(J8 * (1 + VAT), 2)","v":294.72000000000003},78.67,{"$f":"ROUND(L8 * (1 + VAT), 2)","v":89.68},42.93,{"$f":"ROUND(N8 * (1 + VAT), 2)","v":48.94},84.65,{"$f":"ROUND(P8 * (1 + VAT), 2)","v":96.5},58.41,{"$f":"ROUND(R8 * (1 + VAT), 2)","v":66.59},37.229999999999997,{"$f":"ROUND(T8 * (1 + VAT), 2)","v":42.44},7.2,{"$f":"ROUND(V8 * (1 + VAT), 2)","v":8.2100000000000009}]
["WEPS","We",0,2,{"$f":"B9&C9&D9&IF($A$2=\"Non-municipal\",\"N\",IF($A$2=\"Municiple\",\"Y\",\"error\"))","v":"We02Y"},null,null,null,"≥ 500V & < 66kV",254.45,290.07,77.09,87.88,41.86,47.72,83.01,94.63,57.13,65.13,36.25,41.33,6.57,7.49]
["WEPS","We",0,3,"We03Y",null,null,null,"≥ 66kV & ≤ 132kV",246.42,280.92,74.64,85.09,40.53,46.2,80.38,91.63,55.33,63.08,35.090000000000003,40,6.4,7.3]
["WEPS","We",0,4,"We04Y",null,null,null,"> 132kV*",232.24,264.75,70.349999999999994,80.2,38.200000000000003,43.55,75.760000000000005,86.37,52.14,59.44,33.08,37.71,8.09,9.2200000000000006]
["WEPS","We",1,1,"We11Y",null,null,"> 300km and \n≤ 600km","< 500V",260.63,297.12,78.959999999999994,90.01,42.87,48.87,85.03,96.93,58.53,66.72,37.130000000000003,42.33,7.24,8.25]
["WEPS","We",1,2,"We12Y",null,null,null,"≥ 500V & < 66kV",256.99,292.97000000000003,77.849999999999994,88.75,42.28,48.2,83.84,95.58,57.7,65.78,36.6,41.72,6.64,7.57]
["WEPS","We",1,3,"We13Y",null,null,null,"≥ 66kV & ≤ 132kV",248.83,283.67,75.38,85.93,40.92,46.65,81.17,92.53,55.86,63.68,35.43,40.39,6.44,7.34]
["WEPS","We",1,4,"We14Y",null,null,null,"> 132kV*",234.55,267.39,71.06,81.010000000000005,38.58,43.98,76.5,87.21,52.66,60.03,33.4,38.08,8.17,9.31]
["WEPS","We",2,1,"We21Y",null,null,"> 600km and \n≤ 900km","< 500V",263.23,300.08,79.739999999999995,90.9,43.3,49.36,85.86,97.88,59.1,67.37,37.49,42.74,7.33,8.36]
["WEPS","We",2,2,"We22Y",null,null,null,"≥ 500V & < 66kV",259.58,295.92,78.63,89.64,42.7,48.68,84.69,96.55,58.26,66.42,36.97,42.15,6.69,7.63]
["WEPS","We",2,3,"We23Y",null,null,null,"≥ 66kV & ≤ 132kV",251.36,286.55,76.14,86.8,41.34,47.13,81.98,93.46,56.42,64.319999999999993,35.79,40.799999999999997,6.5,7.41]
["WEPS","We",2,4,"We24Y",null,null,null,"> 132kV*",236.91,270.08,71.78,81.83,38.97,44.43,77.290000000000006,88.11,53.19,60.64,33.75,38.479999999999997,8.2799999999999994,9.44]
["WEPS","We",3,1,"We31Y",null,null,"> 900km","< 500V",265.87,303.08999999999997,80.55,91.83,43.74,49.86,86.73,98.87,59.69,68.05,37.869999999999997,43.17,7.37,8.4]
["WEPS","We",3,2,"We32Y",null,null,null,"≥ 500V & < 66kV",262.17,298.87,79.41,90.53,43.13,49.17,85.51,97.48,58.85,67.09,37.33,42.56,6.76,7.71]
["WEPS","We",3,3,"We33Y",null,null,null,"≥ 66kV & ≤ 132kV",253.89,289.43,76.91,87.68,41.77,47.62,82.81,94.4,56.99,64.97,36.159999999999997,41.22,6.55,7.47]
["WEPS","We",3,4,"We34Y",null,null,null,"> 132kV*",239.24,272.73,72.510000000000005,82.66,39.4,44.92,78.08,89.01,53.75,61.28,34.119999999999997,38.9,8.34,9.51]
[null,null,null,null,null,null,null,null,"* 132 kV or Transmission connected"]
[null,null,null,null,null,null,null,"Distribution network charges"]
[null,null,null,null,null,null,null,null,null,"Network capacity charge [R/kVA/m]",null,"Network demand charge [R/kVA/m]",null,"Urban low voltage subsidy charge [R/kVA/m]"]
[null,null,null,null,null,null,null,null,null,null,null,null,null,null,null,null,null,null,"Ancillary service charge [c/kWh]"]
["Tariff","Tariff nameBillcode","Tx zone","Voltage","Billcode",null,null,"Voltage",null,null,"VAT incl",null,"VAT incl",null,"VAT incl",null,"Voltage",null,null,"VAT incl"]
["WEPS","We",0,1,{"$f":"B29&C29&D29&IF($A$2=\"Non-municipal\",\"N\",IF($A$2=\"Municiple\",\"Y\",\"error\"))","v":"We01Y"},null,null,"< 500V",null,14.36,{"$f":"ROUND(J29 * (1 + VAT), 2)","v":16.37},27.22,{"$f":"ROUND(L29 * (1 + VAT), 2)","v":31.03},0,{"$f":"ROUND(N29 * (1 + VAT), 2)","v":0},null,"< 500V",null,0.33,{"$f":"ROUND(S29 * (1 + VAT), 2)","v":0.38}]
["WEPS","We",0,2,{"$f":"B30&C30&D30&IF($A$2=\"Non-municipal\",\"N\",IF($A$2=\"Municiple\",\"Y\",\"error\"))","v":"We02Y"},null,null,"≥ 500V & < 66kV",null,13.17,{"$f":"ROUND(J30 * (1 + VAT), 2)","v":15.01},24.97,{"$f":"ROUND(L30 * (1 + VAT), 2)","v":28.47},0,{"$f":"ROUND(N30 * (1 + VAT), 2)","v":0},null,"≥ 500V & < 66kV",null,0.32,{"$f":"ROUND(S30 * (1 + VAT), 2)","v":0.36}]
["WEPS","We",0,3,"We03Y",null,null,"≥ 66kV & ≤ 132kV",null,4.71,{"$f":"ROUND(J31 * (1 + VAT), 2)","v":5.37},8.7100000000000009,{"$f":"ROUND(L31 * (1 + VAT), 2)","v":9.93},11.53,{"$f":"ROUND(N31 * (1 + VAT), 2)","v":13.14},null,"≥ 66kV & ≤ 132kV",null,0.31,{"$f":"ROUND(S31 * (1 + VAT), 2)","v":0.35}]
["WEPS","We",0,4,"We04Y",null,null,"> 132kV / Transmission connected",null,0,{"$f":"ROUND(J32 * (1 + VAT), 2)","v":0},0,{"$f":"ROUND(L32 * (1 + VAT), 2)","v":0},11.53,{"$f":"ROUND(N32 * (1 + VAT), 2)","v":13.14},null,"> 132kV / Transmission",null,0.28999999999999998,{"$f":"ROUND(S32 * (1 + VAT), 2)","v":0.33}]
[]
[null,null,null,null,null,null,null,"Customer categories",null,"Service charge  [R/account/day]",null,"Administration charge  [R/POD/day]",null,null,null,null,"Reactive energy charge  [c/kVArh]"]
[]
["Tariff","Tariff nameBillcode","Tx zone","Voltage","Billcode",null,null,null,null,null,"VAT incl",null,"VAT incl",null,null,null,"High season",null,"Low season"]
["WEPS","We",0,1,{"$f":"B37&C37&D37&IF($A$2=\"Non-municipal\",\"N\",IF($A$2=\"Municiple\",\"Y\",\"error\"))","v":"We01Y"},null,null,"≤ 100 kVA",null,11.66,{"$f":"ROUND(J37 * (1 + VAT), 2)","v":13.29},2.56,{"$f":"ROUND(L37 * (1 + VAT), 2)","v":2.92},null,null,null,null,"VAT incl",null,"VAT incl"]
["WEPS","We",0,1,{"$f":"B38&C38&D38&IF($A$2=\"Non-municipal\",\"N\",IF($A$2=\"Municiple\",\"Y\",\"error\"))","v":"We01Y"},null,null,"> 100 kVA & ≤ 500 kVA",null,53.3,{"$f":"ROUND(J38 * (1 + VAT), 2)","v":60.76},14.94,{"$f":"ROUND(L38 * (1 + VAT), 2)","v":17.03},null,null,null,11.54,{"$f":"ROUND(Q38 * (1 + VAT), 2)","v":13.16},0,{"$f":"ROUND(S38 * (1 + VAT), 2)","v":0}]
["WEPS","We",0,1,{"$f":"B39&C39&D39&IF($A$2=\"Non-municipal\",\"N\",IF($A$2=\"Municiple\",\"Y\",\"error\"))","v":"We01Y"},null,null,"> 500 kVA & ≤ 1 MVA",null,164.04,{"$f":"ROUND(J39 * (1 + VAT), 2)","v":187.01},29.7,{"$f":"ROUND(L39 * (1 + VAT), 2)","v":33.86}]
["WEPS","We",0,1,{"$f":"B40&C40&D40&IF($A$2=\"Non-municipal\",\"N\",IF($A$2=\"Municiple\",\"Y\",\"error\"))","v":"We01Y"},null,null,"> 1 MVA",null,164.04,{"$f":"ROUND(J40 * (1 + VAT), 2)","v":187.01},73.94,{"$f":"ROUND(L40 * (1 + VAT), 2)","v":84.29}]
["WEPS","We",0,1,{"$f":"B41&C41&D41&IF($A$2=\"Non-municipal\",\"N\",IF($A$2=\"Municiple\",\"Y\",\"error\"))","v":"We01Y"},null,null,"Key customers",null,3214.52,{"$f":"ROUND(J41 * (1 + VAT), 2)","v":3664.55},102.66,{"$f":"ROUND(L41 * (1 + VAT), 2)","v":117.03}]
[]
[]
[null,null,null,null,null,null,null,"Electrification and rural network subsidy charge [c/kWh]"]
[]
[null,null,null,null,null,null,null,"All seasons"]
["Tariff","Tariff nameBillcode","Tx zone","Voltage","Billcode",null,null,null,"VAT incl"]
["WEPS","We",0,1,{"$f":"B48&C48&D48&IF($A$2=\"Non-municipal\",\"N\",IF($A$2=\"Municiple\",\"Y\",\"error\"))","v":"We01Y"},null,null,6.39,{"$f":"ROUND(H48 * (1 + VAT), 2)","v":7.28}]
[]
[]
[null,null,null,null,null,null,null,"Active energy charge excluding losses   [c/kWh]"]
[null,null,null,null,null,null,null,"High demand season [Jun - Aug]",null,null,null,null,null,"Low demand season [Sep - May]"]
[null,null,null,null,null,null,null,"Peak",null,"Standard",null,"Off Peak",null,"Peak",null,"Standard",null,"Off Peak"]
["Tariff","Tariff nameBillcode","Tx zone","Voltage","Billcode",null,null,null,"VAT incl",null,"VAT incl",null,"VAT incl",null,"VAT incl",null,"VAT incl",null,"VAT incl"]
["WEPS","We",0,1,{"$f":"B55&C55&D55&IF($A$2=\"Non-municipal\",\"N\",IF($A$2=\"Municiple\",\"Y\",\"error\"))","v":"We01Y"},null,null,{"$f":"ROUND(J11/'Loss Factors'!$T$6, 2)","v":229.78},{"$f":"ROUND(H55 * (1 + VAT), 2)","v":261.95},{"$f":"ROUND(L11/'Loss Factors'!$T$6, 2)","v":69.61},{"$f":"ROUND(J55 * (1 + VAT), 2)","v":79.36},{"$f":"ROUND(N11/'Loss Factors'!$T$6, 2)","v":37.799999999999997},{"$f":"ROUND(L55 * (1 + VAT), 2)","v":43.09},{"$f":"ROUND(P11/'Loss Factors'!$T$6, 2)","v":74.959999999999994},{"$f":"ROUND(N55 * (1 + VAT), 2)","v":85.45},{"$f":"ROUND(R11/'Loss Factors'!$T$6, 2)","v":51.59},{"$f":"ROUND(P55 * (1 + VAT), 2)","v":58.81},{"$f":"ROUND(T11/'Loss Factors'!$T$6, 2)","v":32.729999999999997},{"$f":"ROUND(R55 * (1 + VAT), 2)","v":37.31}]
[]
[null,null,null,null,null,null,null,"Active energy charge excluding losses and enviromental levy   [c/kWh]"]
[null,null,null,null,null,null,null,"High demand season [Jun - Aug]",null,null,null,null,null,"Low demand season [Sep - May]"]
[null,null,null,null,null,null,null,"Peak",null,"Standard",null,"Off Peak",null,"Peak",null,"Standard",null,"Off Peak"]
["Tariff","Tariff nameBillcode","Tx zone","Voltage","Billcode",null,null,null,"VAT incl",null,"VAT incl",null,"VAT incl",null,"VAT incl",null,"VAT incl",null,"VAT incl"]
["WEPS","We",0,1,{"$f":"B61&C61&D61&IF($A$2=\"Non-municipal\",\"N\",IF($A$2=\"Municiple\",\"Y\",\"error\"))","v":"We01Y"},null,null,{"$f":"H55-ROUND('Env levy'!$C$8,2)","v":226.29},{"$f":"ROUND(H61 * (1 + VAT), 2)","v":257.97000000000003},{"$f":"J55-ROUND('Env levy'!$C$8,2)","v":66.12},{"$f":"ROUND(J61 * (1 + VAT), 2)","v":75.38},{"$f":"L55-ROUND('Env levy'!$C$8,2)","v":34.309999999999995},{"$f":"ROUND(L61 * (1 + VAT), 2)","v":39.11},{"$f":"N55-ROUND('Env levy'!$C$8,2)","v":71.47},{"$f":"ROUND(N61 * (1 + VAT), 2)","v":81.48},{"$f":"P55-ROUND('Env levy'!$C$8,2)","v":48.1},{"$f":"ROUND(P61 * (1 + VAT), 2)","v":54.83},{"$f":"R55-ROUND('Env levy'!$C$8,2)","v":29.239999999999995},{"$f":"ROUND(R61 * (1 + VAT), 2)","v":33.33}]

{"sheet":"Nightsave Large inc","index":3,"n_rows":47,"n_cols":33,"rows_kept":47,"cut":false,"hidden":false,"merged":[[1,16,1,18],[3,9,3,12],[3,13,3,16],[4,7,6,7],[4,9,5,10],[4,11,5,12],[4,13,5,14],[4,15,5,16],[3,17,5,18],[7,7,10,7],[11,7,14,7],[15,7,18,7],[19,7,22,7],[25,7,25,14],[44,7,44,8],[44,9,44,10],[27,17,27,18],[28,7,28,8],[29,7,29,8],[30,7,30,8],[31,7,31,8],[32,7,32,8],[26,9,27,10],[26,11,27,12],[26,13,27,14],[35,7,36,7],[35,8,36,9],[35,10,36,11],[42,7,43,8],[42,9,43,10]]}
[null,null,null,null,null,null,null,"Back to menu"]
["Non-municipal",null,null,null,null,null,null,"Nightsave Urban Large tariff",null,null,null,null,null,null,null,null,"Non-local authority",null,null,null,null,null,null,null,null,null,null,null,null,null,null,null,"check value"]
[]
[null,null,null,null,null,null,null,null,null,"Active energy charge [c/kWh]",null,null,null,"Energy demand charge [R/kVA/m]",null,null,null,"Transmission network charges [R/kVA/m]"]
[null,null,null,null,null,null,null,"Transmission zone",null,"High demand season \n[Jun - Aug]",null,"Low demand season \n[Sep - May]",null,"High demand season \n[Jun - Aug]",null,"Low demand season \n[Sep - May]"]
[null,null,null,null,null,null,null,null,"Voltage"]
["Tariff","Tariff nameBillcode","Tx zone","Voltage","Billcode",null,null,null,null,"","VAT incl",null,"VAT incl","","VAT incl",null,"VAT incl",null,"VAT incl"]
["Nightsave Large","NL",0,1,{"$f":"B8&C8&D8&IF($A$2=\"Non-municipal\",\"N\",IF($A$2=\"Municiple\",\"Y\",\"error\"))","v":"NL01N"},null,null,"≤ 300km","< 500V",61.48,{"$f":"ROUND(J8 * (1 + VAT), 2)","v":70.09},47.8,{"$f":"ROUND(L8 * (1 + VAT), 2)","v":54.49},187.08,{"$f":"ROUND(N8 * (1 + VAT), 2)","v":213.27},26.14,{"$f":"ROUND(P8 * (1 + VAT), 2)","v":29.8},7.12,{"$f":"ROUND(R8 * (1 + VAT), 2)","v":8.1199999999999992}]
["Nightsave Large","NL",0,2,{"$f":"B9&C9&D9&IF($A$2=\"Non-municipal\",\"N\",IF($A$2=\"Municiple\",\"Y\",\"error\"))","v":"NL02N"},null,null,null,"≥ 500V & < 66kV",58.23,66.38,45.45,51.81,181.07,206.42,25.31,28.85,6.51,7.42]
["Nightsave Large","NL",0,3,"NL03N",null,null,null,"≥ 66kV & ≤ 132kV",57.8,65.89,44.9,51.19,174.48,198.91,24.39,27.8,6.34,7.23]
["Nightsave Large","NL",0,4,"NL04N",null,null,null,"> 132kV*",54.07,61.64,42.04,47.93,168.31,191.87,23.52,26.81,8.01,9.1300000000000008]
["Nightsave Large","NL",1,1,"NL11N",null,null,"> 300km and \n≤ 600km","< 500V",62.31,71.03,48.32,55.08,189.01,215.47,26.4,30.1,7.18,8.19]
["Nightsave Large","NL",1,2,"NL12N",null,null,null,"≥ 500V & < 66kV",59.44,67.760000000000005,46.37,52.86,182.91,208.52,25.54,29.12,6.57,7.49]
["Nightsave Large","NL",1,3,"NL13N",null,null,null,"≥ 66kV & ≤ 132kV",59,67.260000000000005,45.81,52.22,176.21,200.88,24.62,28.07,6.39,7.28]
["Nightsave Large","NL",1,4,"NL14N",null,null,null,"> 132kV*",55.2,62.93,42.9,48.91,170.03,193.83,23.74,27.06,8.09,9.2200000000000006]
["Nightsave Large","NL",2,1,"NL21N",null,null,"> 600km and \n≤ 900km","< 500V",62.89,71.69,48.79,55.62,190.94,217.67,26.67,30.4,7.27,8.2899999999999991]
["Nightsave Large","NL",2,2,"NL22N",null,null,null,"≥ 500V & < 66kV",60.04,68.45,46.85,53.41,184.74,210.6,25.82,29.43,6.63,7.56]
["Nightsave Large","NL",2,3,"NL23N",null,null,null,"≥ 66kV & ≤ 132kV",59.59,67.930000000000007,46.27,52.75,177.98,202.9,24.86,28.34,6.43,7.33]
["Nightsave Large","NL",2,4,"NL24N",null,null,null,"> 132kV*",55.74,63.54,43.34,49.41,171.73,195.77,23.98,27.34,8.1999999999999993,9.35]
["Nightsave Large","NL",3,1,"NL31N",null,null,"> 900km","< 500V",63.56,72.459999999999994,49.29,56.19,192.8,219.79,26.93,30.7,7.29,8.31]
["Nightsave Large","NL",3,2,"NL32N",null,null,null,"≥ 500V & < 66kV",60.62,69.11,47.3,53.92,186.6,212.72,26.04,29.69,6.71,7.65]
["Nightsave Large","NL",3,3,"NL33N",null,null,null,"≥ 66kV & ≤ 132kV",60.2,68.63,46.73,53.27,179.8,204.97,25.12,28.64,6.48,7.39]
["Nightsave Large","NL",3,4,"NL34N",null,null,null,"> 132kV*",56.33,64.22,43.81,49.94,173.46,197.74,24.22,27.61,8.26,9.42]
[null,null,null,null,null,null,null,null,"* 132 kV or Transmission connected"]
[]
[null,null,null,null,null,null,null,"Distribution network charges"]
[null,null,null,null,null,null,null,null,null,"Network capacity charge [R/kVA/m]",null,"Network demand charge [R/kVA/m]",null,"Urban low voltage subsidy charge [R/kVA/m]"]
[null,null,null,null,null,null,null,null,null,null,null,null,null,null,null,null,null,"Ancillary service charge [c/kWh]"]
["Tariff","Tariff nameBillcode","Tx zone","Voltage","Billcode",null,null,"Voltage",null,null,"VAT incl",null,"VAT incl",null,"VAT incl",null,"Voltage",null,"VAT incl"]
["Nightsave Large","NL",0,1,{"$f":"B30&C30&D30&IF($A$2=\"Non-municipal\",\"N\",IF($A$2=\"Municiple\",\"Y\",\"error\"))","v":"NL01N"},null,null,"< 500V",null,14.15,{"$f":"ROUND(J30 * (1 + VAT), 2)","v":16.13},26.83,{"$f":"ROUND(L30 * (1 + VAT), 2)","v":30.59},0,{"$f":"ROUND(N30 * (1 + VAT), 2)","v":0},null,"< 500V",0.33,{"$f":"ROUND(R30 * (1 + VAT), 2)","v":0.38}]
["Nightsave Large","NL",0,2,{"$f":"B31&C31&D31&IF($A$2=\"Non-municipal\",\"N\",IF($A$2=\"Municiple\",\"Y\",\"error\"))","v":"NL02N"},null,null,"≥ 500V & < 66kV",null,12.98,{"$f":"ROUND(J31 * (1 + VAT), 2)","v":14.8},24.62,{"$f":"ROUND(L31 * (1 + VAT), 2)","v":28.07},0,{"$f":"ROUND(N31 * (1 + VAT), 2)","v":0},null,"≥ 500V & < 66kV",0.32,{"$f":"ROUND(R31 * (1 + VAT), 2)","v":0.36}]
["Nightsave Large","NL",0,3,"NL03N",null,null,"≥ 66kV & ≤ 132kV",null,4.63,{"$f":"ROUND(J32 * (1 + VAT), 2)","v":5.28},8.58,{"$f":"ROUND(L32 * (1 + VAT), 2)","v":9.7799999999999994},11.43,{"$f":"ROUND(N32 * (1 + VAT), 2)","v":13.03},null,"≥ 66kV & ≤ 132kV",0.3,{"$f":"ROUND(R32 * (1 + VAT), 2)","v":0.34}]
["Nightsave Large","NL",0,4,"NL04N",null,null,"> 132kV / Transmission connected",null,0,{"$f":"ROUND(J33 * (1 + VAT), 2)","v":0},0,{"$f":"ROUND(L33 * (1 + VAT), 2)","v":0},11.43,{"$f":"ROUND(N33 * (1 + VAT), 2)","v":13.03},null,"> 132kV*",0.28000000000000003,{"$f":"ROUND(R33 * (1 + VAT), 2)","v":0.32}]
[null,null,null,null,null,null,null,null,null,null,null,null,null,null,null,null,"* 132 kV or Transmission connected"]
[]
[null,null,null,null,null,null,null,"Customer categories","Service charge  [R/account/day]",null,"Administration charge  [R/POD/day]"]
[]
["Tariff","Tariff nameBillcode","Tx zone","Voltage","Billcode",null,null,null,null,"VAT incl",null,"VAT incl"]
["Nightsave Large","NL",0,1,{"$f":"B39&C39&D39&IF($A$2=\"Non-municipal\",\"N\",IF($A$2=\"Municiple\",\"Y\",\"error\"))","v":"NL01N"},null,null,">1  MVA",162.47999999999999,{"$f":"ROUND(I39 * (1 + VAT), 2)","v":185.23},73.23,{"$f":"ROUND(K39 * (1 + VAT), 2)","v":83.48}]
["Nightsave Large","NL",0,1,{"$f":"B40&C40&D40&IF($A$2=\"Non-municipal\",\"N\",IF($A$2=\"Municiple\",\"Y\",\"error\"))","v":"NL01N"},null,null,"Key customers",3183.88,{"$f":"ROUND(I40 * (1 + VAT), 2)","v":3629.62},101.68,{"$f":"ROUND(K40 * (1 + VAT), 2)","v":115.92}]
[]
[]
[null,null,null,null,null,null,null,"Electrification and rural network subsidy charge [c/kWh]",null,"Affordability subsidy charge [c/kWh] \nOnly payable by non-local authority tariffs"]
[]
[null,null,null,null,null,null,null,"All seasons",null,"All seasons"]
["Tariff","Tariff nameBillcode","Tx zone","Voltage","Billcode",null,null,null,"VAT incl",null,"VAT incl"]
["Nightsave Large","NL",0,1,{"$f":"B47&C47&D47&IF($A$2=\"Non-municipal\",\"N\",IF($A$2=\"Municiple\",\"Y\",\"error\"))","v":"NL01N"},null,null,6.33,{"$f":"ROUND(H47 * (1 + VAT), 2)","v":7.22},2.44,{"$f":"ROUND(J47 * (1 + VAT), 2)","v":2.78}]

{"sheet":"Nightsave Large Munic inc","index":4,"n_rows":47,"n_cols":33,"rows_kept":47,"cut":false,"hidden":false,"merged":[[1,16,1,18],[3,9,3,12],[3,13,3,16],[4,7,6,7],[4,9,5,10],[4,11,5,12],[4,13,5,14],[4,15,5,16],[3,17,5,18],[32,7,32,8],[7,7,10,7],[11,7,14,7],[15,7,18,7],[19,7,22,7],[25,7,25,14],[26,9,27,10],[26,11,27,12],[26,13,27,14],[27,17,27,18],[28,7,28,8],[29,7,29,8],[30,7,30,8],[31,7,31,8],[35,7,36,7],[35,8,36,9],[35,10,36,11],[42,7,43,8],[44,7,44,8]]}
[null,null,null,null,null,null,null,"Back to menu"]
["Municiple",null,null,null,null,null,null,"Nightsave Urban Large tariff",null,null,null,null,null,null,null,null,"Local authority",null,null,null,null,null,null,null,null,null,null,null,null,null,null,null,"check value"]
[]
[null,null,null,null,null,null,null,null,null,"Active energy charge [c/kWh]",null,null,null,"Energy demand charge [R/kVA/m]",null,null,null,"Transmission network charges [R/kVA/m]"]
[null,null,null,null,null,null,null,"Transmission zone",null,"High demand season \n[Jun - Aug]",null,"Low demand season \n[Sep - May]",null,"High demand season \n[Jun - Aug]",null,"Low demand season \n[Sep - May]"]
[null,null,null,null,null,null,null,null,"Voltage"]
["Tariff","Tariff nameBillcode","Tx zone","Voltage","Billcode",null,null,null,null,"","VAT incl",null,"VAT incl","","VAT incl",null,"VAT incl",null,"VAT incl"]
["Nightsave Large","NL",0,1,{"$f":"B8&C8&D8&IF($A$2=\"Non-municipal\",\"N\",IF($A$2=\"Municiple\",\"Y\",\"error\"))","v":"NL01Y"},null,null,"≤ 300km","< 500V",63.85,{"$f":"ROUND(J8 * (1 + VAT), 2)","v":72.790000000000006},49.65,{"$f":"ROUND(L8 * (1 + VAT), 2)","v":56.6},190.64,{"$f":"ROUND(N8 * (1 + VAT), 2)","v":217.33},26.64,{"$f":"ROUND(P8 * (1 + VAT), 2)","v":30.37},7.2,{"$f":"ROUND(R8 * (1 + VAT), 2)","v":8.2100000000000009}]
["Nightsave Large","NL",0,2,{"$f":"B9&C9&D9&IF($A$2=\"Non-municipal\",\"N\",IF($A$2=\"Municiple\",\"Y\",\"error\"))","v":"NL02Y"},null,null,null,"≥ 500V & < 66kV",60.47,68.94,47.19,53.8,184.52,210.35,25.8,29.41,6.57,7.49]
["Nightsave Large","NL",0,3,"NL03Y",null,null,null,"≥ 66kV & ≤ 132kV",60.02,68.42,46.61,53.14,177.8,202.69,24.85,28.33,6.4,7.3]
["Nightsave Large","NL",0,4,"NL04Y",null,null,null,"> 132kV*",56.15,64.010000000000005,43.66,49.77,171.52,195.53,23.96,27.31,8.09,9.2200000000000006]
["Nightsave Large","NL",1,1,"NL11Y",null,null,"> 300km and \n≤ 600km","< 500V",64.69,73.75,50.19,57.22,192.62,219.59,26.9,30.67,7.24,8.25]
["Nightsave Large","NL",1,2,"NL12Y",null,null,null,"≥ 500V & < 66kV",61.72,70.36,48.15,54.89,186.38,212.47,26.02,29.66,6.64,7.57]
["Nightsave Large","NL",1,3,"NL13Y",null,null,null,"≥ 66kV & ≤ 132kV",61.27,69.849999999999994,47.58,54.24,179.57,204.71,25.1,28.61,6.44,7.34]
["Nightsave Large","NL",1,4,"NL14Y",null,null,null,"> 132kV*",57.31,65.33,44.55,50.79,173.26,197.52,24.2,27.59,8.17,9.31]
["Nightsave Large","NL",2,1,"NL21Y",null,null,"> 600km and \n≤ 900km","< 500V",65.31,74.45,50.67,57.76,194.57,221.81,27.18,30.99,7.33,8.36]
["Nightsave Large","NL",2,2,"NL22Y",null,null,null,"≥ 500V & < 66kV",62.34,71.069999999999993,48.65,55.46,188.27,214.63,26.31,29.99,6.69,7.63]
["Nightsave Large","NL",2,3,"NL23Y",null,null,null,"≥ 66kV & ≤ 132kV",61.88,70.540000000000006,48.06,54.79,181.37,206.76,25.33,28.88,6.5,7.41]
["Nightsave Large","NL",2,4,"NL24Y",null,null,null,"> 132kV*",57.89,65.989999999999995,45,51.3,175,199.5,24.45,27.87,8.2799999999999994,9.44]
["Nightsave Large","NL",3,1,"NL31Y",null,null,"> 900km","< 500V",66,75.239999999999995,51.18,58.35,196.48,223.99,27.45,31.29,7.37,8.4]
["Nightsave Large","NL",3,2,"NL32Y",null,null,null,"≥ 500V & < 66kV",62.96,71.77,49.12,56,190.14,216.76,26.54,30.26,6.76,7.71]
["Nightsave Large","NL",3,3,"NL33Y",null,null,null,"≥ 66kV & ≤ 132kV",62.5,71.25,48.53,55.32,183.21,208.86,25.6,29.18,6.55,7.47]
["Nightsave Large","NL",3,4,"NL34Y",null,null,null,"> 132kV*",58.51,66.7,45.5,51.87,176.77,201.52,24.68,28.14,8.34,9.51]
[null,null,null,null,null,null,null,null,"* 132 kV or Transmission connected"]
[]
[null,null,null,null,null,null,null,"Distribution network charges"]
[null,null,null,null,null,null,null,null,null,"Network capacity charge [R/kVA/m]",null,"Network demand charge [R/kVA/m]",null,"Urban low voltage subsidy charge [R/kVA/m]"]
[null,null,null,null,null,null,null,null,null,null,null,null,null,null,null,null,null,"Ancillary service charge [c/kWh]"]
["Tariff","Tariff nameBillcode","Tx zone","Voltage","Billcode",null,null,"Voltage",null,null,"VAT incl",null,"VAT incl",null,"VAT incl",null,"Voltage",null,"VAT incl"]
["Nightsave Large","NL",0,1,{"$f":"B30&C30&D30&IF($A$2=\"Non-municipal\",\"N\",IF($A$2=\"Municiple\",\"Y\",\"error\"))","v":"NL01Y"},null,null,"< 500V",null,14.36,{"$f":"ROUND(J30 * (1 + VAT), 2)","v":16.37},27.22,{"$f":"ROUND(L30 * (1 + VAT), 2)","v":31.03},0,{"$f":"ROUND(N30 * (1 + VAT), 2)","v":0},null,"< 500V",0.33,{"$f":"ROUND(R30 * (1 + VAT), 2)","v":0.38}]
["Nightsave Large","NL",0,2,{"$f":"B31&C31&D31&IF($A$2=\"Non-municipal\",\"N\",IF($A$2=\"Municiple\",\"Y\",\"error\"))","v":"NL02Y"},null,null,"≥ 500V & < 66kV",null,13.17,{"$f":"ROUND(J31 * (1 + VAT), 2)","v":15.01},24.97,{"$f":"ROUND(L31 * (1 + VAT), 2)","v":28.47},0,{"$f":"ROUND(N31 * (1 + VAT), 2)","v":0},null,"≥ 500V & < 66kV",0.32,{"$f":"ROUND(R31 * (1 + VAT), 2)","v":0.36}]
["Nightsave Large","NL",0,3,"NL03Y",null,null,"≥ 66kV & ≤ 132kV",null,4.71,{"$f":"ROUND(J32 * (1 + VAT), 2)","v":5.37},8.7100000000000009,{"$f":"ROUND(L32 * (1 + VAT), 2)","v":9.93},11.53,{"$f":"ROUND(N32 * (1 + VAT), 2)","v":13.14},null,"≥ 66kV & ≤ 132kV",0.31,{"$f":"ROUND(R32 * (1 + VAT), 2)","v":0.35}]
["Nightsave Large","NL",0,4,"NL04Y",null,null,"> 132kV / Transmission connected",null,0,{"$f":"ROUND(J33 * (1 + VAT), 2)","v":0},0,{"$f":"ROUND(L33 * (1 + VAT), 2)","v":0},11.53,{"$f":"ROUND(N33 * (1 + VAT), 2)","v":13.14},null,"> 132kV*",0.28999999999999998,{"$f":"ROUND(R33 * (1 + VAT), 2)","v":0.33}]
[null,null,null,null,null,null,null,null,null,null,null,null,null,null,null,null,"* 132 kV or Transmission connected"]
[]
[null,null,null,null,null,null,null,"Customer categories","Service charge  [R/account/day]",null,"Administration charge  [R/POD/day]"]
[]
["Tariff","Tariff nameBillcode","Tx zone","Voltage","Billcode",null,null,null,null,"VAT incl",null,"VAT incl"]
["Nightsave Large","NL",0,1,{"$f":"B39&C39&D39&IF($A$2=\"Non-municipal\",\"N\",IF($A$2=\"Municiple\",\"Y\",\"error\"))","v":"NL01Y"},null,null,">1  MVA",164.04,{"$f":"ROUND(I39 * (1 + VAT), 2)","v":187.01},73.94,{"$f":"ROUND(K39 * (1 + VAT), 2)","v":84.29}]
["Nightsave Large","NL",0,1,{"$f":"B40&C40&D40&IF($A$2=\"Non-municipal\",\"N\",IF($A$2=\"Municiple\",\"Y\",\"error\"))","v":"NL01Y"},null,null,"Key customers",3214.52,{"$f":"ROUND(I40 * (1 + VAT), 2)","v":3664.55},102.66,{"$f":"ROUND(K40 * (1 + VAT), 2)","v":117.03}]
[]
[]
[null,null,null,null,null,null,null,"Electrification and rural network subsidy charge [c/kWh]"]
[]
[null,null,null,null,null,null,null,"All seasons"]
["Tariff","Tariff nameBillcode","Tx zone","Voltage","Billcode",null,null,null,"VAT incl"]
["Nightsave Large","NL",0,1,{"$f":"B47&C47&D47&IF($A$2=\"Non-municipal\",\"N\",IF($A$2=\"Municiple\",\"Y\",\"error\"))","v":"NL01Y"},null,null,6.39,{"$f":"ROUND(H47 * (1 + VAT), 2)","v":7.28}]

{"sheet":"Nightsave Small inc","index":5,"n_rows":48,"n_cols":33,"rows_kept":48,"cut":false,"hidden":false,"merged":[[1,6,1,16],[1,17,1,18],[3,9,3,12],[3,13,3,16],[3,17,5,18],[4,7,6,7],[4,9,5,10],[4,11,5,12],[4,13,5,14],[4,15,5,16],[28,7,28,8],[7,7,10,7],[11,7,14,7],[15,7,18,7],[19,7,22,7],[25,7,25,14],[25,19,25,20],[26,9,27,10],[26,11,27,12],[26,13,27,14],[27,17,27,18],[35,10,36,11],[43,7,45,8],[43,9,44,10],[45,9,45,10],[29,7,29,8],[30,7,30,8],[31,7,31,8],[32,7,32,8],[35,7,36,7],[35,8,36,9]]}
[null,null,null,null,null,null,"Back to menu"]
["Non-municipal",null,null,null,null,null,"Nightsave Urban Small tariff  ",null,null,null,null,null,null,null,null,null,null,"Non-local authority",null,null,null,null,null,null,null,null,null,null,null,null,null,{"$f":"SUM(#REF!,#REF!,#REF!,#REF!,#REF!,#REF!,#REF!,#REF!,#REF!)","v":{"$error":"#REF!"}},"check value"]
[]
[null,null,null,null,null,null,null,null,null,"Active energy charge [c/kWh]",null,null,null,"Energy demand charge [R/kVA/m]",null,null,null,"Transmission network charges [R/kVA/m]"]
[null,null,null,null,null,null,null,"Transmission zone",null,"High demand season \n[Jun - Aug]",null,"Low demand season \n[Sep - May]",null,"High demand season \n[Jun - Aug]",null,"Low demand season \n[Sep - May]"]
[null,null,null,null,null,null,null,null,"Voltage"]
["Tariff","Tariff nameBillcode","Tx zone","Voltage","Billcode",null,null,null,null,"","VAT incl",null,"VAT incl","","VAT incl",null,"VAT incl",null,"VAT incl"]
["Nightsave Small","NS",0,1,{"$f":"B8&C8&D8&IF($A$2=\"Non-municipal\",\"N\",IF($A$2=\"Municiple\",\"Y\",\"error\"))","v":"NS01N"},null,null,"≤ 300km","< 500V",61.48,{"$f":"ROUND(J8 * (1 + VAT), 2)","v":70.09},47.8,{"$f":"ROUND(L8 * (1 + VAT), 2)","v":54.49},131.38999999999999,{"$f":"ROUND(N8 * (1 + VAT), 2)","v":149.78},16.93,{"$f":"ROUND(P8 * (1 + VAT), 2)","v":19.3},7.12,{"$f":"ROUND(R8 * (1 + VAT), 2)","v":8.1199999999999992}]
["Nightsave Small","NS",0,2,{"$f":"B9&C9&D9&IF($A$2=\"Non-municipal\",\"N\",IF($A$2=\"Municiple\",\"Y\",\"error\"))","v":"NS02N"},null,null,null,"≥ 500V & < 66kV",58.23,66.38,45.45,51.81,127.16,144.96,16.36,18.649999999999999,6.51,7.42]
["Nightsave Small","NS",0,3,"NS03N",null,null,null,"≥ 66kV & ≤ 132kV",57.8,65.89,44.9,51.19,122.48,139.63,15.75,17.96,6.34,7.23]
["Nightsave Small","NS",0,4,"NS04N",null,null,null,"> 132kV*",54.07,61.64,42.04,47.93,118.2,134.75,15.2,17.329999999999998,8.01,9.1300000000000008]
["Nightsave Small","NS",1,1,"NS11N",null,null,"> 300km and \n≤ 600km","< 500V",62.31,71.03,48.32,55.08,132.72999999999999,151.31,17.07,19.46,7.18,8.19]
["Nightsave Small","NS",1,2,"NS12N",null,null,null,"≥ 500V & < 66kV",59.44,67.760000000000005,46.37,52.86,128.44,146.41999999999999,16.52,18.829999999999998,6.57,7.49]
["Nightsave Small","NS",1,3,"NS13N",null,null,null,"≥ 66kV & ≤ 132kV",59,67.260000000000005,45.81,52.22,123.74,141.06,15.92,18.149999999999999,6.39,7.28]
["Nightsave Small","NS",1,4,"NS14N",null,null,null,"> 132kV*",55.2,62.93,42.9,48.91,119.38,136.09,15.36,17.510000000000002,8.09,9.2200000000000006]
["Nightsave Small","NS",2,1,"NS21N",null,null,"> 600km and \n≤ 900km","< 500V",62.89,71.69,48.79,55.62,134.03,152.79,17.23,19.64,7.27,8.2899999999999991]
["Nightsave Small","NS",2,2,"NS22N",null,null,null,"≥ 500V & < 66kV",60.04,68.45,46.85,53.41,129.75,147.91999999999999,16.690000000000001,19.03,6.63,7.56]
["Nightsave Small","NS",2,3,"NS23N",null,null,null,"≥ 66kV & ≤ 132kV",59.59,67.930000000000007,46.27,52.75,124.98,142.47999999999999,16.079999999999998,18.329999999999998,6.43,7.33]
["Nightsave Small","NS",2,4,"NS24N",null,null,null,"> 132kV*",55.74,63.54,43.34,49.41,120.56,137.44,15.51,17.68,8.1999999999999993,9.35]
["Nightsave Small","NS",3,1,"NS31N",null,null,"> 900km","< 500V",63.56,72.459999999999994,49.29,56.19,135.4,154.36000000000001,17.41,19.850000000000001,7.29,8.31]
["Nightsave Small","NS",3,2,"NS32N",null,null,null,"≥ 500V & < 66kV",60.62,69.11,47.3,53.92,131.02000000000001,149.36000000000001,16.86,19.22,6.71,7.65]
["Nightsave Small","NS",3,3,"NS33N",null,null,null,"≥ 66kV & ≤ 132kV",60.2,68.63,46.73,53.27,126.26,143.94,16.25,18.53,6.48,7.39]
["Nightsave Small","NS",3,4,"NS34N",null,null,null,"> 132kV*",56.33,64.22,43.81,49.94,121.82,138.87,15.69,17.89,8.26,9.42]
[null,null,null,null,null,null,null,null,"* 132 kV or Transmission connected"]
[]
[null,null,null,null,null,null,null,"Distribution network charges"]
[null,null,null,null,null,null,null,null,null,"Network capacity charge \n[R/kVA/m]",null,"Network demand charge \n[R/kVA/m]",null,"Urban low voltage subsidy charge [R/kVA/m]"]
[null,null,null,null,null,null,null,null,null,null,null,null,null,null,null,null,null,"Ancillary service charge [c/kWh]"]
["Tariff","Tariff nameBillcode","Tx zone","Voltage","Billcode",null,null,"Voltage",null,null,"VAT incl",null,"VAT incl",null,"VAT incl",null,"Voltage",null,"VAT incl"]
["Nightsave Small","NS",0,1,{"$f":"B30&C30&D30&IF($A$2=\"Non-municipal\",\"N\",IF($A$2=\"Municiple\",\"Y\",\"error\"))","v":"NS01N"},null,null,"< 500V",null,14.15,{"$f":"ROUND(J30 * (1 + VAT), 2)","v":16.13},26.83,{"$f":"ROUND(L30 * (1 + VAT), 2)","v":30.59},0,{"$f":"ROUND(N30 * (1 + VAT), 2)","v":0},null,"< 500V",0.33,{"$f":"ROUND(R30 * (1 + VAT), 2)","v":0.38}]
["Nightsave Small","NS",0,2,{"$f":"B31&C31&D31&IF($A$2=\"Non-municipal\",\"N\",IF($A$2=\"Municiple\",\"Y\",\"error\"))","v":"NS02N"},null,null,"≥ 500V & < 66kV",null,12.98,{"$f":"ROUND(J31 * (1 + VAT), 2)","v":14.8},24.62,{"$f":"ROUND(L31 * (1 + VAT), 2)","v":28.07},0,{"$f":"ROUND(N31 * (1 + VAT), 2)","v":0},null,"≥ 500V & < 66kV",0.32,{"$f":"ROUND(R31 * (1 + VAT), 2)","v":0.36}]
["Nightsave Small","NS",0,3,"NS03N",null,null,"≥ 66kV & ≤ 132kV",null,4.63,{"$f":"ROUND(J32 * (1 + VAT), 2)","v":5.28},8.58,{"$f":"ROUND(L32 * (1 + VAT), 2)","v":9.7799999999999994},11.43,{"$f":"ROUND(N32 * (1 + VAT), 2)","v":13.03},null,"≥ 66kV & ≤ 132kV",0.3,{"$f":"ROUND(R32 * (1 + VAT), 2)","v":0.34}]
["Nightsave Small","NS",0,4,"NS04N",null,null,"> 132kV / Transmission connected",null,0,{"$f":"ROUND(J33 * (1 + VAT), 2)","v":0},0,{"$f":"ROUND(L33 * (1 + VAT), 2)","v":0},11.43,{"$f":"ROUND(N33 * (1 + VAT), 2)","v":13.03},null,"> 132kV*",0.28000000000000003,{"$f":"ROUND(R33 * (1 + VAT), 2)","v":0.32}]
[null,null,null,null,null,null,null,null,null,null,null,null,null,null,null,null,"* 132 kV or Transmission connected"]
[]
[null,null,null,null,null,null,null,"Customer categories","Service charge  [R/account/day]",null,"Administration charge  [R/POD/day]"]
[]
["Tariff","Tariff nameBillcode","Tx zone","Voltage","Billcode",null,null,null,null,"VAT incl",null,"VAT incl"]
["Nightsave Small","NS",0,1,{"$f":"B39&C39&D39&IF($A$2=\"Non-municipal\",\"N\",IF($A$2=\"Municiple\",\"Y\",\"error\"))","v":"NS01N"},null,null,"≤ 100 kVA",11.55,{"$f":"ROUND(I39 * (1 + VAT), 2)","v":13.17},2.54,{"$f":"ROUND(K39 * (1 + VAT), 2)","v":2.9}]
["Nightsave Small","NS",0,1,{"$f":"B40&C40&D40&IF($A$2=\"Non-municipal\",\"N\",IF($A$2=\"Municiple\",\"Y\",\"error\"))","v":"NS01N"},null,null,"> 100 kVA & ≤ 500 kVA",52.8,{"$f":"ROUND(I40 * (1 + VAT), 2)","v":60.19},14.8,{"$f":"ROUND(K40 * (1 + VAT), 2)","v":16.87}]
["Nightsave Small","NS",0,1,{"$f":"B41&C41&D41&IF($A$2=\"Non-municipal\",\"N\",IF($A$2=\"Municiple\",\"Y\",\"error\"))","v":"NS01N"},null,null,"> 500 kVA & ≤ 1 MVA",162.47999999999999,{"$f":"ROUND(I41 * (1 + VAT), 2)","v":185.23},29.41,{"$f":"ROUND(K41 * (1 + VAT), 2)","v":33.53}]
["Nightsave Small","NS",0,1,{"$f":"B42&C42&D42&IF($A$2=\"Non-municipal\",\"N\",IF($A$2=\"Municiple\",\"Y\",\"error\"))","v":"NS01N"},null,null,"Key customers",3183.88,{"$f":"ROUND(I42 * (1 + VAT), 2)","v":3629.62},101.68,{"$f":"ROUND(K42 * (1 + VAT), 2)","v":115.92}]
[]
[null,null,null,null,null,null,null,"Electrification and rural network subsidy charge  [c/kWh]",null,"Affordability subsidy charge [c/kWh] \nOnly payable by non-local authority tariffs"]
[]
[null,null,null,null,null,null,null,null,null,"All seasons"]
["Tariff","Tariff nameBillcode","Tx zone","Voltage","Billcode",null,null,null,"VAT incl",null,"VAT incl"]
["Nightsave Small","NS",0,1,{"$f":"B48&C48&D48&IF($A$2=\"Non-municipal\",\"N\",IF($A$2=\"Municiple\",\"Y\",\"error\"))","v":"NS01N"},null,null,6.33,{"$f":"ROUND(H48 * (1 + VAT), 2)","v":7.22},2.44,{"$f":"ROUND(J48 * (1 + VAT), 2)","v":2.78}]

{"sheet":"Nightsave Small Munic inc","index":6,"n_rows":48,"n_cols":33,"rows_kept":48,"cut":false,"hidden":false,"merged":[[1,6,1,16],[1,17,1,18],[3,9,3,12],[3,13,3,16],[3,17,5,18],[4,7,6,7],[4,9,5,10],[4,11,5,12],[4,13,5,14],[4,15,5,16],[28,7,28,8],[7,7,10,7],[11,7,14,7],[15,7,18,7],[19,7,22,7],[25,7,25,14],[25,19,25,20],[26,9,27,10],[26,11,27,12],[26,13,27,14],[27,17,27,18],[35,10,36,11],[43,7,45,8],[29,7,29,8],[30,7,30,8],[31,7,31,8],[32,7,32,8],[35,7,36,7],[35,8,36,9]]}
[null,null,null,null,null,null,"Back to menu"]
["Municiple",null,null,null,null,null,"Nightsave Urban Small tariff  ",null,null,null,null,null,null,null,null,null,null,"Local authority",null,null,null,null,null,null,null,null,null,null,null,null,null,{"$f":"SUM(#REF!,#REF!,#REF!,#REF!,#REF!,#REF!,#REF!,#REF!,#REF!)","v":{"$error":"#REF!"}},"check value"]
[]
[null,null,null,null,null,null,null,null,null,"Active energy charge [c/kWh]",null,null,null,"Energy demand charge [R/kVA/m]",null,null,null,"Transmission network charges [R/kVA/m]"]
[null,null,null,null,null,null,null,"Transmission zone",null,"High demand season \n[Jun - Aug]",null,"Low demand season \n[Sep - May]",null,"High demand season \n[Jun - Aug]",null,"Low demand season \n[Sep - May]"]
[null,null,null,null,null,null,null,null,"Voltage"]
["Tariff","Tariff nameBillcode","Tx zone","Voltage","Billcode",null,null,null,null,"","VAT incl",null,"VAT incl","","VAT incl",null,"VAT incl",null,"VAT incl"]
["Nightsave Small","NS",0,1,{"$f":"B8&C8&D8&IF($A$2=\"Non-municipal\",\"N\",IF($A$2=\"Municiple\",\"Y\",\"error\"))","v":"NS01Y"},null,null,"≤ 300km","< 500V",63.85,{"$f":"ROUND(J8 * (1 + VAT), 2)","v":72.790000000000006},49.65,{"$f":"ROUND(L8 * (1 + VAT), 2)","v":56.6},133.88,{"$f":"ROUND(N8 * (1 + VAT), 2)","v":152.62},17.260000000000002,{"$f":"ROUND(P8 * (1 + VAT), 2)","v":19.68},7.2,{"$f":"ROUND(R8 * (1 + VAT), 2)","v":8.2100000000000009}]
["Nightsave Small","NS",0,2,{"$f":"B9&C9&D9&IF($A$2=\"Non-municipal\",\"N\",IF($A$2=\"Municiple\",\"Y\",\"error\"))","v":"NS02Y"},null,null,null,"≥ 500V & < 66kV",60.47,68.94,47.19,53.8,129.58000000000001,147.72,16.670000000000002,19,6.57,7.49]
["Nightsave Small","NS",0,3,"NS03Y",null,null,null,"≥ 66kV & ≤ 132kV",60.02,68.42,46.61,53.14,124.82,142.29,16.05,18.3,6.4,7.3]
["Nightsave Small","NS",0,4,"NS04Y",null,null,null,"> 132kV*",56.15,64.010000000000005,43.66,49.77,120.44,137.30000000000001,15.49,17.66,8.09,9.2200000000000006]
["Nightsave Small","NS",1,1,"NS11Y",null,null,"> 300km and \n≤ 600km","< 500V",64.69,73.75,50.19,57.22,135.26,154.19999999999999,17.399999999999999,19.84,7.24,8.25]
["Nightsave Small","NS",1,2,"NS12Y",null,null,null,"≥ 500V & < 66kV",61.72,70.36,48.15,54.89,130.9,149.22999999999999,16.829999999999998,19.190000000000001,6.64,7.57]
["Nightsave Small","NS",1,3,"NS13Y",null,null,null,"≥ 66kV & ≤ 132kV",61.27,69.849999999999994,47.58,54.24,126.11,143.77000000000001,16.22,18.489999999999998,6.44,7.34]
["Nightsave Small","NS",1,4,"NS14Y",null,null,null,"> 132kV*",57.31,65.33,44.55,50.79,121.65,138.68,15.65,17.84,8.17,9.31]
["Nightsave Small","NS",2,1,"NS21Y",null,null,"> 600km and \n≤ 900km","< 500V",65.31,74.45,50.67,57.76,136.6,155.72,17.559999999999999,20.02,7.33,8.36]
["Nightsave Small","NS",2,2,"NS22Y",null,null,null,"≥ 500V & < 66kV",62.34,71.069999999999993,48.65,55.46,132.21,150.72,17,19.38,6.69,7.63]
["Nightsave Small","NS",2,3,"NS23Y",null,null,null,"≥ 66kV & ≤ 132kV",61.88,70.540000000000006,48.06,54.79,127.37,145.19999999999999,16.38,18.670000000000002,6.5,7.41]
["Nightsave Small","NS",2,4,"NS24Y",null,null,null,"> 132kV*",57.89,65.989999999999995,45,51.3,122.85,140.05000000000001,15.8,18.010000000000002,8.2799999999999994,9.44]
["Nightsave Small","NS",3,1,"NS31Y",null,null,"> 900km","< 500V",66,75.239999999999995,51.18,58.35,137.97999999999999,157.30000000000001,17.739999999999998,20.22,7.37,8.4]
["Nightsave Small","NS",3,2,"NS32Y",null,null,null,"≥ 500V & < 66kV",62.96,71.77,49.12,56,133.52000000000001,152.21,17.170000000000002,19.57,6.76,7.71]
["Nightsave Small","NS",3,3,"NS33Y",null,null,null,"≥ 66kV & ≤ 132kV",62.5,71.25,48.53,55.32,128.66,146.66999999999999,16.55,18.87,6.55,7.47]
["Nightsave Small","NS",3,4,"NS34Y",null,null,null,"> 132kV*",58.51,66.7,45.5,51.87,124.14,141.52000000000001,15.98,18.22,8.34,9.51]
[null,null,null,null,null,null,null,null,"* 132 kV or Transmission connected"]
[]
[null,null,null,null,null,null,null,"Distribution network charges"]
[null,null,null,null,null,null,null,null,null,"Network capacity charge \n[R/kVA/m]",null,"Network demand charge \n[R/kVA/m]",null,"Urban low voltage subsidy charge [R/kVA/m]"]
[null,null,null,null,null,null,null,null,null,null,null,null,null,null,null,null,null,"Ancillary service charge [c/kWh]"]
["Tariff","Tariff nameBillcode","Tx zone","Voltage","Billcode",null,null,"Voltage",null,null,"VAT incl",null,"VAT incl",null,"VAT incl",null,"Voltage",null,"VAT incl"]
["Nightsave Small","NS",0,1,{"$f":"B30&C30&D30&IF($A$2=\"Non-municipal\",\"N\",IF($A$2=\"Municiple\",\"Y\",\"error\"))","v":"NS01Y"},null,null,"< 500V",null,14.36,{"$f":"ROUND(J30 * (1 + VAT), 2)","v":16.37},27.22,{"$f":"ROUND(L30 * (1 + VAT), 2)","v":31.03},0,{"$f":"ROUND(N30 * (1 + VAT), 2)","v":0},null,"< 500V",0.33,{"$f":"ROUND(R30 * (1 + VAT), 2)","v":0.38}]
["Nightsave Small","NS",0,2,{"$f":"B31&C31&D31&IF($A$2=\"Non-municipal\",\"N\",IF($A$2=\"Municiple\",\"Y\",\"error\"))","v":"NS02Y"},null,null,"≥ 500V & < 66kV",null,13.17,{"$f":"ROUND(J31 * (1 + VAT), 2)","v":15.01},24.97,{"$f":"ROUND(L31 * (1 + VAT), 2)","v":28.47},0,{"$f":"ROUND(N31 * (1 + VAT), 2)","v":0},null,"≥ 500V & < 66kV",0.32,{"$f":"ROUND(R31 * (1 + VAT), 2)","v":0.36}]
["Nightsave Small","NS",0,3,"NS03Y",null,null,"≥ 66kV & ≤ 132kV",null,4.71,{"$f":"ROUND(J32 * (1 + VAT), 2)","v":5.37},8.7100000000000009,{"$f":"ROUND(L32 * (1 + VAT), 2)","v":9.93},11.53,{"$f":"ROUND(N32 * (1 + VAT), 2)","v":13.14},null,"≥ 66kV & ≤ 132kV",0.31,{"$f":"ROUND(R32 * (1 + VAT), 2)","v":0.35}]
["Nightsave Small","NS",0,4,"NS04Y",null,null,"> 132kV / Transmission connected",null,0,{"$f":"ROUND(J33 * (1 + VAT), 2)","v":0},0,{"$f":"ROUND(L33 * (1 + VAT), 2)","v":0},11.53,{"$f":"ROUND(N33 * (1 + VAT), 2)","v":13.14},null,"> 132kV*",0.28999999999999998,{"$f":"ROUND(R33 * (1 + VAT), 2)","v":0.33}]
[null,null,null,null,null,null,null,null,null,null,null,null,null,null,null,null,"* 132 kV or Transmission connected"]
[]
[null,null,null,null,null,null,null,"Customer categories","Service charge  [R/account/day]",null,"Administration charge  [R/POD/day]"]
[]
["Tariff","Tariff nameBillcode","Tx zone","Voltage","Billcode",null,null,null,null,"VAT incl",null,"VAT incl"]
["Nightsave Small","NS",0,1,{"$f":"B39&C39&D39&IF($A$2=\"Non-municipal\",\"N\",IF($A$2=\"Municiple\",\"Y\",\"error\"))","v":"NS01Y"},null,null,"≤ 100 kVA",11.66,{"$f":"ROUND(I39 * (1 + VAT), 2)","v":13.29},2.56,{"$f":"ROUND(K39 * (1 + VAT), 2)","v":2.92}]
["Nightsave Small","NS",0,1,{"$f":"B40&C40&D40&IF($A$2=\"Non-municipal\",\"N\",IF($A$2=\"Municiple\",\"Y\",\"error\"))","v":"NS01Y"},null,null,"> 100 kVA & ≤ 500 kVA",53.3,{"$f":"ROUND(I40 * (1 + VAT), 2)","v":60.76},14.94,{"$f":"ROUND(K40 * (1 + VAT), 2)","v":17.03}]
["Nightsave Small","NS",0,1,{"$f":"B41&C41&D41&IF($A$2=\"Non-municipal\",\"N\",IF($A$2=\"Municiple\",\"Y\",\"error\"))","v":"NS01Y"},null,null,"> 500 kVA & ≤ 1 MVA",164.04,{"$f":"ROUND(I41 * (1 + VAT), 2)","v":187.01},29.7,{"$f":"ROUND(K41 * (1 + VAT), 2)","v":33.86}]
["Nightsave Small","NS",0,1,{"$f":"B42&C42&D42&IF($A$2=\"Non-municipal\",\"N\",IF($A$2=\"Municiple\",\"Y\",\"error\"))","v":"NS01Y"},null,null,"Key customers",3214.52,{"$f":"ROUND(I42 * (1 + VAT), 2)","v":3664.55},102.66,{"$f":"ROUND(K42 * (1 + VAT), 2)","v":117.03}]
[]
[null,null,null,null,null,null,null,"Electrification and rural network subsidy charge  [c/kWh]"]
[]
[]
["Tariff","Tariff nameBillcode","Tx zone","Voltage","Billcode",null,null,null,"VAT incl"]
["Nightsave Small","NS",0,1,{"$f":"B48&C48&D48&IF($A$2=\"Non-municipal\",\"N\",IF($A$2=\"Municiple\",\"Y\",\"error\"))","v":"NS01Y"},null,null,6.39,{"$f":"ROUND(H48 * (1 + VAT), 2)","v":7.28}]

{"sheet":"Megaflex inc","index":7,"n_rows":46,"n_cols":33,"rows_kept":46,"cut":false,"hidden":false,"merged":[[27,18,27,19],[28,7,28,8],[11,7,14,7],[7,7,10,7],[30,7,30,8],[30,16,30,17],[15,7,18,7],[19,7,22,7],[25,7,25,14],[26,9,27,10],[26,11,27,12],[26,13,27,14],[28,16,28,17],[29,7,29,8],[29,16,29,17],[1,6,1,16],[1,17,1,22],[3,9,3,20],[4,7,6,7],[4,9,4,14],[4,15,4,20],[5,9,5,10],[5,11,5,12],[5,13,5,14],[5,15,5,16],[5,17,5,18],[5,19,5,20],[3,21,5,22],[31,7,31,8],[31,16,31,17],[38,7,38,8],[41,9,42,10],[43,9,43,10],[32,7,32,8],[32,16,32,17],[35,7,35,8],[35,9,36,10],[35,11,36,12],[35,16,35,19],[36,16,36,17],[36,18,36,19],[37,7,37,8],[39,7,39,8],[41,7,41,8]]}
[null,null,null,null,null,null,"Back to menu"]
["Non-municipal",null,null,null,null,null,"Megaflex tariff",null,null,null,null,null,null,null,null,null,null,"Non-local authority",null,null,null,null,null,null,null,null,null,null,null,null,null,{"$f":"SUM(J8:T23,V8:V23,#REF!,#REF!,#REF!,#REF!,H26:J26,L26)","v":{"$error":"#REF!"}},"check value"]
[]
[null,null,null,null,null,null,null,null,null,"Active energy charge [c/kWh]",null,null,null,null,null,null,null,null,null,null,null,"Transmission network charges [R/kVA/m]"]
[null,null,null,null,null,null,null,"Transmission zone",null,"High demand season [Jun - Aug]",null,null,null,null,null,"Low demand season [Sep - May]"]
[null,null,null,null,null,null,null,null,"Voltage","Peak",null,"Standard",null,"Off Peak",null,"Peak",null,"Standard",null,"Off Peak"]
["Tariff","Tariff nameBillcode","Tx zone","Voltage","Billcode",null,null,null,null,"","VAT incl",null,"VAT incl",null,"VAT incl",null,"VAT incl",null,"VAT incl",null,"VAT incl",null,"VAT incl"]
["Megaflex","Me",0,1,{"$f":"B8&C8&D8&IF($A$2=\"Non-municipal\",\"N\",IF($A$2=\"Municiple\",\"Y\",\"error\"))","v":"Me01N"},null,null,"≤ 300km","< 500V",248.94,{"$f":"ROUND(J8 * (1 + VAT), 2)","v":283.79000000000002},75.739999999999995,{"$f":"ROUND(L8 * (1 + VAT), 2)","v":86.34},41.35,{"$f":"ROUND(N8 * (1 + VAT), 2)","v":47.14},81.52,{"$f":"ROUND(P8 * (1 + VAT), 2)","v":92.93},56.25,{"$f":"ROUND(R8 * (1 + VAT), 2)","v":64.13},35.86,{"$f":"ROUND(T8 * (1 + VAT), 2)","v":40.880000000000003},7.12,{"$f":"ROUND(V8 * (1 + VAT), 2)","v":8.1199999999999992}]
["Megaflex","Me",0,2,{"$f":"B9&C9&D9&IF($A$2=\"Non-municipal\",\"N\",IF($A$2=\"Municiple\",\"Y\",\"error\"))","v":"Me02N"},null,null,null,"≥ 500V & < 66kV",245.03,279.33,74.23,84.62,40.31,45.95,79.930000000000007,91.12,55.02,62.72,34.9,39.79,6.51,7.42]
["Megaflex","Me",0,3,"Me03N",null,null,null,"≥ 66kV & ≤ 132kV",237.28,270.5,71.87,81.93,39.04,44.51,77.41,88.25,53.27,60.73,33.799999999999997,38.53,6.34,7.23]
["Megaflex","Me",0,4,"Me04N",null,null,null,"> 132kV*",223.63,254.94,67.739999999999995,77.22,36.79,41.94,72.959999999999994,83.17,50.2,57.23,31.86,36.32,8.01,9.1300000000000008]
["Megaflex","Me",1,1,"Me11N",null,null,"> 300km and \n≤ 600km","< 500V",250.97,286.11,76.040000000000006,86.69,41.29,47.07,81.87,93.33,56.36,64.25,35.76,40.770000000000003,7.18,8.19]
["Megaflex","Me",1,2,"Me12N",null,null,null,"≥ 500V & < 66kV",247.48,282.13,74.97,85.47,40.71,46.41,80.739999999999995,92.04,55.56,63.34,35.25,40.19,6.57,7.49]
["Megaflex","Me",1,3,"Me13N",null,null,null,"≥ 66kV & ≤ 132kV",239.61,273.16000000000003,72.58,82.74,39.409999999999997,44.93,78.16,89.1,53.79,61.32,34.119999999999997,38.9,6.39,7.28]
["Megaflex","Me",1,4,"Me14N",null,null,null,"> 132kV*",225.86,257.48,68.430000000000007,78.010000000000005,37.14,42.34,73.67,83.98,50.7,57.8,32.159999999999997,36.659999999999997,8.09,9.2200000000000006]
["Megaflex","Me",2,1,"Me21N",null,null,"> 600km and \n≤ 900km","< 500V",253.47,288.95999999999998,76.78,87.53,41.68,47.52,82.69,94.27,56.91,64.88,36.090000000000003,41.14,7.27,8.2899999999999991]
["Megaflex","Me",2,2,"Me22N",null,null,null,"≥ 500V & < 66kV",249.96,284.95,75.73,86.33,41.12,46.88,81.540000000000006,92.96,56.12,63.98,35.6,40.58,6.63,7.56]
["Megaflex","Me",2,3,"Me23N",null,null,null,"≥ 66kV & ≤ 132kV",242.05,275.94,73.33,83.6,39.81,45.38,78.95,90,54.34,61.95,34.47,39.299999999999997,6.43,7.33]
["Megaflex","Me",2,4,"Me24N",null,null,null,"> 132kV*",228.14,260.08,69.099999999999994,78.77,37.54,42.8,74.42,84.84,51.22,58.39,32.5,37.049999999999997,8.1999999999999993,9.35]
["Megaflex","Me",3,1,"Me31N",null,null,"> 900km","< 500V",256.02,291.86,77.58,88.44,42.12,48.02,83.53,95.22,57.48,65.53,36.479999999999997,41.59,7.29,8.31]
["Megaflex","Me",3,2,"Me32N",null,null,null,"≥ 500V & < 66kV",252.45,287.79000000000002,76.47,87.18,41.51,47.32,82.34,93.87,56.66,64.59,35.950000000000003,40.98,6.71,7.65]
["Megaflex","Me",3,3,"Me33N",null,null,null,"≥ 66kV & ≤ 132kV",244.48,278.70999999999998,74.06,84.43,40.21,45.84,79.739999999999995,90.9,54.89,62.57,34.82,39.69,6.48,7.39]
["Megaflex","Me",3,4,"Me34N",null,null,null,"> 132kV*",230.37,262.62,69.819999999999993,79.59,37.93,43.24,75.19,85.72,51.76,59.01,32.86,37.46,8.26,9.42]
[null,null,null,null,null,null,null,null,"* 132 kV or Transmission connected"]
[]
[null,null,null,null,null,null,null,"Distribution network charges"]
[null,null,null,null,null,null,null,null,null,"Network capacity charge [R/kVA/m]",null,"Network demand charge [R/kVA/m]",null,"Urban low voltage subsidy charge [R/kVA/m]"]
[null,null,null,null,null,null,null,null,null,null,null,null,null,null,null,null,null,null,"Ancillary service charge [c/kWh]"]
["Tariff","Tariff nameBillcode","Tx zone","Voltage","Billcode",null,null,"Voltage",null,null,"VAT incl",null,"VAT incl",null,"VAT incl",null,"Voltage",null,null,"VAT incl"]
["Megaflex","Me",0,1,{"$f":"B30&C30&D30&IF($A$2=\"Non-municipal\",\"N\",IF($A$2=\"Municiple\",\"Y\",\"error\"))","v":"Me01N"},null,null,"< 500V",null,14.15,{"$f":"ROUND(J30 * (1 + VAT), 2)","v":16.13},26.83,{"$f":"ROUND(L30 * (1 + VAT), 2)","v":30.59},0,{"$f":"ROUND(N30 * (1 + VAT), 2)","v":0},null,"< 500V",null,0.33,{"$f":"ROUND(S30 * (1 + VAT), 2)","v":0.38}]
["Megaflex","Me",0,2,{"$f":"B31&C31&D31&IF($A$2=\"Non-municipal\",\"N\",IF($A$2=\"Municiple\",\"Y\",\"error\"))","v":"Me02N"},null,null,"≥ 500V & < 66kV",null,12.98,{"$f":"ROUND(J31 * (1 + VAT), 2)","v":14.8},24.62,{"$f":"ROUND(L31 * (1 + VAT), 2)","v":28.07},0,{"$f":"ROUND(N31 * (1 + VAT), 2)","v":0},null,"≥ 500V & < 66kV",null,0.32,{"$f":"ROUND(S31 * (1 + VAT), 2)","v":0.36}]
["Megaflex","Me",0,3,"Me03N",null,null,"≥ 66kV & ≤ 132kV",null,4.63,{"$f":"ROUND(J32 * (1 + VAT), 2)","v":5.28},8.58,{"$f":"ROUND(L32 * (1 + VAT), 2)","v":9.7799999999999994},11.43,{"$f":"ROUND(N32 * (1 + VAT), 2)","v":13.03},null,"≥ 66kV & ≤ 132kV",null,0.3,{"$f":"ROUND(S32 * (1 + VAT), 2)","v":0.34}]
["Megaflex","Me",0,4,"Me04N",null,null,"> 132kV / Transmission connected",null,0,{"$f":"ROUND(J33 * (1 + VAT), 2)","v":0},0,{"$f":"ROUND(L33 * (1 + VAT), 2)","v":0},11.43,{"$f":"ROUND(N33 * (1 + VAT), 2)","v":13.03},null,"> 132kV / Transmission connected",null,0.28000000000000003,{"$f":"ROUND(S33 * (1 + VAT), 2)","v":0.32}]
[]
[]
[null,null,null,null,null,null,null,"Customer categories",null,"Service charge  [R/account/day]",null,"Administration charge  [R/POD/day]",null,null,null,null,"Reactive energy charge  [c/kVArh]"]
[null,null,null,null,null,null,null,null,null,null,null,null,null,null,null,null,"High season",null,"Low season"]
["Tariff","Tariff nameBillcode","Tx zone","Voltage","Billcode",null,null,null,null,null,"VAT incl",null,"VAT incl",null,null,null,null,"VAT incl",null,"VAT incl"]
["Megaflex","Me",0,1,{"$f":"B39&C39&D39&IF($A$2=\"Non-municipal\",\"N\",IF($A$2=\"Municiple\",\"Y\",\"error\"))","v":"Me01N"},null,null,"> 1 MVA",null,162.47999999999999,{"$f":"ROUND(J39 * (1 + VAT), 2)","v":185.23},73.23,{"$f":"ROUND(L39 * (1 + VAT), 2)","v":83.48},null,null,null,11.44,{"$f":"ROUND(Q39 * (1 + VAT), 2)","v":13.04},0,{"$f":"ROUND(S39 * (1 + VAT), 2)","v":0}]
["Megaflex","Me",0,1,{"$f":"B40&C40&D40&IF($A$2=\"Non-municipal\",\"N\",IF($A$2=\"Municiple\",\"Y\",\"error\"))","v":"Me01N"},null,null,"Key customers",null,3183.88,{"$f":"ROUND(J40 * (1 + VAT), 2)","v":3629.62},101.68,{"$f":"ROUND(L40 * (1 + VAT), 2)","v":115.92}]
[]
[null,null,null,null,null,null,null,"Electrification and rural network subsidy charge\n [c/kWh]",null,"Affordability subsidy charge [c/kWh] \nOnly payable by non-local authority tariffs"]
[]
[null,null,null,null,null,null,null,"All seasons",null,"All seasons"]
["Tariff","Tariff nameBillcode","Tx zone","Voltage","Billcode",null,null,null,"VAT incl",null,"VAT incl"]
["Megaflex","Me",0,1,{"$f":"B46&C46&D46&IF($A$2=\"Non-municipal\",\"N\",IF($A$2=\"Municiple\",\"Y\",\"error\"))","v":"Me01N"},null,null,6.33,{"$f":"ROUND(H46 * (1 + VAT), 2)","v":7.22},2.44,{"$f":"ROUND(J46 * (1 + VAT), 2)","v":2.78}]

{"sheet":"Megaflex Munic inc ","index":8,"n_rows":46,"n_cols":33,"rows_kept":46,"cut":false,"hidden":false,"merged":[[7,7,10,7],[30,7,30,8],[30,16,30,17],[15,7,18,7],[19,7,22,7],[25,7,25,14],[26,9,27,10],[26,11,27,12],[26,13,27,14],[39,7,39,8],[38,7,38,8],[37,7,37,8],[41,7,41,8],[1,6,1,16],[31,7,31,8],[31,16,31,17],[32,7,32,8],[32,16,32,17],[35,7,35,8],[35,9,36,10],[35,11,36,12],[35,16,35,19],[36,16,36,17],[36,18,36,19],[11,7,14,7],[1,17,1,22],[3,9,3,20],[4,7,6,7],[4,9,4,14],[4,15,4,20],[5,9,5,10],[5,11,5,12],[5,13,5,14],[5,15,5,16],[5,17,5,18],[5,19,5,20],[3,21,5,22],[27,18,27,19],[28,7,28,8],[28,16,28,17],[29,7,29,8],[29,16,29,17]]}
[null,null,null,null,null,null,"Back to menu",null,null,null,null,null,null,null,null,null,null,null,null,null,null,null,{"$error":"#REF!"}]
["Municiple",null,null,null,null,null,"Megaflex tariff",null,null,null,null,null,null,null,null,null,null,"Local authority",null,null,null,null,null,null,null,null,null,null,null,null,null,{"$f":"SUM(J8:T23,V8:V23,#REF!,#REF!,#REF!,#REF!,H26:J26,L26)","v":{"$error":"#REF!"}},"check value"]
[]
[null,null,null,null,null,null,null,null,null,"Active energy charge [c/kWh]",null,null,null,null,null,null,null,null,null,null,null,"Transmission network charges [R/kVA/m]"]
[null,null,null,null,null,null,null,"Transmission zone",null,"High demand season [Jun - Aug]",null,null,null,null,null,"Low demand season [Sep - May]"]
[null,null,null,null,null,null,null,null,"Voltage","Peak",null,"Standard",null,"Off Peak",null,"Peak",null,"Standard",null,"Off Peak"]
["Tariff","Tariff nameBillcode","Tx zone","Voltage","Billcode",null,null,null,null,"","VAT incl",null,"VAT incl",null,"VAT incl",null,"VAT incl",null,"VAT incl",null,"VAT incl",null,"VAT incl"]
["Megaflex","Me",0,1,{"$f":"B8&C8&D8&IF($A$2=\"Non-municipal\",\"N\",IF($A$2=\"Municiple\",\"Y\",\"error\"))","v":"Me01Y"},null,null,"≤ 300km","< 500V",258.52999999999997,{"$f":"ROUND(J8 * (1 + VAT), 2)","v":294.72000000000003},78.67,{"$f":"ROUND(L8 * (1 + VAT), 2)","v":89.68},42.93,{"$f":"ROUND(N8 * (1 + VAT), 2)","v":48.94},84.65,{"$f":"ROUND(P8 * (1 + VAT), 2)","v":96.5},58.41,{"$f":"ROUND(R8 * (1 + VAT), 2)","v":66.59},37.229999999999997,{"$f":"ROUND(T8 * (1 + VAT), 2)","v":42.44},7.2,{"$f":"ROUND(V8 * (1 + VAT), 2)","v":8.2100000000000009}]
["Megaflex","Me",0,2,{"$f":"B9&C9&D9&IF($A$2=\"Non-municipal\",\"N\",IF($A$2=\"Municiple\",\"Y\",\"error\"))","v":"Me02Y"},null,null,null,"≥ 500V & < 66kV",254.45,290.07,77.09,87.88,41.86,47.72,83.01,94.63,57.13,65.13,36.25,41.33,6.57,7.49]
["Megaflex","Me",0,3,"Me03Y",null,null,null,"≥ 66kV & ≤ 132kV",246.42,280.92,74.64,85.09,40.53,46.2,80.38,91.63,55.33,63.08,35.090000000000003,40,6.4,7.3]
["Megaflex","Me",0,4,"Me04Y",null,null,null,"> 132kV*",232.24,264.75,70.349999999999994,80.2,38.200000000000003,43.55,75.760000000000005,86.37,52.14,59.44,33.08,37.71,8.09,9.2200000000000006]
["Megaflex","Me",1,1,"Me11Y",null,null,"> 300km and \n≤ 600km","< 500V",260.63,297.12,78.959999999999994,90.01,42.87,48.87,85.03,96.93,58.53,66.72,37.130000000000003,42.33,7.24,8.25]
["Megaflex","Me",1,2,"Me12Y",null,null,null,"≥ 500V & < 66kV",256.99,292.97000000000003,77.849999999999994,88.75,42.28,48.2,83.84,95.58,57.7,65.78,36.6,41.72,6.64,7.57]
["Megaflex","Me",1,3,"Me13Y",null,null,null,"≥ 66kV & ≤ 132kV",248.83,283.67,75.38,85.93,40.92,46.65,81.17,92.53,55.86,63.68,35.43,40.39,6.44,7.34]
["Megaflex","Me",1,4,"Me14Y",null,null,null,"> 132kV*",234.55,267.39,71.06,81.010000000000005,38.58,43.98,76.5,87.21,52.66,60.03,33.4,38.08,8.17,9.31]
["Megaflex","Me",2,1,"Me21Y",null,null,"> 600km and \n≤ 900km","< 500V",263.23,300.08,79.739999999999995,90.9,43.3,49.36,85.86,97.88,59.1,67.37,37.49,42.74,7.33,8.36]
["Megaflex","Me",2,2,"Me22Y",null,null,null,"≥ 500V & < 66kV",259.58,295.92,78.63,89.64,42.7,48.68,84.69,96.55,58.26,66.42,36.97,42.15,6.69,7.63]
["Megaflex","Me",2,3,"Me23Y",null,null,null,"≥ 66kV & ≤ 132kV",251.36,286.55,76.14,86.8,41.34,47.13,81.98,93.46,56.42,64.319999999999993,35.79,40.799999999999997,6.5,7.41]
["Megaflex","Me",2,4,"Me24Y",null,null,null,"> 132kV*",236.91,270.08,71.78,81.83,38.97,44.43,77.290000000000006,88.11,53.19,60.64,33.75,38.479999999999997,8.2799999999999994,9.44]
["Megaflex","Me",3,1,"Me31Y",null,null,"> 900km","< 500V",265.87,303.08999999999997,80.55,91.83,43.74,49.86,86.73,98.87,59.69,68.05,37.869999999999997,43.17,7.37,8.4]
["Megaflex","Me",3,2,"Me32Y",null,null,null,"≥ 500V & < 66kV",262.17,298.87,79.41,90.53,43.13,49.17,85.51,97.48,58.85,67.09,37.33,42.56,6.76,7.71]
["Megaflex","Me",3,3,"Me33Y",null,null,null,"≥ 66kV & ≤ 132kV",253.89,289.43,76.91,87.68,41.77,47.62,82.81,94.4,56.99,64.97,36.159999999999997,41.22,6.55,7.47]
["Megaflex","Me",3,4,"Me34Y",null,null,null,"> 132kV*",239.24,272.73,72.510000000000005,82.66,39.4,44.92,78.08,89.01,53.75,61.28,34.119999999999997,38.9,8.34,9.51]
[null,null,null,null,null,null,null,null,"* 132 kV or Transmission connected"]
[]
[null,null,null,null,null,null,null,"Distribution network charges"]
[null,null,null,null,null,null,null,null,null,"Network capacity charge [R/kVA/m]",null,"Network demand charge [R/kVA/m]",null,"Urban low voltage subsidy charge [R/kVA/m]"]
[null,null,null,null,null,null,null,null,null,null,null,null,null,null,null,null,null,null,"Ancillary service charge [c/kWh]"]
["Tariff","Tariff nameBillcode","Tx zone","Voltage","Billcode",null,null,"Voltage",null,null,"VAT incl",null,"VAT incl",null,"VAT incl",null,"Voltage",null,null,"VAT incl"]
["Megaflex","Me",0,1,{"$f":"B30&C30&D30&IF($A$2=\"Non-municipal\",\"N\",IF($A$2=\"Municiple\",\"Y\",\"error\"))","v":"Me01Y"},null,null,"< 500V",null,14.36,{"$f":"ROUND(J30 * (1 + VAT), 2)","v":16.37},27.22,{"$f":"ROUND(L30 * (1 + VAT), 2)","v":31.03},0,{"$f":"ROUND(N30 * (1 + VAT), 2)","v":0},null,"< 500V",null,0.33,{"$f":"ROUND(S30 * (1 + VAT), 2)","v":0.38}]
["Megaflex","Me",0,2,{"$f":"B31&C31&D31&IF($A$2=\"Non-municipal\",\"N\",IF($A$2=\"Municiple\",\"Y\",\"error\"))","v":"Me02Y"},null,null,"≥ 500V & < 66kV",null,13.17,{"$f":"ROUND(J31 * (1 + VAT), 2)","v":15.01},24.97,{"$f":"ROUND(L31 * (1 + VAT), 2)","v":28.47},0,{"$f":"ROUND(N31 * (1 + VAT), 2)","v":0},null,"≥ 500V & < 66kV",null,0.32,{"$f":"ROUND(S31 * (1 + VAT), 2)","v":0.36}]
["Megaflex","Me",0,3,"Me03Y",null,null,"≥ 66kV & ≤ 132kV",null,4.71,{"$f":"ROUND(J32 * (1 + VAT), 2)","v":5.37},8.7100000000000009,{"$f":"ROUND(L32 * (1 + VAT), 2)","v":9.93},11.53,{"$f":"ROUND(N32 * (1 + VAT), 2)","v":13.14},null,"≥ 66kV & ≤ 132kV",null,0.31,{"$f":"ROUND(S32 * (1 + VAT), 2)","v":0.35}]
["Megaflex","Me",0,4,"Me04Y",null,null,"> 132kV / Transmission connected",null,0,{"$f":"ROUND(J33 * (1 + VAT), 2)","v":0},0,{"$f":"ROUND(L33 * (1 + VAT), 2)","v":0},11.53,{"$f":"ROUND(N33 * (1 + VAT), 2)","v":13.14},null,"> 132kV / Transmission connected",null,0.28999999999999998,{"$f":"ROUND(S33 * (1 + VAT), 2)","v":0.33}]
[]
[]
[null,null,null,null,null,null,null,"Customer categories",null,"Service charge  [R/account/day]",null,"Administration charge  [R/POD/day]",null,null,null,null,"Reactive energy charge  [c/kVArh]"]
[null,null,null,null,null,null,null,null,null,null,null,null,null,null,null,null,"High season",null,"Low season"]
["Tariff","Tariff nameBillcode","Tx zone","Voltage","Billcode",null,null,null,null,null,"VAT incl",null,"VAT incl",null,null,null,null,"VAT incl",null,"VAT incl"]
["Megaflex","Me",0,1,{"$f":"B39&C39&D39&IF($A$2=\"Non-municipal\",\"N\",IF($A$2=\"Municiple\",\"Y\",\"error\"))","v":"Me01Y"},null,null,"> 1 MVA",null,164.04,{"$f":"ROUND(J39 * (1 + VAT), 2)","v":187.01},73.94,{"$f":"ROUND(L39 * (1 + VAT), 2)","v":84.29},null,null,null,11.54,{"$f":"ROUND(Q39 * (1 + VAT), 2)","v":13.16},0,{"$f":"ROUND(S39 * (1 + VAT), 2)","v":0}]
["Megaflex","Me",0,1,{"$f":"B40&C40&D40&IF($A$2=\"Non-municipal\",\"N\",IF($A$2=\"Municiple\",\"Y\",\"error\"))","v":"Me01Y"},null,null,"Key customers",null,3214.52,{"$f":"ROUND(J40 * (1 + VAT), 2)","v":3664.55},102.66,{"$f":"ROUND(L40 * (1 + VAT), 2)","v":117.03}]
[]
[null,null,null,null,null,null,null,"Electrification and rural network subsidy charge\n [c/kWh]"]
[]
[null,null,null,null,null,null,null,"All seasons"]
["Tariff","Tariff nameBillcode","Tx zone","Voltage","Billcode",null,null,null,"VAT incl"]
["Megaflex","Me",0,1,{"$f":"B46&C46&D46&IF($A$2=\"Non-municipal\",\"N\",IF($A$2=\"Municiple\",\"Y\",\"error\"))","v":"Me01Y"},null,null,6.39,{"$f":"ROUND(H46 * (1 + VAT), 2)","v":7.28}]

{"sheet":"Genflex Urban inc","index":9,"n_rows":51,"n_cols":24,"rows_kept":51,"cut":false,"hidden":false,"merged":[[46,7,47,8],[46,9,47,10],[48,7,48,8],[48,9,48,10],[40,7,40,8],[41,7,41,8],[42,7,42,8],[43,7,43,8],[32,7,32,8],[43,16,43,17],[33,7,33,8],[44,16,44,17],[36,7,36,8],[36,9,37,10],[36,11,37,12],[37,7,37,8],[39,7,39,8],[38,7,38,8],[31,7,31,8],[42,16,42,17],[15,7,18,7],[19,7,22,7],[26,7,26,14],[27,9,28,10],[27,11,28,12],[27,13,28,14],[37,16,38,19],[23,7,23,8],[26,16,27,19],[39,18,39,19],[29,7,29,8],[40,16,40,17],[30,7,30,8],[41,16,41,17],[11,7,14,7],[1,6,1,16],[3,9,3,20],[3,21,3,22],[4,7,6,7],[4,9,4,14],[4,15,4,20],[4,21,5,22],[5,9,5,10],[5,11,5,12],[5,13,5,14],[5,15,5,16],[5,17,5,18],[5,19,5,20],[7,7,10,7],[1,17,1,24],[46,16,46,19],[47,16,47,17],[47,18,47,19],[28,16,29,17],[28,18,28,19],[32,20,32,21],[28,22,29,23],[33,20,33,21],[26,20,27,23],[30,20,30,21],[31,20,31,21]]}
[null,null,null,null,null,null,"Back to menu",null,null,null,null,null,null,null,null,null,null,null,null,null,null,null,{"$error":"#REF!"}]
["Non-municipal",null,null,null,null,null,"Genflex Urban tariff",null,null,null,null,null,null,null,null,null,null,{"$f":"Menu!$H$7","v":"Non-local authority"}]
[]
[null,null,null,null,null,null,null,null,null,"Active energy charge [c/kWh]",null,null,null,null,null,null,null,null,null,null,null,"Transmission network charges [R/kVA/m]"]
[null,null,null,null,null,null,null,"Transmission zone",null,"High demand season [Jun - Aug]",null,null,null,null,null,"Low demand season [Sep - May]"]
[null,null,null,null,null,null,null,null,"Voltage","Peak",null,"Standard",null,"Off Peak",null,"Peak",null,"Standard",null,"Off Peak"]
["Tariff","Tariff nameBillcode","Tx zone","Voltage","Billcode",null,null,null,null,"","VAT incl",null,"VAT incl",null,"VAT incl",null,"VAT incl",null,"VAT incl",null,"VAT incl",null,"VAT incl"]
["Genflex urban loads","GU",0,1,{"$f":"B8&C8&D8&IF($A$2=\"Non-municipal\",\"N\",IF($A$2=\"Municiple\",\"Y\",\"error\"))","v":"GU01N"},null,null,"≤ 300km","< 500V",248.94,{"$f":"ROUND(J8 * (1 + VAT), 2)","v":283.79000000000002},75.739999999999995,{"$f":"ROUND(L8 * (1 + VAT), 2)","v":86.34},41.35,{"$f":"ROUND(N8 * (1 + VAT), 2)","v":47.14},81.52,{"$f":"ROUND(P8 * (1 + VAT), 2)","v":92.93},56.25,{"$f":"ROUND(R8 * (1 + VAT), 2)","v":64.13},35.86,{"$f":"ROUND(T8 * (1 + VAT), 2)","v":40.880000000000003},7.12,{"$f":"ROUND(V8 * (1 + VAT), 2)","v":8.1199999999999992}]
["Genflex urban loads","GU",0,2,{"$f":"B9&C9&D9&IF($A$2=\"Non-municipal\",\"N\",IF($A$2=\"Municiple\",\"Y\",\"error\"))","v":"GU02N"},null,null,null,"≥ 500V & < 66kV",245.03,279.33,74.23,84.62,40.31,45.95,79.930000000000007,91.12,55.02,62.72,34.9,39.79,6.51,7.42]
["Genflex urban loads","GU",0,3,"GU03N",null,null,null,"≥ 66kV & ≤ 132kV",237.28,270.5,71.87,81.93,39.04,44.51,77.41,88.25,53.27,60.73,33.799999999999997,38.53,6.34,7.23]
["Genflex urban loads","GU",0,4,"GU04N",null,null,null,"> 132kV*",223.63,254.94,67.739999999999995,77.22,36.79,41.94,72.959999999999994,83.17,50.2,57.23,31.86,36.32,8.01,9.1300000000000008]
["Genflex urban loads","GU",1,1,"GU11N",null,null,"> 300km and \n≤ 600km","< 500V",250.97,286.11,76.040000000000006,86.69,41.29,47.07,81.87,93.33,56.36,64.25,35.76,40.770000000000003,7.18,8.19]
["Genflex urban loads","GU",1,2,"GU12N",null,null,null,"≥ 500V & < 66kV",247.48,282.13,74.97,85.47,40.71,46.41,80.739999999999995,92.04,55.56,63.34,35.25,40.19,6.57,7.49]
["Genflex urban loads","GU",1,3,"GU13N",null,null,null,"≥ 66kV & ≤ 132kV",239.61,273.16000000000003,72.58,82.74,39.409999999999997,44.93,78.16,89.1,53.79,61.32,34.119999999999997,38.9,6.39,7.28]
["Genflex urban loads","GU",1,4,"GU14N",null,null,null,"> 132kV*",225.86,257.48,68.430000000000007,78.010000000000005,37.14,42.34,73.67,83.98,50.7,57.8,32.159999999999997,36.659999999999997,8.09,9.2200000000000006]
["Genflex urban loads","GU",2,1,"GU21N",null,null,"> 600km and \n≤ 900km","< 500V",253.47,288.95999999999998,76.78,87.53,41.68,47.52,82.69,94.27,56.91,64.88,36.090000000000003,41.14,7.27,8.2899999999999991]
["Genflex urban loads","GU",2,2,"GU22N",null,null,null,"≥ 500V & < 66kV",249.96,284.95,75.73,86.33,41.12,46.88,81.540000000000006,92.96,56.12,63.98,35.6,40.58,6.63,7.56]
["Genflex urban loads","GU",2,3,"GU23N",null,null,null,"≥ 66kV & ≤ 132kV",242.05,275.94,73.33,83.6,39.81,45.38,78.95,90,54.34,61.95,34.47,39.299999999999997,6.43,7.33]
["Genflex urban loads","GU",2,4,"GU24N",null,null,null,"> 132kV*",228.14,260.08,69.099999999999994,78.77,37.54,42.8,74.42,84.84,51.22,58.39,32.5,37.049999999999997,8.1999999999999993,9.35]
["Genflex urban loads","GU",3,1,"GU31N",null,null,"> 900km","< 500V",256.02,291.86,77.58,88.44,42.12,48.02,83.53,95.22,57.48,65.53,36.479999999999997,41.59,7.29,8.31]
["Genflex urban loads","GU",3,2,"GU32N",null,null,null,"≥ 500V & < 66kV",252.45,287.79000000000002,76.47,87.18,41.51,47.32,82.34,93.87,56.66,64.59,35.950000000000003,40.98,6.71,7.65]
["Genflex urban loads","GU",3,3,"GU33N",null,null,null,"≥ 66kV & ≤ 132kV",244.48,278.70999999999998,74.06,84.43,40.21,45.84,79.739999999999995,90.9,54.89,62.57,34.82,39.69,6.48,7.39]
["Genflex urban loads","GU",3,4,"GU34N",null,null,null,"> 132kV*",230.37,262.62,69.819999999999993,79.59,37.93,43.24,75.19,85.72,51.76,59.01,32.86,37.46,8.26,9.42]
["Gen-purchase","NLPurchADJ",0,4,"NLPurchADJ04N",null,null,"WEPS energy rate excluding losses",null,221.26249134263384,252.24,67.022855446720101,{"$f":"ROUND(L24 * (1 + VAT), 2)","v":76.41},36.40051449490452,{"$f":"ROUND(N24 * (1 + VAT), 2)","v":41.5},72.187592757494798,{"$f":"ROUND(P24 * (1 + VAT), 2)","v":82.29},49.668546551894735,{"$f":"ROUND(R24 * (1 + VAT), 2)","v":56.62},31.522707034728409,{"$f":"ROUND(T24 * (1 + VAT), 2)","v":35.94}]
["TUoS network charges for Transmission connected generators","GenTUOS","Cape",4,"GenTUOSCape4N",null,null,null,"* 132 kV or Transmission connected"]
["TUoS network charges for Transmission connected generators","GenTUOS","Karoo",4,"GenTUOSKaroo4N"]
["TUoS network charges for Transmission connected generators","GenTUOS","Kwazulu-Natal",4,"GenTUOSKwazulu-Natal4N",null,null,"Distribution network charges",null,null,null,null,null,null,null,null,"Transmission network charges for Generators ",null,null,null,"Distribution network charges for Generators"]
["TUoS network charges for Transmission connected generators","GenTUOS","Vaal",4,"GenTUOSVaal4N",null,null,null,null,"Network capacity charge [R/kVA/m]",null,"Network demand charge [R/kVA/m]",null,"Urban low voltage subsidy charge [R/kVA/m]"]
["TUoS network charges for Transmission connected generators","GenTUOS","Waterburg",4,"GenTUOSWaterburg4N",null,null,null,null,null,null,null,null,null,null,null,"TUoS [ > 132kV]",null,"Network charge\n[R/kW]",null,null,null,"Network capacity charge    [R/kW/m]"]
["TUoS network charges for Transmission connected generators","GenTUOS","Mpumalanga",4,"GenTUOSMpumalanga4N",null,null,"Voltage",null,null,"VAT incl",null,"VAT incl",null,"VAT incl",null,null,null,null,"VAT incl"]
["Genflex urban loads","GU",0,1,{"$f":"B31&C31&D31&IF($A$2=\"Non-municipal\",\"N\",IF($A$2=\"Municiple\",\"Y\",\"error\"))","v":"GU01N"},null,null,"< 500V",null,14.15,{"$f":"ROUND(J31 * (1 + VAT), 2)","v":16.13},26.83,{"$f":"ROUND(L31 * (1 + VAT), 2)","v":30.59},0,{"$f":"ROUND(N31 * (1 + VAT), 2)","v":0},null,null,"Cape",0,{"$f":"ROUND(S31 * (1 + VAT), 2)","v":0},"Voltage ",null,null,"VAT incl"]
["Genflex urban loads","GU",0,2,{"$f":"B32&C32&D32&IF($A$2=\"Non-municipal\",\"N\",IF($A$2=\"Municiple\",\"Y\",\"error\"))","v":"GU02N"},null,null,"≥ 500V & < 66kV",null,12.98,{"$f":"ROUND(J32 * (1 + VAT), 2)","v":14.8},24.62,{"$f":"ROUND(L32 * (1 + VAT), 2)","v":28.07},0,{"$f":"ROUND(N32 * (1 + VAT), 2)","v":0},null,null,"Karoo",0,0,"< 500V"]
["Genflex urban loads","GU",0,3,"GU03N",null,null,"≥ 66kV & ≤ 132kV",null,4.63,{"$f":"ROUND(J33 * (1 + VAT), 2)","v":5.28},8.58,{"$f":"ROUND(L33 * (1 + VAT), 2)","v":9.7799999999999994},11.43,{"$f":"ROUND(N33 * (1 + VAT), 2)","v":13.03},null,null,"Kwazulu-Natal",1.68,1.92,"≥ 500V & < 66kV"]
["Genflex urban loads","GU",0,4,"GU04N",null,null,"> 132kV / Transmission connected",null,0,{"$f":"ROUND(J34 * (1 + VAT), 2)","v":0},0,{"$f":"ROUND(L34 * (1 + VAT), 2)","v":0},11.43,{"$f":"ROUND(N34 * (1 + VAT), 2)","v":13.03},null,null,"Vaal",5.6,6.38,"≥ 66kV & ≤ 132kV",null,11.44,{"$f":"ROUND(W34 * (1 + VAT), 2)","v":13.04}]
["Gen-DUoS urban","NEGenDUoSU",0,3,"NEGenDUoSU03N",null,null,null,null,null,null,null,null,null,null,null,null,"Waterberg",7.18,8.19]
[null,null,null,null,null,null,null,null,null,null,null,null,null,null,null,null,null,"Mpumalanga",6.65,7.58]
[null,null,null,null,null,null,null,"Customer categories",null,"Service charge  \n[R/account/day]",null,"Administration charge  [R/POD/day]"]
[null,null,null,null,null,null,null,"[kVA or MVA = loads]",null,null,null,null,null,null,null,null,"Ancillary service charge for Transmission and Distribution urbanp connected loads and generators"]
["Tariff","Tariff nameBillcode","Tx zone","Voltage","Billcode",null,null,"[kW or MW = generators]",null,null,"VAT incl",null,"VAT incl"]
["Genflex urban loads","GU",0,1,{"$f":"B40&C40&D40&IF($A$2=\"Non-municipal\",\"N\",IF($A$2=\"Municiple\",\"Y\",\"error\"))","v":"GU01N"},null,null,"≤ 100 KVA/ kW ",null,11.55,{"$f":"ROUND(J40 * (1 + VAT), 2)","v":13.17},2.54,{"$f":"ROUND(L40 * (1 + VAT), 2)","v":2.9},null,null,null,null,null,"Ancillary service charge [c/kWh]"]
["Genflex urban loads","GU",0,1,{"$f":"B41&C41&D41&IF($A$2=\"Non-municipal\",\"N\",IF($A$2=\"Municiple\",\"Y\",\"error\"))","v":"GU01N"},null,null,"> 100 kVA/ kW & ≤ 500 kVA/ kW",null,52.8,{"$f":"ROUND(J41 * (1 + VAT), 2)","v":60.19},14.8,{"$f":"ROUND(L41 * (1 + VAT), 2)","v":16.87},null,null,null,"Voltage",null,null,"VAT incl"]
["Genflex urban loads","GU",0,1,"GU01N",null,null,"> 500 kVA/ kW & ≤ 1 MVA/MW",null,162.47999999999999,{"$f":"ROUND(J42 * (1 + VAT), 2)","v":185.23},29.41,{"$f":"ROUND(L42 * (1 + VAT), 2)","v":33.53},null,null,null,"< 500V",null,0.33,{"$f":"ROUND(S42 * (1 + VAT), 2)","v":0.38}]
["Genflex urban loads","GU",0,1,"GU01N",null,null,"> 1 MVA/MW",null,162.47999999999999,{"$f":"ROUND(J43 * (1 + VAT), 2)","v":185.23},73.23,{"$f":"ROUND(L43 * (1 + VAT), 2)","v":83.48},null,null,null,"≥ 500V & < 66kV",null,0.32,{"$f":"ROUND(S43 * (1 + VAT), 2)","v":0.36}]
["Genflex urban loads","GU",0,1,{"$f":"B44&C44&D44&IF($A$2=\"Non-municipal\",\"N\",IF($A$2=\"Municiple\",\"Y\",\"error\"))","v":"GU01N"},null,null,"Key customers or Transmission  connected generators",null,3183.88,{"$f":"ROUND(J44 * (1 + VAT), 2)","v":3629.62},101.68,{"$f":"ROUND(L44 * (1 + VAT), 2)","v":115.92},null,null,null,"≥ 66kV & ≤ 132kV",null,0.3,{"$f":"ROUND(S44 * (1 + VAT), 2)","v":0.34}]
[null,null,null,null,null,null,null,null,null,null,null,null,null,null,null,null,"> 132kV / Transmission connected",null,0.28000000000000003,{"$f":"ROUND(S45 * (1 + VAT), 2)","v":0.32}]
[]
[null,null,null,null,null,null,null,"Electrification and rural network subsidy charge [c/kWh]",null,"Affordability subsidy charge [c/kWh] \nOnly payable by non-local authority tariffs",null,null,null,null,null,null,"Reactive energy charge  [c/kVArh]"]
[null,null,null,null,null,null,null,null,null,null,null,null,null,null,null,null,"High season",null,"Low season"]
[null,null,null,null,null,null,null,"All seasons",null,"All seasons",null,null,null,null,null,null,null,"VAT incl",null,"VAT incl"]
["Tariff","Tariff nameBillcode","Tx zone","Voltage","Billcode",null,null,null,"VAT incl",null,"VAT incl",null,null,null,null,null,11.44,{"$f":"ROUND(Q50 * (1 + VAT), 2)","v":13.04},0,{"$f":"ROUND(S50 * (1 + VAT), 2)","v":0}]
["Genflex urban loads","GU",0,1,{"$f":"B51&C51&D51&IF($A$2=\"Non-municipal\",\"N\",IF($A$2=\"Municiple\",\"Y\",\"error\"))","v":"GU01N"},null,null,6.33,{"$f":"ROUND(H51 * (1 + VAT), 2)","v":7.22},2.44,{"$f":"ROUND(J51 * (1 + VAT), 2)","v":2.78}]

{"sheet":"Miniflex inc","index":10,"n_rows":45,"n_cols":23,"rows_kept":45,"cut":false,"hidden":false,"merged":[[5,17,5,18],[5,19,5,20],[7,7,10,7],[1,6,1,16],[1,17,1,18],[1,19,1,22],[3,9,3,20],[4,7,6,7],[4,9,4,14],[4,15,4,20],[5,9,5,10],[3,21,5,22],[25,9,26,10],[25,11,26,12],[5,11,5,12],[5,13,5,14],[5,15,5,16],[11,7,14,7],[15,7,18,7],[19,7,22,7],[25,7,26,8],[27,7,27,8],[27,15,27,16],[27,17,27,18],[27,20,27,22],[28,7,28,8],[37,7,37,8],[37,9,37,10],[37,14,37,15],[37,16,37,17],[30,7,30,8],[31,7,31,8],[32,7,32,8],[35,7,36,8],[35,9,36,10],[35,14,36,17],[29,7,29,8]]}
[null,null,null,null,null,null,"Back to menu",null,null,null,null,null,null,null,null,null,null,null,null,null,null,null,{"$error":"#REF!"}]
["Non-municipal",null,null,null,null,null,"Miniflex tariff",null,null,null,null,null,null,null,null,null,null,null,null,"Non-local authority"]
[]
[null,null,null,null,null,null,null,null,null,"Active energy charge [c/kWh]",null,null,null,null,null,null,null,null,null,null,null,"Network capacity charge [R/kVA/m]"]
[null,null,null,null,null,null,null,"Transmission zone",null,"High demand season [Jun - Aug]",null,null,null,null,null,"Low demand season [Sep - May]"]
[null,null,null,null,null,null,null,null,"Voltage","Peak",null,"Standard",null,"Off Peak",null,"Peak",null,"Standard",null,"Off Peak"]
["Tariff","Tariff nameBillcode","Tx zone","Voltage","Billcode",null,null,null,null,"","VAT incl",null,"VAT incl",null,"VAT incl",null,"VAT incl",null,"VAT incl",null,"VAT incl",null,"VAT incl"]
["Miniflex","Mi",0,1,{"$f":"B8&C8&D8&IF($A$2=\"Non-municipal\",\"N\",IF($A$2=\"Municiple\",\"Y\",\"error\"))","v":"Mi01N"},null,null,"≤ 300km","< 500V",248.94,{"$f":"ROUND(J8 * (1 + VAT), 2)","v":283.79000000000002},75.739999999999995,{"$f":"ROUND(L8 * (1 + VAT), 2)","v":86.34},41.35,{"$f":"ROUND(N8 * (1 + VAT), 2)","v":47.14},81.52,{"$f":"ROUND(P8 * (1 + VAT), 2)","v":92.93},56.25,{"$f":"ROUND(R8 * (1 + VAT), 2)","v":64.13},35.86,{"$f":"ROUND(T8 * (1 + VAT), 2)","v":40.880000000000003},21.25,{"$f":"ROUND(V8 * (1 + VAT), 2)","v":24.23}]
["Miniflex","Mi",0,2,{"$f":"B9&C9&D9&IF($A$2=\"Non-municipal\",\"N\",IF($A$2=\"Municiple\",\"Y\",\"error\"))","v":"Mi02N"},null,null,null,"≥ 500V & < 66kV",245.03,279.33,74.23,84.62,40.31,45.95,79.930000000000007,91.12,55.02,62.72,34.9,39.79,19.47,22.2]
["Miniflex","Mi",0,3,"Mi03N",null,null,null,"≥ 66kV & ≤ 132kV",237.28,270.5,71.87,81.93,39.04,44.51,77.41,88.25,53.27,60.73,33.799999999999997,38.53,10.94,12.47]
["Miniflex","Mi",0,4,"Mi04N",null,null,null,"> 132kV*",223.63,254.94,67.739999999999995,77.22,36.79,41.94,72.959999999999994,83.17,50.2,57.23,31.86,36.32,7.97,9.09]
["Miniflex","Mi",1,1,"Mi11N",null,null,"> 300km and \n≤ 600km","< 500V",250.97,286.11,76.040000000000006,86.69,41.29,47.07,81.87,93.33,56.36,64.25,35.76,40.770000000000003,21.3,24.28]
["Miniflex","Mi",1,2,"Mi12N",null,null,null,"≥ 500V & < 66kV",247.48,282.13,74.97,85.47,40.71,46.41,80.739999999999995,92.04,55.56,63.34,35.25,40.19,19.53,22.26]
["Miniflex","Mi",1,3,"Mi13N",null,null,null,"≥ 66kV & ≤ 132kV",239.61,273.16000000000003,72.58,82.74,39.409999999999997,44.93,78.16,89.1,53.79,61.32,34.119999999999997,38.9,10.99,12.53]
["Miniflex","Mi",1,4,"Mi14N",null,null,null,"> 132kV*",225.86,257.48,68.430000000000007,78.010000000000005,37.14,42.34,73.67,83.98,50.7,57.8,32.159999999999997,36.659999999999997,8.06,9.19]
["Miniflex","Mi",2,1,"Mi21N",null,null,"> 600km and \n≤ 900km","< 500V",253.47,288.95999999999998,76.78,87.53,41.68,47.52,82.69,94.27,56.91,64.88,36.090000000000003,41.14,21.4,24.4]
["Miniflex","Mi",2,2,"Mi22N",null,null,null,"≥ 500V & < 66kV",249.96,284.95,75.73,86.33,41.12,46.88,81.540000000000006,92.96,56.12,63.98,35.6,40.58,19.59,22.33]
["Miniflex","Mi",2,3,"Mi23N",null,null,null,"≥ 66kV & ≤ 132kV",242.05,275.94,73.33,83.6,39.81,45.38,78.95,90,54.34,61.95,34.47,39.299999999999997,11.04,12.59]
["Miniflex","Mi",2,4,"Mi24N",null,null,null,"> 132kV*",228.14,260.08,69.099999999999994,78.77,37.54,42.8,74.42,84.84,51.22,58.39,32.5,37.049999999999997,8.17,9.31]
["Miniflex","Mi",3,1,"Mi31N",null,null,"> 900km","< 500V",256.02,291.86,77.58,88.44,42.12,48.02,83.53,95.22,57.48,65.53,36.479999999999997,41.59,21.42,24.42]
["Miniflex","Mi",3,2,"Mi32N",null,null,null,"≥ 500V & < 66kV",252.45,287.79000000000002,76.47,87.18,41.51,47.32,82.34,93.87,56.66,64.59,35.950000000000003,40.98,19.66,22.41]
["Miniflex","Mi",3,3,"Mi33N",null,null,null,"≥ 66kV & ≤ 132kV",244.48,278.70999999999998,74.06,84.43,40.21,45.84,79.739999999999995,90.9,54.89,62.57,34.82,39.69,11.09,12.64]
["Miniflex","Mi",3,4,"Mi34N",null,null,null,"> 132kV*",230.37,262.62,69.819999999999993,79.59,37.93,43.24,75.19,85.72,51.76,59.01,32.86,37.46,8.23,9.3800000000000008]
[null,null,null,null,null,null,null,null,"* 132 kV or Transmission connected"]
[]
[null,null,null,null,null,null,null,"Customer categories",null,"Service charge  [R/account/day]",null,"Administration charge  [R/POD/day]"]
[]
["Tariff","Tariff nameBillcode","Tx zone","Voltage","Billcode",null,null,null,null,null,"VAT incl",null,"VAT incl",null,null,"Ancillary service charge [c/kWh]",null,"Network demand charge [c/kWh]        \n     [Peak & Standard]",null,null,"Urban low voltage subsidy charge [R/kVA/m]"]
["Miniflex","Mi",0,1,{"$f":"B29&C29&D29&IF($A$2=\"Non-municipal\",\"N\",IF($A$2=\"Municiple\",\"Y\",\"error\"))","v":"Mi01N"},null,null,"≤ 100 kVA",null,11.55,{"$f":"ROUND(J29 * (1 + VAT), 2)","v":13.17},2.54,{"$f":"ROUND(L29 * (1 + VAT), 2)","v":2.9},null,"Voltage",null,"VAT incl",null,"VAT incl",null,null,null,"VAT incl"]
["Miniflex","Mi",0,1,{"$f":"B30&C30&D30&IF($A$2=\"Non-municipal\",\"N\",IF($A$2=\"Municiple\",\"Y\",\"error\"))","v":"Mi01N"},null,null,"> 100 kVA & ≤ 500 kVA",null,52.8,{"$f":"ROUND(J30 * (1 + VAT), 2)","v":60.19},14.8,{"$f":"ROUND(L30 * (1 + VAT), 2)","v":16.87},null,"< 500V",0.33,{"$f":"ROUND(P30 * (1 + VAT), 2)","v":0.38},13.14,{"$f":"ROUND(R30 * (1 + VAT), 2)","v":14.98},null,"< 500V",0,{"$f":"ROUND(V30 * (1 + VAT), 2)","v":0}]
["Miniflex","Mi",0,1,{"$f":"B31&C31&D31&IF($A$2=\"Non-municipal\",\"N\",IF($A$2=\"Municiple\",\"Y\",\"error\"))","v":"Mi01N"},null,null,"> 500 kVA & ≤ 1 MVA",null,162.47999999999999,{"$f":"ROUND(J31 * (1 + VAT), 2)","v":185.23},29.41,{"$f":"ROUND(L31 * (1 + VAT), 2)","v":33.53},null,"≥ 500V & < 66kV",0.32,{"$f":"ROUND(P31 * (1 + VAT), 2)","v":0.36},5.51,{"$f":"ROUND(R31 * (1 + VAT), 2)","v":6.28},null,"≥ 500V & < 66kV",0,{"$f":"ROUND(V31 * (1 + VAT), 2)","v":0}]
["Miniflex","Mi",0,1,{"$f":"B32&C32&D32&IF($A$2=\"Non-municipal\",\"N\",IF($A$2=\"Municiple\",\"Y\",\"error\"))","v":"Mi01N"},null,null,"> 1 MVA",null,162.47999999999999,{"$f":"ROUND(J32 * (1 + VAT), 2)","v":185.23},73.23,{"$f":"ROUND(L32 * (1 + VAT), 2)","v":83.48},null,"≥ 66kV & ≤ 132kV",0.3,{"$f":"ROUND(P32 * (1 + VAT), 2)","v":0.34},1.92,{"$f":"ROUND(R32 * (1 + VAT), 2)","v":2.19},null,"≥ 66kV & ≤ 132kV",11.43,{"$f":"ROUND(V32 * (1 + VAT), 2)","v":13.03}]
["Miniflex","Mi",0,1,{"$f":"B33&C33&D33&IF($A$2=\"Non-municipal\",\"N\",IF($A$2=\"Municiple\",\"Y\",\"error\"))","v":"Mi01N"},null,null,"Key customers",null,3183.88,{"$f":"ROUND(J33 * (1 + VAT), 2)","v":3629.62},101.68,{"$f":"ROUND(L33 * (1 + VAT), 2)","v":115.92},null,"> 132kV*",0.28000000000000003,{"$f":"ROUND(P33 * (1 + VAT), 2)","v":0.32},0,{"$f":"ROUND(R33 * (1 + VAT), 2)","v":0},null,"> 132kV*",11.43,{"$f":"ROUND(V33 * (1 + VAT), 2)","v":13.03}]
[null,null,null,null,null,null,null,null,null,null,null,null,null,null,"* 132 kV or Transmission connected",null,null,null,null,null,"* 132 kV or Transmission connected"]
[]
[null,null,null,null,null,null,null,"Electrification and rural network subsidy charge [c/kWh]",null,"Affordability subsidy charge [c/kWh] \nOnly payable by non-local authority tariffs",null,null,null,null,"Reactive energy charge  [c/kVArh]"]
[]
[null,null,null,null,null,null,null,"All seasons",null,"All seasons",null,null,null,null,"High season",null,"Low season"]
["Tariff","Tariff nameBillcode","Tx zone","Voltage","Billcode",null,null,null,"VAT incl",null,"VAT incl",null,null,null,null,"VAT incl",null,"VAT incl"]
["Miniflex","Mi",0,1,{"$f":"B40&C40&D40&IF($A$2=\"Non-municipal\",\"N\",IF($A$2=\"Municiple\",\"Y\",\"error\"))","v":"Mi01N"},null,null,6.33,{"$f":"ROUND(H40 * (1 + VAT), 2)","v":7.22},2.44,{"$f":"ROUND(J40 * (1 + VAT), 2)","v":2.78},null,null,null,4.99,{"$f":"ROUND(O40 * (1 + VAT), 2)","v":5.69},0,{"$f":"ROUND(Q40 * (1 + VAT), 2)","v":0}]
[]
["Miniflex","Mi",0,1,{"$f":"B42&C42&D42&IF($A$2=\"Non-municipal\",\"N\",IF($A$2=\"Municiple\",\"Y\",\"error\"))","v":"Mi01N"}]
["Miniflex","Mi",1,2,{"$f":"B43&C43&D43&IF($A$2=\"Non-municipal\",\"N\",IF($A$2=\"Municiple\",\"Y\",\"error\"))","v":"Mi12N"}]
["Miniflex","Mi",2,3,"Mi23N"]
["Miniflex","Mi",3,4,"Mi34N"]

{"sheet":"Miniflex Munic inc ","index":11,"n_rows":45,"n_cols":23,"rows_kept":45,"cut":false,"hidden":false,"merged":[[3,21,5,22],[7,7,10,7],[1,6,1,16],[1,17,1,18],[1,19,1,22],[3,9,3,20],[4,7,6,7],[4,9,4,14],[4,15,4,20],[5,9,5,10],[5,11,5,12],[5,13,5,14],[5,15,5,16],[5,17,5,18],[5,19,5,20],[27,17,27,18],[27,20,27,22],[28,7,28,8],[29,7,29,8],[11,7,14,7],[15,7,18,7],[19,7,22,7],[25,7,26,8],[25,9,26,10],[25,11,26,12],[37,7,37,8],[37,11,37,12],[37,13,37,14],[27,7,27,8],[27,15,27,16],[30,7,30,8],[31,7,31,8],[32,7,32,8],[35,7,36,8],[35,11,36,14]]}
[null,null,null,null,null,null,"Back to menu"]
["Municiple",null,null,null,null,null,"Miniflex tariff",null,null,null,null,null,null,null,null,null,null,null,null,"Local authority"]
[]
[null,null,null,null,null,null,null,null,null,"Active energy charge [c/kWh]",null,null,null,null,null,null,null,null,null,null,null,"Network capacity charge [R/kVA/m]"]
[null,null,null,null,null,null,null,"Transmission zone",null,"High demand season [Jun - Aug]",null,null,null,null,null,"Low demand season [Sep - May]"]
[null,null,null,null,null,null,null,null,"Voltage","Peak",null,"Standard",null,"Off Peak",null,"Peak",null,"Standard",null,"Off Peak"]
["Tariff","Tariff nameBillcode","Tx zone","Voltage","Billcode",null,null,null,null,"","VAT incl",null,"VAT incl",null,"VAT incl",null,"VAT incl",null,"VAT incl",null,"VAT incl",null,"VAT incl"]
["Miniflex","Mi",0,1,{"$f":"B8&C8&D8&IF($A$2=\"Non-municipal\",\"N\",IF($A$2=\"Municiple\",\"Y\",\"error\"))","v":"Mi01Y"},null,null,"≤ 300km","< 500V",258.52999999999997,{"$f":"ROUND(J8 * (1 + VAT), 2)","v":294.72000000000003},78.67,{"$f":"ROUND(L8 * (1 + VAT), 2)","v":89.68},42.93,{"$f":"ROUND(N8 * (1 + VAT), 2)","v":48.94},84.65,{"$f":"ROUND(P8 * (1 + VAT), 2)","v":96.5},58.41,{"$f":"ROUND(R8 * (1 + VAT), 2)","v":66.59},37.229999999999997,{"$f":"ROUND(T8 * (1 + VAT), 2)","v":42.44},21.56,{"$f":"ROUND(V8 * (1 + VAT), 2)","v":24.58}]
["Miniflex","Mi",0,2,{"$f":"B9&C9&D9&IF($A$2=\"Non-municipal\",\"N\",IF($A$2=\"Municiple\",\"Y\",\"error\"))","v":"Mi02Y"},null,null,null,"≥ 500V & < 66kV",254.45,290.07,77.09,87.88,41.86,47.72,83.01,94.63,57.13,65.13,36.25,41.33,19.75,22.52]
["Miniflex","Mi",0,3,"Mi03Y",null,null,null,"≥ 66kV & ≤ 132kV",246.42,280.92,74.64,85.09,40.53,46.2,80.38,91.63,55.33,63.08,35.090000000000003,40,11.09,12.64]
["Miniflex","Mi",0,4,"Mi04Y",null,null,null,"> 132kV*",232.24,264.75,70.349999999999994,80.2,38.200000000000003,43.55,75.760000000000005,86.37,52.14,59.44,33.08,37.71,8.09,9.2200000000000006]
["Miniflex","Mi",1,1,"Mi11Y",null,null,"> 300km and \n≤ 600km","< 500V",260.63,297.12,78.959999999999994,90.01,42.87,48.87,85.03,96.93,58.53,66.72,37.130000000000003,42.33,21.6,24.62]
["Miniflex","Mi",1,2,"Mi12Y",null,null,null,"≥ 500V & < 66kV",256.99,292.97000000000003,77.849999999999994,88.75,42.28,48.2,83.84,95.58,57.7,65.78,36.6,41.72,19.809999999999999,22.58]
["Miniflex","Mi",1,3,"Mi13Y",null,null,null,"≥ 66kV & ≤ 132kV",248.83,283.67,75.38,85.93,40.92,46.65,81.17,92.53,55.86,63.68,35.43,40.39,11.15,12.71]
["Miniflex","Mi",1,4,"Mi14Y",null,null,null,"> 132kV*",234.55,267.39,71.06,81.010000000000005,38.58,43.98,76.5,87.21,52.66,60.03,33.4,38.08,8.17,9.31]
["Miniflex","Mi",2,1,"Mi21Y",null,null,"> 600km and \n≤ 900km","< 500V",263.23,300.08,79.739999999999995,90.9,43.3,49.36,85.86,97.88,59.1,67.37,37.49,42.74,21.71,24.75]
["Miniflex","Mi",2,2,"Mi22Y",null,null,null,"≥ 500V & < 66kV",259.58,295.92,78.63,89.64,42.7,48.68,84.69,96.55,58.26,66.42,36.97,42.15,19.87,22.65]
["Miniflex","Mi",2,3,"Mi23Y",null,null,null,"≥ 66kV & ≤ 132kV",251.36,286.55,76.14,86.8,41.34,47.13,81.98,93.46,56.42,64.319999999999993,35.79,40.799999999999997,11.2,12.77]
["Miniflex","Mi",2,4,"Mi24Y",null,null,null,"> 132kV*",236.91,270.08,71.78,81.83,38.97,44.43,77.290000000000006,88.11,53.19,60.64,33.75,38.479999999999997,8.2799999999999994,9.44]
["Miniflex","Mi",3,1,"Mi31Y",null,null,"> 900km","< 500V",265.87,303.08999999999997,80.55,91.83,43.74,49.86,86.73,98.87,59.69,68.05,37.869999999999997,43.17,21.73,24.77]
["Miniflex","Mi",3,2,"Mi32Y",null,null,null,"≥ 500V & < 66kV",262.17,298.87,79.41,90.53,43.13,49.17,85.51,97.48,58.85,67.09,37.33,42.56,19.95,22.74]
["Miniflex","Mi",3,3,"Mi33Y",null,null,null,"≥ 66kV & ≤ 132kV",253.89,289.43,76.91,87.68,41.77,47.62,82.81,94.4,56.99,64.97,36.159999999999997,41.22,11.24,12.81]
["Miniflex","Mi",3,4,"Mi34Y",null,null,null,"> 132kV*",239.24,272.73,72.510000000000005,82.66,39.4,44.92,78.08,89.01,53.75,61.28,34.119999999999997,38.9,8.34,9.51]
[null,null,null,null,null,null,null,null,"* 132 kV or Transmission connected"]
[]
[null,null,null,null,null,null,null,"Customer categories",null,"Service charge  [R/account/day]",null,"Administration charge  [R/POD/day]"]
[]
["Tariff","Tariff nameBillcode","Tx zone","Voltage","Billcode",null,null,null,null,null,"VAT incl",null,"VAT incl",null,null,"Ancillary service charge [c/kWh]",null,"Network demand charge [c/kWh]        \n     [Peak & Standard]",null,null,"Urban low voltage subsidy charge [R/kVA/m]"]
["Miniflex","Mi",0,1,{"$f":"B29&C29&D29&IF($A$2=\"Non-municipal\",\"N\",IF($A$2=\"Municiple\",\"Y\",\"error\"))","v":"Mi01Y"},null,null,"≤ 100 kVA",null,11.66,{"$f":"ROUND(J29 * (1 + VAT), 2)","v":13.29},2.56,{"$f":"ROUND(L29 * (1 + VAT), 2)","v":2.92},null,"Voltage",null,"VAT incl",null,"VAT incl",null,null,null,"VAT incl"]
["Miniflex","Mi",0,1,{"$f":"B30&C30&D30&IF($A$2=\"Non-municipal\",\"N\",IF($A$2=\"Municiple\",\"Y\",\"error\"))","v":"Mi01Y"},null,null,"> 100 kVA & ≤ 500 kVA",null,53.3,{"$f":"ROUND(J30 * (1 + VAT), 2)","v":60.76},14.94,{"$f":"ROUND(L30 * (1 + VAT), 2)","v":17.03},null,"< 500V",0.33,{"$f":"ROUND(P30 * (1 + VAT), 2)","v":0.38},13.33,{"$f":"ROUND(R30 * (1 + VAT), 2)","v":15.2},null,"< 500V",0,{"$f":"ROUND(V30 * (1 + VAT), 2)","v":0}]
["Miniflex","Mi",0,1,{"$f":"B31&C31&D31&IF($A$2=\"Non-municipal\",\"N\",IF($A$2=\"Municiple\",\"Y\",\"error\"))","v":"Mi01Y"},null,null,"> 500 kVA & ≤ 1 MVA",null,164.04,{"$f":"ROUND(J31 * (1 + VAT), 2)","v":187.01},29.7,{"$f":"ROUND(L31 * (1 + VAT), 2)","v":33.86},null,"≥ 500V & < 66kV",0.32,{"$f":"ROUND(P31 * (1 + VAT), 2)","v":0.36},5.6,{"$f":"ROUND(R31 * (1 + VAT), 2)","v":6.38},null,"≥ 500V & < 66kV",0,{"$f":"ROUND(V31 * (1 + VAT), 2)","v":0}]
["Miniflex","Mi",0,1,{"$f":"B32&C32&D32&IF($A$2=\"Non-municipal\",\"N\",IF($A$2=\"Municiple\",\"Y\",\"error\"))","v":"Mi01Y"},null,null,"> 1 MVA",null,164.04,{"$f":"ROUND(J32 * (1 + VAT), 2)","v":187.01},73.94,{"$f":"ROUND(L32 * (1 + VAT), 2)","v":84.29},null,"≥ 66kV & ≤ 132kV",0.31,{"$f":"ROUND(P32 * (1 + VAT), 2)","v":0.35},1.94,{"$f":"ROUND(R32 * (1 + VAT), 2)","v":2.21},null,"≥ 66kV & ≤ 132kV",11.53,{"$f":"ROUND(V32 * (1 + VAT), 2)","v":13.14}]
["Miniflex","Mi",0,1,{"$f":"B33&C33&D33&IF($A$2=\"Non-municipal\",\"N\",IF($A$2=\"Municiple\",\"Y\",\"error\"))","v":"Mi01Y"},null,null,"Key customers",null,3214.52,{"$f":"ROUND(J33 * (1 + VAT), 2)","v":3664.55},102.66,{"$f":"ROUND(L33 * (1 + VAT), 2)","v":117.03},null,"> 132kV*",0.28999999999999998,{"$f":"ROUND(P33 * (1 + VAT), 2)","v":0.33},0,{"$f":"ROUND(R33 * (1 + VAT), 2)","v":0},null,"> 132kV*",11.53,{"$f":"ROUND(V33 * (1 + VAT), 2)","v":13.14}]
[null,null,null,null,null,null,null,null,null,null,null,null,null,null,"* 132 kV or Transmission connected",null,null,null,null,null,"* 132 kV or Transmission connected"]
[]
[null,null,null,null,null,null,null,"Electrification and rural network subsidy charge [c/kWh]",null,null,null,"Reactive energy charge  [c/kVArh]"]
[]
[null,null,null,null,null,null,null,"All seasons",null,null,null,"High season",null,"Low season"]
["Tariff","Tariff nameBillcode","Tx zone","Voltage","Billcode",null,null,null,"VAT incl",null,null,null,"VAT incl",null,"VAT incl"]
["Miniflex","Mi",0,1,{"$f":"B40&C40&D40&IF($A$2=\"Non-municipal\",\"N\",IF($A$2=\"Municiple\",\"Y\",\"error\"))","v":"Mi01Y"},null,null,6.39,{"$f":"ROUND(H40 * (1 + VAT), 2)","v":7.28},null,null,5.05,{"$f":"ROUND(L40 * (1 + VAT), 2)","v":5.76},0,{"$f":"ROUND(N40 * (1 + VAT), 2)","v":0}]
[]
["Miniflex","Mi",0,1,{"$f":"B42&C42&D42&IF($A$2=\"Non-municipal\",\"N\",IF($A$2=\"Municiple\",\"Y\",\"error\"))","v":"Mi01Y"}]
["Miniflex","Mi",1,2,{"$f":"B43&C43&D43&IF($A$2=\"Non-municipal\",\"N\",IF($A$2=\"Municiple\",\"Y\",\"error\"))","v":"Mi12Y"}]
["Miniflex","Mi",2,3,"Mi23Y"]
["Miniflex","Mi",3,4,"Mi34Y"]

{"sheet":"Businessrate inc","index":12,"n_rows":11,"n_cols":29,"rows_kept":11,"cut":false,"hidden":false,"merged":[[1,15,1,18],[3,9,4,10],[3,11,4,12],[3,13,4,14],[3,15,4,16],[3,17,3,18],[8,7,8,8],[9,7,9,8],[10,7,10,8],[3,25,4,26],[3,27,4,28],[4,17,4,18],[5,25,5,26],[5,27,5,28],[7,7,7,8]]}
[null,null,null,null,null,null,null,"Back to menu"]
["Non-municipal",null,null,null,null,null,null,"Businessrate tariffs",null,null,null,null,null,null,null,"Non-local authority"]
[]
[null,null,null,null,null,null,null,null,null,"Energy charge [c/kWh]",null,"Ancillary service charge [c/kWh]",null,"Network demand charge \n [c/kWh]",null,"Network capacity charge\n [R/POD/day]",null,"Service and administration charge  \n[R/POD/day]",null,null,null,null,null,null,null,"Electrification and rural network subsidy charge  [c/kWh]",null,"Affordability subsidy charge [c/kWh] payable by non-local authority tariffs"]
[]
[null,null,null,null,null,null,null,null,null,null,null,null,null,null,null,null,null,null,null,null,null,null,null,null,null,"All seasons",null,"All seasons"]
["Tariff","Tariff nameBillcode","Tx zone","Voltage","Billcode",null,null,null,null,null,"VAT incl",null,"VAT incl",null,"VAT incl",null,"VAT incl",null,"VAT incl",null,null,null,null,null,null,null,"VAT incl",null,"VAT incl"]
["Businessrate 1","B1",0,1,{"$f":"B8&C8&D8&IF($A$2=\"Non-municipal\",\"N\",IF($A$2=\"Municiple\",\"Y\",\"error\"))","v":"B101N"},null,null,"Businessrate 1",null,85.24,{"$f":"ROUND(J8 * (1 + VAT), 2)","v":97.17},0.33,{"$f":"ROUND(L8 * (1 + VAT), 2)","v":0.38},12.04,{"$f":"ROUND(N8 * (1 + VAT), 2)","v":13.73},17.28,{"$f":"ROUND(P8 * (1 + VAT), 2)","v":19.7},14.93,{"$f":"ROUND(R8 * (1 + VAT), 2)","v":17.02},null,null,null,null,null,null,0,{"$f":"ROUND(Z8 * (1 + VAT), 2)","v":0},0,{"$f":"ROUND(AB8 * (1 + VAT), 2)","v":0}]
["Businessrate 2","B2",0,1,{"$f":"B9&C9&D9&IF($A$2=\"Non-municipal\",\"N\",IF($A$2=\"Municiple\",\"Y\",\"error\"))","v":"B201N"},null,null,"Businessrate 2",null,85.24,{"$f":"ROUND(J9 * (1 + VAT), 2)","v":97.17},0.33,{"$f":"ROUND(L9 * (1 + VAT), 2)","v":0.38},12.04,{"$f":"ROUND(N9 * (1 + VAT), 2)","v":13.73},29.11,{"$f":"ROUND(P9 * (1 + VAT), 2)","v":33.19},14.93,{"$f":"ROUND(R9 * (1 + VAT), 2)","v":17.02},null,null,null,null,null,null,{"$f":"Z8","v":0},{"$f":"ROUND(Z9 * (1 + VAT), 2)","v":0},{"$f":"AB8","v":0},{"$f":"ROUND(AB9 * (1 + VAT), 2)","v":0}]
["Businessrate 3","B3",0,1,"B301N",null,null,"Businessrate 3",null,85.24,{"$f":"ROUND(J10 * (1 + VAT), 2)","v":97.17},0.33,{"$f":"ROUND(L10 * (1 + VAT), 2)","v":0.38},12.04,{"$f":"ROUND(N10 * (1 + VAT), 2)","v":13.73},50.3,{"$f":"ROUND(P10 * (1 + VAT), 2)","v":57.34},14.93,{"$f":"ROUND(R10 * (1 + VAT), 2)","v":17.02},null,null,null,null,null,null,{"$f":"Z8","v":0},{"$f":"ROUND(Z10 * (1 + VAT), 2)","v":0},{"$f":"AB8","v":0},{"$f":"ROUND(AB10 * (1 + VAT), 2)","v":0}]
["Businessrate 4","B4",0,1,"B401N",null,null,"Businessrate 4",null,229.37,{"$f":"ROUND(J11 * (1 + VAT), 2)","v":261.48},0.33,{"$f":"ROUND(L11 * (1 + VAT), 2)","v":0.38},12.04,{"$f":"ROUND(N11 * (1 + VAT), 2)","v":13.73},null,null,null,null,null,null,null,null,null,null,{"$f":"Z9","v":0},{"$f":"ROUND(Z11 * (1 + VAT), 2)","v":0},{"$f":"AB9","v":0},{"$f":"ROUND(AB11 * (1 + VAT), 2)","v":0}]

{"sheet":"Businessrate Munic inc","index":13,"n_rows":11,"n_cols":29,"rows_kept":11,"cut":false,"hidden":false,"merged":[[1,15,1,18],[3,9,4,10],[3,11,4,12],[3,13,4,14],[3,15,4,16],[3,17,3,18],[8,7,8,8],[9,7,9,8],[10,7,10,8],[3,25,4,26],[3,27,4,28],[4,17,4,18],[5,25,5,26],[5,27,5,28],[7,7,7,8]]}
[null,null,null,null,null,null,null,"Back to menu"]
["Municiple",null,null,null,null,null,null,"Businessrate tariffs",null,null,null,null,null,null,null,"Local authority"]
[]
[null,null,null,null,null,null,null,null,null,"Energy charge [c/kWh]",null,"Ancillary service charge [c/kWh]",null,"Network demand charge  [c/kWh]",null,"Network capacity charge [R/POD/day]",null,"Service and administration charge  [R/POD/day]",null,null,null,null,null,null,null,"Electrification and rural network subsidy charge  [c/kWh]",null,"Affordability subsidy charge [c/kWh] payable by non-local authority tariffs"]
[]
[null,null,null,null,null,null,null,null,null,null,null,null,null,null,null,null,null,null,null,null,null,null,null,null,null,"All seasons",null,"All seasons"]
["Tariff","Tariff nameBillcode","Tx zone","Voltage","Billcode",null,null,null,null,null,"VAT incl",null,"VAT incl",null,"VAT incl",null,"VAT incl",null,"VAT incl",null,null,null,null,null,null,null,"VAT incl",null,"VAT incl"]
["Businessrate 1","B1",0,1,{"$f":"B8&C8&D8&IF($A$2=\"Non-municipal\",\"N\",IF($A$2=\"Municiple\",\"Y\",\"error\"))","v":"B101Y"},null,null,"Businessrate 1",null,88.51,{"$f":"ROUND(J8 * (1 + VAT), 2)","v":100.9},0.33,{"$f":"ROUND(L8 * (1 + VAT), 2)","v":0.38},12.27,{"$f":"ROUND(N8 * (1 + VAT), 2)","v":13.99},17.600000000000001,{"$f":"ROUND(P8 * (1 + VAT), 2)","v":20.059999999999999},15.07,{"$f":"ROUND(R8 * (1 + VAT), 2)","v":17.18},null,null,null,null,null,null,0,{"$f":"ROUND(Z8 * (1 + VAT), 2)","v":0},0,{"$f":"ROUND(AB8 * (1 + VAT), 2)","v":0}]
["Businessrate 2","B2",0,1,{"$f":"B9&C9&D9&IF($A$2=\"Non-municipal\",\"N\",IF($A$2=\"Municiple\",\"Y\",\"error\"))","v":"B201Y"},null,null,"Businessrate 2",null,88.51,{"$f":"ROUND(J9 * (1 + VAT), 2)","v":100.9},0.33,{"$f":"ROUND(L9 * (1 + VAT), 2)","v":0.38},12.27,{"$f":"ROUND(N9 * (1 + VAT), 2)","v":13.99},29.67,{"$f":"ROUND(P9 * (1 + VAT), 2)","v":33.82},15.07,{"$f":"ROUND(R9 * (1 + VAT), 2)","v":17.18},null,null,null,null,null,null,{"$f":"Z8","v":0},{"$f":"ROUND(Z9 * (1 + VAT), 2)","v":0},{"$f":"AB8","v":0},{"$f":"ROUND(AB9 * (1 + VAT), 2)","v":0}]
["Businessrate 3","B3",0,1,"B301Y",null,null,"Businessrate 3",null,88.51,{"$f":"ROUND(J10 * (1 + VAT), 2)","v":100.9},0.33,{"$f":"ROUND(L10 * (1 + VAT), 2)","v":0.38},12.27,{"$f":"ROUND(N10 * (1 + VAT), 2)","v":13.99},51.27,{"$f":"ROUND(P10 * (1 + VAT), 2)","v":58.45},15.07,{"$f":"ROUND(R10 * (1 + VAT), 2)","v":17.18},null,null,null,null,null,null,{"$f":"Z8","v":0},{"$f":"ROUND(Z10 * (1 + VAT), 2)","v":0},{"$f":"AB8","v":0},{"$f":"ROUND(AB10 * (1 + VAT), 2)","v":0}]
["Businessrate 4","B4",0,1,"B401Y",null,null,"Businessrate 4",null,238.19,{"$f":"ROUND(J11 * (1 + VAT), 2)","v":271.54000000000002},0.33,{"$f":"ROUND(L11 * (1 + VAT), 2)","v":0.38},12.27,{"$f":"ROUND(N11 * (1 + VAT), 2)","v":13.99},null,null,null,null,null,null,null,null,null,null,{"$f":"Z9","v":0},{"$f":"ROUND(Z11 * (1 + VAT), 2)","v":0},{"$f":"AB9","v":0},{"$f":"ROUND(AB11 * (1 + VAT), 2)","v":0}]

{"sheet":"Public Lighting inc","index":14,"n_rows":14,"n_cols":14,"rows_kept":14,"cut":false,"hidden":false,"merged":[[8,8,8,9],[8,12,8,13],[10,7,11,9],[10,10,10,11],[1,7,1,13],[3,10,3,11],[3,12,3,13],[5,7,6,7],[5,8,5,9],[6,8,6,9]]}
[null,null,null,null,null,null,null,"Back to menu"]
["Non-municipal",null,null,null,null,null,null,"Public Lighting tariffs          Non-local authority"]
[]
[null,null,null,null,null,null,null,null,null,null,"All Night ",null,"24 Hours "]
["Tariff","Tariff nameBillcode","Tx zone","Voltage","Billcode",null,null,null,null,null,"","VAT incl","","VAT incl"]
["Public lighting 24 hours","Pu",0,1,{"$f":"B6&C6&D6&IF($A$2=\"Non-municipal\",\"N\",IF($A$2=\"Municiple\",\"Y\",\"error\"))","v":"Pu01N"},null,null,"Public Lighting","Energy charge [c/kWh]",null,70.13,{"$f":"ROUND(K6 * (1 + VAT), 2)","v":79.95},93.9,{"$f":"ROUND(M6 * (1 + VAT), 2)","v":107.05}]
["Public lighting All Night","Pa",0,1,{"$f":"B7&C7&D7&IF($A$2=\"Non-municipal\",\"N\",IF($A$2=\"Municiple\",\"Y\",\"error\"))","v":"Pa01N"},null,null,null,"Energy charge [R/100W/month]",null,21.95,{"$f":"ROUND(K7 * (1 + VAT), 2)","v":25.02},63.25,{"$f":"ROUND(M7 * (1 + VAT), 2)","v":72.11}]
[]
["Public lighting Urban fixed","Pt",0,1,{"$f":"B9&C9&D9&IF($A$2=\"Non-municipal\",\"N\",IF($A$2=\"Municiple\",\"Y\",\"error\"))","v":"Pt01N"},null,null,"Public Lighting - Urban Fixed *","Fixed charge [R/POD/day]",null,4.6100000000000003,{"$f":"ROUND(K9 * (1 + VAT), 2)","v":5.26}]
[]
[null,null,null,null,null,null,null,"Maintenance charges",null,null,"R/month"]
[null,null,null,null,null,null,null,null,null,null,"","VAT incl"]
["Public Lighting - Maintenance charge - per lumanaire","Plu",0,1,{"$f":"B13&C13&D13&IF($A$2=\"Non-municipal\",\"N\",IF($A$2=\"Municiple\",\"Y\",\"error\"))","v":"Plu01N"},null,null,null,null,"Per lumanaire",37.19,{"$f":"ROUND(K13 * (1 + VAT), 2)","v":42.4}]
["Public Lighting - Maintenance charge - per high-mast lumanaire","Plhm",0,1,{"$f":"B14&C14&D14&IF($A$2=\"Non-municipal\",\"N\",IF($A$2=\"Municiple\",\"Y\",\"error\"))","v":"Plhm01N"},null,null,null,null,"Per high-mast lumanaire",865.75,{"$f":"ROUND(K14 * (1 + VAT), 2)","v":986.96}]

{"sheet":"Public Lighting Munic inc","index":15,"n_rows":14,"n_cols":29,"rows_kept":14,"cut":false,"hidden":false,"merged":[[8,8,8,9],[8,12,8,13],[10,7,11,9],[10,10,10,11],[1,7,1,13],[3,10,3,11],[3,12,3,13],[5,7,6,7],[5,8,5,9],[6,8,6,9]]}
[null,null,null,null,null,null,null,"Back to menu"]
["Municipal",null,null,null,null,null,null,"Public Lighting tariffs           Local authority",null,null,null,null,null,null,null,null,null,null,null,null,null,null,null,null,null,null,null,{"$f":"SUM(#REF!)","v":{"$error":"#REF!"}},"check value"]
[]
[null,null,null,null,null,null,null,null,null,null,"All Night ",null,"24 Hours "]
["Tariff","Tariff nameBillcode","Tx zone","Voltage","Billcode",null,null,null,null,null,"","VAT incl","","VAT incl"]
["Public lighting 24 hours","Pu",0,1,{"$f":"B6&C6&D6&IF($A$2=\"Non-municipal\",\"N\",IF($A$2=\"Municipal\",\"Y\",\"error\"))","v":"Pu01Y"},null,null,"Public Lighting","Energy charge [c/kWh]",null,72.84,{"$f":"ROUND(K6 * (1 + VAT), 2)","v":83.04},97.53,{"$f":"ROUND(M6 * (1 + VAT), 2)","v":111.18}]
["Public lighting All Night","Pa",0,1,{"$f":"B7&C7&D7&IF($A$2=\"Non-municipal\",\"N\",IF($A$2=\"Municipal\",\"Y\",\"error\"))","v":"Pa01Y"},null,null,null,"Energy charge [R/100W/month]",null,22.25,{"$f":"ROUND(K7 * (1 + VAT), 2)","v":25.37},64.12,{"$f":"ROUND(M7 * (1 + VAT), 2)","v":73.099999999999994}]
[]
["Public lighting Urban fixed","Pt",0,1,{"$f":"B9&C9&D9&IF($A$2=\"Non-municipal\",\"N\",IF($A$2=\"Municipal\",\"Y\",\"error\"))","v":"Pt01Y"},null,null,"Public Lighting - Urban Fixed *","Fixed charge [R/POD/day]",null,4.7894742033159421,{"$f":"ROUND(K9 * (1 + VAT), 2)","v":5.46}]
[]
[null,null,null,null,null,null,null,"Maintenance charges",null,null,"R/month"]
[null,null,null,null,null,null,null,null,null,null,"","VAT incl"]
["Public Lighting - Maintenance charge - per lumanaire","Plu",0,1,{"$f":"B13&C13&D13&IF($A$2=\"Non-municipal\",\"N\",IF($A$2=\"Municipal\",\"Y\",\"error\"))","v":"Plu01Y"},null,null,null,null,"Per lumanaire",38.43,{"$f":"ROUND(K13 * (1 + VAT), 2)","v":43.81}]
["Public Lighting - Maintenance charge - per high-mast lumanaire","Plhm",0,1,{"$f":"B14&C14&D14&IF($A$2=\"Non-municipal\",\"N\",IF($A$2=\"Municipal\",\"Y\",\"error\"))","v":"Plhm01Y"},null,null,null,null,"Per high-mast lumanaire",897.62,{"$f":"ROUND(K14 * (1 + VAT), 2)","v":1023.29}]

{"sheet":"Homepower inc","index":16,"n_rows":15,"n_cols":15,"rows_kept":15,"cut":false,"hidden":false,"merged":[[11,9,11,10],[11,11,11,12],[13,7,13,8],[4,13,4,14],[6,7,6,8],[7,7,7,8],[8,7,8,8],[9,7,9,8],[4,9,4,12]]}
[null,null,null,null,null,null,null,"Back to menu"]
["Non-municipal",null,null,null,null,null,null,"Homepower",null,null,null,null,null,null,"Non-local authority"]
[]
[]
[null,null,null,null,null,null,null,null,null,"Energy charge\n[c/kWh]",null,null,null,"Network capacity charge \n[R/POD/day]"]
["Tariff","Tariff nameBillcode","Tx zone","Voltage","Billcode",null,null,null,null,"Block 1   \n[>0 - 600 kWh]","VAT incl","Block 2   \n[>600 kWh]","VAT incl",null,"VAT incl"]
["Homepower 1","H1",0,1,{"$f":"B7&C7&D7&IF($A$2=\"Non-municipal\",\"N\",IF($A$2=\"Municiple\",\"Y\",\"error\"))","v":"H101N"},null,null,"Homepower 1",null,99.9,{"$f":"ROUND(J7 * (1 + VAT), 2)","v":113.89},157.72999999999999,{"$f":"ROUND(L7 * (1 + VAT), 2)","v":179.81},4.28,{"$f":"ROUND(N7 * (1 + VAT), 2)","v":4.88}]
["Homepower 2","H2",0,1,{"$f":"B8&C8&D8&IF($A$2=\"Non-municipal\",\"N\",IF($A$2=\"Municiple\",\"Y\",\"error\"))","v":"H201N"},null,null,"Homepower 2",null,99.9,{"$f":"ROUND(J8 * (1 + VAT), 2)","v":113.89},153.79,{"$f":"ROUND(L8 * (1 + VAT), 2)","v":175.32},8.02,{"$f":"ROUND(N8 * (1 + VAT), 2)","v":9.14}]
["Homepower 3","H3",0,1,"H301N",null,null,"Homepower 3",null,99.9,{"$f":"ROUND(J9 * (1 + VAT), 2)","v":113.89},153.79,{"$f":"ROUND(L9 * (1 + VAT), 2)","v":175.32},16.55,{"$f":"ROUND(N9 * (1 + VAT), 2)","v":18.87}]
["Homepower 4","H4",0,1,"H401N",null,null,"Homepower 4",null,99.9,{"$f":"ROUND(J10 * (1 + VAT), 2)","v":113.89},160.63999999999999,{"$f":"ROUND(L10 * (1 + VAT), 2)","v":183.13},2.61,{"$f":"ROUND(N10 * (1 + VAT), 2)","v":2.98}]
[]
[null,null,null,null,null,null,null,null,null,"Energy charge  \n[c/kWh]",null,"Network capacity charge [R/kVA]"]
[null,null,null,null,null,null,null,null,null,null,"VAT incl",null,"VAT incl"]
["Homepower Bulk < 500V","HB",0,1,{"$f":"B14&C14&D14&IF($A$2=\"Non-municipal\",\"N\",IF($A$2=\"Municiple\",\"Y\",\"error\"))","v":"HB01N"},null,null,"Homepower Bulk  \n< 500V*",null,131.15,{"$f":"ROUND(J14 * (1 + VAT), 2)","v":149.51},27.14,{"$f":"ROUND(L14 * (1 + VAT), 2)","v":30.94}]
[null,null,null,null,null,null,null,"* The Network capacity charge is based on the NMD or on the maximum demand if measured."]

{"sheet":"Homepower Munic inc","index":17,"n_rows":9,"n_cols":15,"rows_kept":9,"cut":false,"hidden":false,"merged":[[7,7,7,8],[8,7,8,8],[1,13,1,14],[3,9,3,10],[3,11,3,12],[3,13,3,14],[5,7,5,8],[6,7,6,8]]}
[null,null,null,null,null,null,null,"Back to menu"]
["Municiple",null,null,null,null,null,null,"Homepower tariffs",null,null,null,null,null,"Local authority"]
[]
[null,null,null,null,null,null,null,null,null,"Energy charge\n[c/kWh]",null,"Energy charge\n[c/kWh]",null,"Network capacity charge [R/POD/day]"]
["Tariff","Tariff nameBillcode","Tx zone","Voltage","Billcode",null,null,null,null,"Block 1   \n[>0 - 600 kWh]","VAT incl","Block 2   \n[>600 kWh]","VAT incl",null,"VAT incl"]
["Homepower 1","H1",0,1,{"$f":"B6&C6&D6&IF($A$2=\"Non-municipal\",\"N\",IF($A$2=\"Municiple\",\"Y\",\"error\"))","v":"H101Y"},null,null,"Homepower 1",null,101.33,{"$f":"ROUND(J6 * (1 + VAT), 2)","v":115.52},159.99,{"$f":"ROUND(L6 * (1 + VAT), 2)","v":182.39},4.34,{"$f":"ROUND(N6 * (1 + VAT), 2)","v":4.95}]
["Homepower 2","H2",0,1,{"$f":"B7&C7&D7&IF($A$2=\"Non-municipal\",\"N\",IF($A$2=\"Municiple\",\"Y\",\"error\"))","v":"H201Y"},null,null,"Homepower 2",null,101.33,{"$f":"ROUND(J7 * (1 + VAT), 2)","v":115.52},155.97999999999999,{"$f":"ROUND(L7 * (1 + VAT), 2)","v":177.82},8.1300000000000008,{"$f":"ROUND(N7 * (1 + VAT), 2)","v":9.27}]
["Homepower 3","H3",0,1,"H301Y",null,null,"Homepower 3",null,101.33,{"$f":"ROUND(J8 * (1 + VAT), 2)","v":115.52},155.97999999999999,{"$f":"ROUND(L8 * (1 + VAT), 2)","v":177.82},16.79,{"$f":"ROUND(N8 * (1 + VAT), 2)","v":19.14}]
["Homepower 4","H4",0,1,"H401Y",null,null,"Homepower 4",null,101.33,{"$f":"ROUND(J9 * (1 + VAT), 2)","v":115.52},162.94,{"$f":"ROUND(L9 * (1 + VAT), 2)","v":185.75},2.65,{"$f":"ROUND(N9 * (1 + VAT), 2)","v":3.02}]

{"sheet":"Homelight inc","index":18,"n_rows":13,"n_cols":11,"rows_kept":13,"cut":false,"hidden":false,"merged":[[11,7,11,8],[12,7,12,8],[1,7,1,12],[3,7,4,8],[3,9,3,10],[5,7,5,8],[6,7,6,8],[9,7,10,8],[9,9,9,10]]}
[null,null,null,null,null,null,null,"Back to menu"]
["Non-municipal",null,null,null,null,null,null,"Homelight tariffs  \nNon-local authority"]
[]
[null,null,null,null,null,null,null,"Homelight 60A",null,"Energy charge [c/kWh]"]
["Tariff","Tariff nameBillcode","Tx zone","Voltage","Billcode",null,null,null,null,null,"VAT incl"]
["Homelight 1 60A","HL16",0,1,{"$f":"B6&C6&D6&IF($A$2=\"Non-municipal\",\"N\",IF($A$2=\"Municiple\",\"Y\",\"error\"))","v":"HL1601N"},null,null,"Block 1   [> 0 - 600 kWh]",null,94.51,{"$f":"ROUND(J6 * (1 + VAT), 2)","v":107.74}]
["Homelight 2 60A","HL26",0,1,{"$f":"B7&C7&D7&IF($A$2=\"Non-municipal\",\"N\",IF($A$2=\"Municiple\",\"Y\",\"error\"))","v":"HL2601N"},null,null,"Block 2   [>600 kWh]",null,160.63999999999999,{"$f":"ROUND(J7 * (1 + VAT), 2)","v":183.13}]
[]
[]
[null,null,null,null,null,null,null,"Homelight 20A",null,"Energy charge [c/kWh]"]
[null,null,null,null,null,null,null,null,null,null,"VAT incl"]
["Homelight 1 20A","HL12",0,1,{"$f":"B12&C12&D12&IF($A$2=\"Non-municipal\",\"N\",IF($A$2=\"Municiple\",\"Y\",\"error\"))","v":"HL1201N"},null,null,"Block 1   [> 0 - 350 kWh]",null,85.28,{"$f":"ROUND(J12 * (1 + VAT), 2)","v":97.22}]
["Homelight 2 20A","HL22",0,1,{"$f":"B13&C13&D13&IF($A$2=\"Non-municipal\",\"N\",IF($A$2=\"Municiple\",\"Y\",\"error\"))","v":"HL2201N"},null,null,"Block 2   [>350 kWh]",null,94.96,{"$f":"ROUND(J13 * (1 + VAT), 2)","v":108.25}]

{"sheet":"Nightsave Rural inc","index":19,"n_rows":34,"n_cols":33,"rows_kept":34,"cut":false,"hidden":false,"merged":[[1,6,1,16],[1,17,1,18],[3,9,3,12],[3,13,3,16],[3,17,5,18],[4,7,6,7],[4,9,5,10],[4,11,5,12],[4,13,5,14],[4,15,5,16],[2,7,2,18],[29,15,29,16],[29,17,29,18],[30,7,30,8],[7,7,10,7],[11,7,14,7],[15,7,18,7],[19,7,22,7],[25,7,26,8],[25,9,26,10],[25,11,26,12],[31,7,31,8],[32,7,32,8],[27,7,27,8],[28,7,28,8],[29,7,29,8]]}
[null,null,null,null,null,null,"Back to menu",null,null,null,null,null,null,null,null,null,null,null,{"$error":"#REF!"}]
["Non-municipal",null,null,null,null,null,"Nightsave Rural tariff",null,null,null,null,null,null,null,null,null,null,"Non-local authority",null,null,null,null,null,null,null,null,null,null,null,null,null,{"$f":"SUM(#REF!,#REF!,#REF!,#REF!,#REF!,#REF!,#REF!,#REF!,#REF!,#REF!,#REF!,#REF!,#REF!,#REF!,#REF!)","v":{"$error":"#REF!"}},"check value"]
[]
[null,null,null,null,null,null,null,null,null,"Active energy charge [c/kWh]",null,null,null,"Energy demand charges [R/kVA/m]",null,null,null,"Network capacity charges [R/kVA/m]"]
[null,null,null,null,null,null,null,"Transmission zone",null,"High demand season \n[Jun - Aug]",null,"Low demand season \n[Sep - May]",null,"High demand season \n[Jun - Aug]",null,"Low demand season \n[Sep - May]"]
[null,null,null,null,null,null,null,null,"Voltage"]
["Tariff","Tariff nameBillcode","Tx zone","Voltage","Billcode",null,null,null,null,"","VAT incl",null,"VAT incl","","VAT incl",null,"VAT incl",null,"VAT incl"]
["Nightsave Rural","NR",0,1,{"$f":"B8&C8&D8&IF($A$2=\"Non-municipal\",\"N\",IF($A$2=\"Municiple\",\"Y\",\"error\"))","v":"NR01N"},null,null,"≤ 300km","< 500V",62.87,{"$f":"ROUND(J8 * (1 + VAT), 2)","v":71.67},48.85,{"$f":"ROUND(L8 * (1 + VAT), 2)","v":55.69},210.66,{"$f":"ROUND(N8 * (1 + VAT), 2)","v":240.15},111.5,{"$f":"ROUND(P8 * (1 + VAT), 2)","v":127.11},10.65,{"$f":"ROUND(R8 * (1 + VAT), 2)","v":12.14}]
["Nightsave Rural","NR",0,2,{"$f":"B9&C9&D9&IF($A$2=\"Non-municipal\",\"N\",IF($A$2=\"Municiple\",\"Y\",\"error\"))","v":"NR02N"},null,null,null,"≥ 500V & ≤ 22kV",62.13,70.83,48.31,55.07,204.13,232.71,107.53,122.58,9.7799999999999994,11.15]
["Nightsave Rural","NR",null,null,"NRN",null,null,null,null,0,null,0,null,0,0,0,0,0]
["Nightsave Rural","NR",null,null,"NRN",null,null,null,null,0,null,0,null,0,0,0,0,0]
["Nightsave Rural","NR",1,1,"NR11N",null,null,"> 300km and \n≤ 600km","< 500V",63.49,72.38,49.34,56.25,213.2,243.05,113.04,128.87,10.68,12.18]
["Nightsave Rural","NR",1,2,"NR12N",null,null,null,"≥ 500V & ≤ 22kV",62.77,71.56,48.79,55.62,206.63,235.56,109.03,124.29,9.83,11.21]
["Nightsave Rural","NR",null,null,"NRN",null,null,null,null,0,null,0,null,0,0,0,0,0]
["Nightsave Rural","NR",null,null,"NRN",null,null,null,null,0,null,0,null,0,0,0,0,0]
["Nightsave Rural","NR",2,1,"NR21N",null,null,"> 600km and \n≤ 900km","< 500V",64.13,73.11,49.83,56.81,215.76,245.97,114.56,130.6,10.78,12.29]
["Nightsave Rural","NR",2,2,"NR22N",null,null,null,"≥ 500V & ≤ 22kV",63.38,72.25,49.28,56.18,209.1,238.37,110.54,126.02,9.89,11.27]
["Nightsave Rural","NR",null,null,"NRN",null,null,null,null,0,null,0,null,0,0,0,0,0]
["Nightsave Rural","NR",null,null,"NRN",null,null,null,null,0,null,0,null,0,0,0,0,0]
["Nightsave Rural","NR",3,1,"NR31N",null,null,"> 900km","< 500V",64.760000000000005,73.83,50.33,57.38,218.37,{"$f":"ROUND(N20 * (1 + VAT), 2)","v":248.94},116.14,{"$f":"ROUND(P20 * (1 + VAT), 2)","v":132.4},10.8,12.31]
["Nightsave Rural","NR",3,2,"NR32N",null,null,null,"≥ 500V & ≤ 22kV",64,72.959999999999994,49.75,56.72,211.65,241.28,112.08,127.77,9.91,11.3]
[]
[]
[]
[]
[null,null,null,null,null,null,null,"Customer categories",null,"Service charge  \n[R/account/day]",null,"Administration charge  [R/POD/day]"]
[]
["Tariff","Tariff nameBillcode","Tx zone","Voltage","Billcode",null,null,null,null,null,"VAT incl",null,"VAT incl"]
["Nightsave Rural","NR",0,1,{"$f":"B29&C29&D29&IF($A$2=\"Non-municipal\",\"N\",IF($A$2=\"Municiple\",\"Y\",\"error\"))","v":"NR01N"},null,null,"≤ 100 kVA",null,14.64,{"$f":"ROUND(J29 * (1 + VAT), 2)","v":16.690000000000001},4.16,{"$f":"ROUND(L29 * (1 + VAT), 2)","v":4.74}]
["Nightsave Rural","NR",0,1,"NR01N",null,null,"> 100 kVA & ≤ 500 kVA",null,49.94,{"$f":"ROUND(J30 * (1 + VAT), 2)","v":56.93},23.15,{"$f":"ROUND(L30 * (1 + VAT), 2)","v":26.39},null,null,"Ancillary service charge [c/kWh]",null,"Network demand charge [c/kWh]         \n       [All time of use periods]"]
["Nightsave Rural","NR",0,1,"NR01N",null,null,"> 500 kVA & ≤ 1 MVA",null,153.63,{"$f":"ROUND(J31 * (1 + VAT), 2)","v":175.14},35.53,{"$f":"ROUND(L31 * (1 + VAT), 2)","v":40.5},null,"Voltage",null,"VAT incl",null,"VAT incl"]
["Nightsave Rural","NR",0,1,"NR01N",null,null,"> 1 MVA",null,153.63,{"$f":"ROUND(J32 * (1 + VAT), 2)","v":175.14},65.930000000000007,{"$f":"ROUND(L32 * (1 + VAT), 2)","v":75.16},null,"< 500V",0.33,{"$f":"ROUND(P32 * (1 + VAT), 2)","v":0.38},21.19,{"$f":"ROUND(R32 * (1 + VAT), 2)","v":24.16}]
["Nightsave Rural","NR",0,1,"NR01N",null,null,"Key customers",null,3010.96,{"$f":"ROUND(J33 * (1 + VAT), 2)","v":3432.49},65.930000000000007,{"$f":"ROUND(L33 * (1 + VAT), 2)","v":75.16},null,"≥ 500V & ≤ 22kV",0.33,{"$f":"ROUND(P33 * (1 + VAT), 2)","v":0.38},18.57,{"$f":"ROUND(R33 * (1 + VAT), 2)","v":21.17}]
["Nightsave Rural","NR",0,2,"NR02N"]

{"sheet":"Nightsave Rural Munic inc ","index":20,"n_rows":33,"n_cols":33,"rows_kept":33,"cut":false,"hidden":false,"merged":[[1,6,1,16],[1,17,1,18],[3,9,3,12],[3,13,3,16],[3,17,5,18],[4,7,6,7],[4,9,5,10],[4,11,5,12],[4,13,5,14],[4,15,5,16],[2,6,2,18],[29,15,29,16],[29,17,29,18],[30,7,30,8],[7,7,10,7],[11,7,14,7],[15,7,18,7],[19,7,22,7],[25,7,26,8],[25,9,26,10],[25,11,26,12],[31,7,31,8],[32,7,32,8],[27,7,27,8],[28,7,28,8],[29,7,29,8]]}
[null,null,null,null,null,null,"Back to menu",null,null,null,null,null,null,null,null,null,null,null,{"$error":"#REF!"}]
["Municiple",null,null,null,null,null,"Nightsave Rural tariff",null,null,null,null,null,null,null,null,null,null,"Local authority",null,null,null,null,null,null,null,null,null,null,null,null,null,{"$f":"SUM(#REF!,#REF!,#REF!,#REF!,#REF!,#REF!,#REF!,#REF!,#REF!,#REF!,#REF!,#REF!,#REF!,#REF!,#REF!)","v":{"$error":"#REF!"}},"check value"]
[]
[null,null,null,null,null,null,null,null,null,"Active energy charge [c/kWh]",null,null,null,"Energy demand charges [R/kVA/m]",null,null,null,"Network capacity charges [R/kVA/m]"]
[null,null,null,null,null,null,null,"Transmission zone",null,"High demand season \n[Jun - Aug]",null,"Low demand season \n[Sep - May]",null,"High demand season \n[Jun - Aug]",null,"Low demand season \n[Sep - May]"]
[null,null,null,null,null,null,null,null,"Voltage"]
["Tariff","Tariff nameBillcode","Tx zone","Voltage","Billcode",null,null,null,null,"","VAT incl",null,"VAT incl","","VAT incl",null,"VAT incl",null,"VAT incl"]
["Nightsave Rural","NR",0,1,{"$f":"B8&C8&D8&IF($A$2=\"Non-municipal\",\"N\",IF($A$2=\"Municiple\",\"Y\",\"error\"))","v":"NR01Y"},null,null,"≤ 300km","< 500V",65.290000000000006,{"$f":"ROUND(J8 * (1 + VAT), 2)","v":74.430000000000007},50.73,{"$f":"ROUND(L8 * (1 + VAT), 2)","v":57.83},213.67,{"$f":"ROUND(N8 * (1 + VAT), 2)","v":243.58},113.09,{"$f":"ROUND(P8 * (1 + VAT), 2)","v":128.91999999999999},10.91,{"$f":"ROUND(R8 * (1 + VAT), 2)","v":12.44}]
["Nightsave Rural","NR",0,2,{"$f":"B9&C9&D9&IF($A$2=\"Non-municipal\",\"N\",IF($A$2=\"Municiple\",\"Y\",\"error\"))","v":"NR02Y"},null,null,null,"≥ 500V & ≤ 22kV",64.52,73.55,50.17,57.19,207.05,236.04,109.06,124.33,10.02,11.42]
["Nightsave Rural","NR",null,null,"NRY",null,null,null,null,0,null,0,null,0,0,0,0,0]
["Nightsave Rural","NR",null,null,"NRY",null,null,null,null,0,null,0,null,0,0,0,0,0]
["Nightsave Rural","NR",1,1,"NR11Y",null,null,"> 300km and \n≤ 600km","< 500V",65.95,75.180000000000007,51.25,58.43,216.26,246.54,114.66,130.71,10.93,12.46]
["Nightsave Rural","NR",1,2,"NR12Y",null,null,null,"≥ 500V & ≤ 22kV",65.16,74.28,50.67,57.76,209.58,238.92,110.58,126.06,10.06,11.47]
["Nightsave Rural","NR",null,null,"NRY",null,null,null,null,0,null,0,null,0,0,0,0,0]
["Nightsave Rural","NR",null,null,"NRY",null,null,null,null,0,null,0,null,0,0,0,0,0]
["Nightsave Rural","NR",2,1,"NR21Y",null,null,"> 600km and \n≤ 900km","< 500V",66.59,75.91,51.74,58.98,218.85,249.49,116.2,132.47,11.04,12.59]
["Nightsave Rural","NR",2,2,"NR22Y",null,null,null,"≥ 500V & ≤ 22kV",65.81,75.02,51.17,58.33,212.1,241.79,112.12,127.82,10.119999999999999,11.54]
["Nightsave Rural","NR",null,null,"NRY",null,null,null,null,0,null,0,null,0,0,0,0,0]
["Nightsave Rural","NR",null,null,"NRY",null,null,null,null,0,null,0,null,0,0,0,0,0]
["Nightsave Rural","NR",3,1,"NR31Y",null,null,"> 900km","< 500V",67.25,76.67,52.25,59.57,221.5,252.51,117.8,134.29,11.05,12.6]
["Nightsave Rural","NR",3,2,"NR32Y",null,null,null,"≥ 500V & ≤ 22kV",66.459999999999994,75.760000000000005,51.66,58.89,214.69,244.75,113.68,129.6,10.130000000000001,11.55]
[]
[]
[]
[]
[null,null,null,null,null,null,null,"Customer categories",null,"Service charge  \n[R/account/day]",null,"Administration charge  [R/POD/day]"]
[]
["Tariff","Tariff nameBillcode","Tx zone","Voltage","Billcode",null,null,null,null,null,"VAT incl",null,"VAT incl"]
["Nightsave Rural","NR",0,1,{"$f":"B29&C29&D29&IF($A$2=\"Non-municipal\",\"N\",IF($A$2=\"Municiple\",\"Y\",\"error\"))","v":"NR01Y"},null,null,"≤ 100 kVA",null,14.79,{"$f":"ROUND(J29 * (1 + VAT), 2)","v":16.86},4.2,{"$f":"ROUND(L29 * (1 + VAT), 2)","v":4.79}]
["Nightsave Rural","NR",0,1,{"$f":"B30&C30&D30&IF($A$2=\"Non-municipal\",\"N\",IF($A$2=\"Municiple\",\"Y\",\"error\"))","v":"NR01Y"},null,null,"> 100 kVA & ≤ 500 kVA",null,50.43,{"$f":"ROUND(J30 * (1 + VAT), 2)","v":57.49},23.37,{"$f":"ROUND(L30 * (1 + VAT), 2)","v":26.64},null,null,"Ancillary service charge [c/kWh]",null,"Network demand charge [c/kWh]         \n       [All time of use periods]"]
["Nightsave Rural","NR",0,1,{"$f":"B31&C31&D31&IF($A$2=\"Non-municipal\",\"N\",IF($A$2=\"Municiple\",\"Y\",\"error\"))","v":"NR01Y"},null,null,"> 500 kVA & ≤ 1 MVA",null,155.12,{"$f":"ROUND(J31 * (1 + VAT), 2)","v":176.84},35.869999999999997,{"$f":"ROUND(L31 * (1 + VAT), 2)","v":40.89},null,"Voltage",null,"VAT incl",null,"VAT incl"]
["Nightsave Rural","NR",0,1,{"$f":"B32&C32&D32&IF($A$2=\"Non-municipal\",\"N\",IF($A$2=\"Municiple\",\"Y\",\"error\"))","v":"NR01Y"},null,null,"> 1 MVA",null,155.12,{"$f":"ROUND(J32 * (1 + VAT), 2)","v":176.84},66.58,{"$f":"ROUND(L32 * (1 + VAT), 2)","v":75.900000000000006},null,"< 500V",0.33,{"$f":"ROUND(P32 * (1 + VAT), 2)","v":0.38},21.71,{"$f":"ROUND(R32 * (1 + VAT), 2)","v":24.75}]
["Nightsave Rural","NR",0,1,{"$f":"B33&C33&D33&IF($A$2=\"Non-municipal\",\"N\",IF($A$2=\"Municiple\",\"Y\",\"error\"))","v":"NR01Y"},null,null,"Key customers",null,3039.93,{"$f":"ROUND(J33 * (1 + VAT), 2)","v":3465.52},66.58,{"$f":"ROUND(L33 * (1 + VAT), 2)","v":75.900000000000006},null,"≥ 500V & ≤ 22kV",0.33,{"$f":"ROUND(P33 * (1 + VAT), 2)","v":0.38},19.010000000000002,{"$f":"ROUND(R33 * (1 + VAT), 2)","v":21.67}]

{"sheet":"Ruraflex inc","index":21,"n_rows":34,"n_cols":33,"rows_kept":34,"cut":false,"hidden":false,"merged":[[3,21,5,22],[7,7,10,7],[1,6,1,16],[1,17,1,18],[1,19,1,22],[3,9,3,20],[4,7,6,7],[4,9,4,14],[4,15,4,20],[5,9,5,10],[5,11,5,12],[5,13,5,14],[5,15,5,16],[5,17,5,18],[5,19,5,20],[28,7,28,8],[28,14,28,15],[11,7,14,7],[15,7,18,7],[19,7,22,7],[25,7,26,8],[25,9,26,10],[25,11,26,12],[25,16,25,17],[25,18,25,19],[26,14,26,15],[27,7,27,8],[27,14,27,15],[32,7,32,8],[29,7,29,8],[30,7,30,8],[30,14,30,17],[31,7,31,8],[31,14,31,15],[31,16,31,17]]}
[null,null,null,null,null,null,"Back to menu"]
["Non-municipal",null,null,null,null,null,"Ruraflex tariff",null,null,null,null,null,null,null,null,null,null,null,null,"Non-local authority",null,null,null,null,null,null,null,null,null,null,null,{"$f":"SUM(#REF!,#REF!,#REF!,#REF!,#REF!,#REF!,#REF!,#REF!,#REF!,#REF!,#REF!,#REF!)","v":{"$error":"#REF!"}},"check value"]
[]
[null,null,null,null,null,null,null,null,null,"Active energy charge [c/kWh]",null,null,null,null,null,null,null,null,null,null,null,"Network capacity charges [R/kVA/m]"]
[null,null,null,null,null,null,null,"Transmission zone",null,"High demand season [Jun - Aug]",null,null,null,null,null,"Low demand season [Sep - May]"]
[null,null,null,null,null,null,null,null,"Voltage","Peak",null,"Standard",null,"Off Peak",null,"Peak",null,"Standard",null,"Off Peak"]
["Tariff","Tariff nameBillcode","Tx zone","Voltage","Billcode",null,null,null,null,"","VAT incl",null,"VAT incl",null,"VAT incl",null,"VAT incl",null,"VAT incl",null,"VAT incl",null,"VAT incl"]
["Ruraflex","Ru",0,1,{"$f":"B8&C8&D8&IF($A$2=\"Non-municipal\",\"N\",IF($A$2=\"Municiple\",\"Y\",\"error\"))","v":"Ru01N"},null,null,"≤ 300km","< 500V",257.77,{"$f":"ROUND(J8 * (1 + VAT), 2)","v":293.86},78.09,{"$f":"ROUND(L8 * (1 + VAT), 2)","v":89.02},42.41,{"$f":"ROUND(N8 * (1 + VAT), 2)","v":48.35},84.09,{"$f":"ROUND(P8 * (1 + VAT), 2)","v":95.86},57.87,{"$f":"ROUND(R8 * (1 + VAT), 2)","v":65.97},36.71,{"$f":"ROUND(T8 * (1 + VAT), 2)","v":41.85},14.88,{"$f":"ROUND(V8 * (1 + VAT), 2)","v":16.96}]
["Ruraflex","Ru",0,2,{"$f":"B9&C9&D9&IF($A$2=\"Non-municipal\",\"N\",IF($A$2=\"Municiple\",\"Y\",\"error\"))","v":"Ru02N"},null,null,null,"≥ 500V & ≤ 22kV",255.22,290.95,77.319999999999993,88.14,41.98,47.86,83.26,94.92,57.29,65.31,36.340000000000003,41.43,13.64,15.55]
["Ruraflex","Ru",null,null,"RuN",null,null,null,null,0,null,0,null,0,null,0,null,0,null,0,null,0]
["Ruraflex","Ru",null,null,"RuN",null,null,null,null,0,null,0,null,0,null,0,null,0,null,0,null,0]
["Ruraflex","Ru",1,1,"Ru11N",null,null,"> 300km and \n≤ 600km","< 500V",260.35000000000002,296.8,78.87,89.91,42.83,48.83,84.92,96.81,58.45,66.63,37.090000000000003,42.28,14.93,17.02]
["Ruraflex","Ru",1,2,"Ru12N",null,null,null,"≥ 500V & ≤ 22kV",257.76,293.85000000000002,78.08,89.01,42.41,48.35,84.09,95.86,57.86,65.959999999999994,36.71,41.85,13.73,15.65]
["Ruraflex","Ru",null,null,"RuN",null,null,null,null,0,null,0,null,0,null,0,null,0,null,0,null,0]
["Ruraflex","Ru",null,null,"RuN",null,null,null,null,0,null,0,null,0,null,0,null,0,null,0,null,0]
["Ruraflex","Ru",2,1,"Ru21N",null,null,"> 600km and \n≤ 900km","< 500V",262.95,299.76,79.66,90.81,43.25,49.31,85.78,97.79,59.03,67.290000000000006,37.46,42.7,15.01,17.11]
["Ruraflex","Ru",2,2,"Ru22N",null,null,null,"≥ 500V & ≤ 22kV",260.33999999999997,296.79000000000002,78.86,89.9,42.83,48.83,84.92,96.81,58.45,66.63,37.090000000000003,42.28,13.78,15.71]
["Ruraflex","Ru",null,null,"RuN",null,null,null,null,0,null,0,null,0,null,0,null,0,null,0,null,0]
["Ruraflex","Ru",null,null,"RuN",null,null,null,null,0,null,0,null,0,null,0,null,0,null,0,null,0]
["Ruraflex","Ru",3,1,"Ru31N",null,null,"> 900km","< 500V",265.58,302.76,80.459999999999994,91.72,43.68,49.8,86.62,98.75,59.62,67.97,37.83,43.13,15.07,17.18]
["Ruraflex","Ru",3,2,"Ru32N",null,null,null,"≥ 500V & ≤ 22kV",262.94,299.75,79.66,90.81,43.25,49.31,85.78,97.79,59.03,67.290000000000006,37.46,42.7,13.79,15.72]
[null,null,null,null,null,null,null,null,null,null,null,null,null,0]
[null,null,null,null,null,null,null,null,null,null,null,null,null,0]
[]
[]
[null,null,null,null,null,null,null,"Customer categories",null,"Service charge  [R/account/day]",null,"Administration charge  [R/POD/day]",null,null,null,null,"Ancillary service charge [c/kWh]",null,"Network demand charge [c/kWh]        \n     [All time of use periods]"]
[null,null,null,null,null,null,null,null,null,null,null,null,null,null,"Voltage",null,null,"VAT incl",null,"VAT incl"]
["Tariff","Tariff nameBillcode","Tx zone","Voltage","Billcode",null,null,null,null,null,"VAT incl",null,"VAT incl",null,"< 500V",null,0.33,{"$f":"ROUND(Q28 * (1 + VAT), 2)","v":0.38},21.19,{"$f":"ROUND(S28 * (1 + VAT), 2)","v":24.16}]
["Ruraflex","Ru",0,1,{"$f":"B29&C29&D29&IF($A$2=\"Non-municipal\",\"N\",IF($A$2=\"Municiple\",\"Y\",\"error\"))","v":"Ru01N"},null,null,"≤ 100 kVA",null,14.64,{"$f":"ROUND(J29 * (1 + VAT), 2)","v":16.690000000000001},4.16,{"$f":"ROUND(L29 * (1 + VAT), 2)","v":4.74},null,"≥ 500V & < 22kV",null,0.33,{"$f":"ROUND(Q29 * (1 + VAT), 2)","v":0.38},18.57,{"$f":"ROUND(S29 * (1 + VAT), 2)","v":21.17}]
["Ruraflex","Ru",0,1,{"$f":"B30&C30&D30&IF($A$2=\"Non-municipal\",\"N\",IF($A$2=\"Municiple\",\"Y\",\"error\"))","v":"Ru01N"},null,null,"> 100 kVA & ≤ 500 kVA",null,49.94,{"$f":"ROUND(J30 * (1 + VAT), 2)","v":56.93},23.15,{"$f":"ROUND(L30 * (1 + VAT), 2)","v":26.39}]
["Ruraflex","Ru",0,1,{"$f":"B31&C31&D31&IF($A$2=\"Non-municipal\",\"N\",IF($A$2=\"Municiple\",\"Y\",\"error\"))","v":"Ru01N"},null,null,"> 500 kVA & ≤ 1 MVA",null,153.63,{"$f":"ROUND(J31 * (1 + VAT), 2)","v":175.14},35.53,{"$f":"ROUND(L31 * (1 + VAT), 2)","v":40.5},null,"Reactive energy charge  [c/kVArh]"]
["Ruraflex","Ru",0,1,{"$f":"B32&C32&D32&IF($A$2=\"Non-municipal\",\"N\",IF($A$2=\"Municiple\",\"Y\",\"error\"))","v":"Ru01N"},null,null,"> 1 MVA",null,153.63,{"$f":"ROUND(J32 * (1 + VAT), 2)","v":175.14},65.930000000000007,{"$f":"ROUND(L32 * (1 + VAT), 2)","v":75.16},null,"High season",null,"Low season"]
["Ruraflex","Ru",0,1,{"$f":"B33&C33&D33&IF($A$2=\"Non-municipal\",\"N\",IF($A$2=\"Municiple\",\"Y\",\"error\"))","v":"Ru01N"},null,null,"Key customers",null,3010.96,{"$f":"ROUND(J33 * (1 + VAT), 2)","v":3432.49},65.930000000000007,{"$f":"ROUND(L33 * (1 + VAT), 2)","v":75.16},null,null,"VAT incl",null,"VAT incl"]
[null,null,null,null,null,null,null,null,null,null,null,null,null,null,7.16,{"$f":"ROUND(O34 * (1 + VAT), 2)","v":8.16},0,{"$f":"ROUND(Q34 * (1 + VAT), 2)","v":0}]

{"sheet":"Ruraflex Munic inc","index":22,"n_rows":34,"n_cols":33,"rows_kept":34,"cut":false,"hidden":false,"merged":[[3,21,5,22],[7,7,10,7],[1,6,1,16],[1,17,1,18],[1,19,1,22],[3,9,3,20],[4,7,6,7],[4,9,4,14],[4,15,4,20],[5,9,5,10],[5,11,5,12],[5,13,5,14],[5,15,5,16],[5,17,5,18],[5,19,5,20],[28,7,28,8],[28,14,28,15],[11,7,14,7],[15,7,18,7],[19,7,22,7],[25,7,26,8],[25,9,26,10],[25,11,26,12],[25,16,25,17],[25,18,25,19],[26,14,26,15],[27,7,27,8],[27,14,27,15],[32,7,32,8],[29,7,29,8],[30,7,30,8],[30,14,30,17],[31,7,31,8],[31,14,31,15],[31,16,31,17]]}
[null,null,null,null,null,null,"Back to menu"]
["Municiple",null,null,null,null,null,"Ruraflex tariff",null,null,null,null,null,null,null,null,null,null,null,null,"Local authority",null,null,null,null,null,null,null,null,null,null,null,{"$f":"SUM(#REF!,#REF!,#REF!,#REF!,#REF!,#REF!,#REF!,#REF!,#REF!,#REF!,#REF!,#REF!)","v":{"$error":"#REF!"}},"check value"]
[]
[null,null,null,null,null,null,null,null,null,"Active energy charge [c/kWh]",null,null,null,null,null,null,null,null,null,null,null,"Network capacity charges [R/kVA/m]"]
[null,null,null,null,null,null,null,"Transmission zone",null,"High demand season [Jun - Aug]",null,null,null,null,null,"Low demand season [Sep - May]"]
[null,null,null,null,null,null,null,null,"Voltage","Peak",null,"Standard",null,"Off Peak",null,"Peak",null,"Standard",null,"Off Peak"]
["Tariff","Tariff nameBillcode","Tx zone","Voltage","Billcode",null,null,null,null,"","VAT incl",null,"VAT incl",null,"VAT incl",null,"VAT incl",null,"VAT incl",null,"VAT incl",null,"VAT incl"]
["Ruraflex","Ru",0,1,{"$f":"B8&C8&D8&IF($A$2=\"Non-municipal\",\"N\",IF($A$2=\"Municiple\",\"Y\",\"error\"))","v":"Ru01Y"},null,null,"≤ 300km","< 500V",267.69,{"$f":"ROUND(J8 * (1 + VAT), 2)","v":305.17},81.09,{"$f":"ROUND(L8 * (1 + VAT), 2)","v":92.44},44.04,{"$f":"ROUND(N8 * (1 + VAT), 2)","v":50.21},87.33,{"$f":"ROUND(P8 * (1 + VAT), 2)","v":99.56},60.1,{"$f":"ROUND(R8 * (1 + VAT), 2)","v":68.510000000000005},38.119999999999997,{"$f":"ROUND(T8 * (1 + VAT), 2)","v":43.46},15.22,{"$f":"ROUND(V8 * (1 + VAT), 2)","v":17.350000000000001}]
["Ruraflex","Ru",0,2,{"$f":"B9&C9&D9&IF($A$2=\"Non-municipal\",\"N\",IF($A$2=\"Municiple\",\"Y\",\"error\"))","v":"Ru02Y"},null,null,null,"≥ 500V & ≤ 22kV",265.02999999999997,302.13,80.290000000000006,91.53,43.59,49.69,86.47,98.58,59.48,67.81,37.729999999999997,43.01,13.96,15.91]
["Ruraflex","Ru",null,null,"RuY",null,null,null,null,0,null,0,null,0,null,0,null,0,null,0,null,0]
["Ruraflex","Ru",null,null,"RuY",null,null,null,null,0,null,0,null,0,null,0,null,0,null,0,null,0]
["Ruraflex","Ru",1,1,"Ru11Y",null,null,"> 300km and \n≤ 600km","< 500V",270.36,308.20999999999998,81.91,93.38,44.46,50.68,88.19,100.54,60.7,69.2,38.51,43.9,15.29,17.43]
["Ruraflex","Ru",1,2,"Ru12Y",null,null,null,"≥ 500V & ≤ 22kV",267.68,305.16000000000003,81.08,92.43,44.04,50.21,87.33,99.56,60.09,68.5,38.119999999999997,43.46,14.05,16.02]
["Ruraflex","Ru",null,null,"RuY",null,null,null,null,0,null,0,null,0,null,0,null,0,null,0,null,0]
["Ruraflex","Ru",null,null,"RuY",null,null,null,null,0,null,0,null,0,null,0,null,0,null,0,null,0]
["Ruraflex","Ru",2,1,"Ru21Y",null,null,"> 600km and \n≤ 900km","< 500V",273.07,311.3,82.71,94.29,44.92,51.21,89.07,101.54,61.29,69.87,38.9,44.35,15.37,17.52]
["Ruraflex","Ru",2,2,"Ru22Y",null,null,null,"≥ 500V & ≤ 22kV",270.35000000000002,308.2,81.900000000000006,93.37,44.46,50.68,88.19,100.54,60.7,69.2,38.51,43.9,14.11,16.09]
["Ruraflex","Ru",null,null,"RuY",null,null,null,null,0,null,0,null,0,null,0,null,0,null,0,null,0]
["Ruraflex","Ru",null,null,"RuY",null,null,null,null,0,null,0,null,0,null,0,null,0,null,0,null,0]
["Ruraflex","Ru",3,1,"Ru31Y",null,null,"> 900km","< 500V",275.8,314.41000000000003,83.56,95.26,45.35,51.7,89.95,102.54,61.92,70.59,39.28,44.78,15.42,17.579999999999998]
["Ruraflex","Ru",3,2,"Ru32Y",null,null,null,"≥ 500V & ≤ 22kV",273.06,311.29000000000002,82.71,94.29,44.92,51.21,89.07,101.54,61.29,69.87,38.9,44.35,14.12,16.100000000000001]
[null,null,null,null,null,null,null,null,null,null,null,null,null,0]
[null,null,null,null,null,null,null,null,null,null,null,null,null,0]
[]
[]
[null,null,null,null,null,null,null,"Customer categories",null,"Service charge  [R/account/day]",null,"Administration charge  [R/POD/day]",null,null,null,null,"Ancillary service charge [c/kWh]",null,"Network demand charge [c/kWh]        \n     [All time of use periods]"]
[null,null,null,null,null,null,null,null,null,null,null,null,null,null,"Voltage",null,null,"VAT incl",null,"VAT incl"]
["Tariff","Tariff nameBillcode","Tx zone","Voltage","Billcode",null,null,null,null,null,"VAT incl",null,"VAT incl",null,"< 500V",null,0.33,{"$f":"ROUND(Q28 * (1 + VAT), 2)","v":0.38},21.71,{"$f":"ROUND(S28 * (1 + VAT), 2)","v":24.75}]
["Ruraflex","Ru",0,1,{"$f":"B29&C29&D29&IF($A$2=\"Non-municipal\",\"N\",IF($A$2=\"Municiple\",\"Y\",\"error\"))","v":"Ru01Y"},null,null,"≤ 100 kVA",null,14.79,{"$f":"ROUND(J29 * (1 + VAT), 2)","v":16.86},4.2,{"$f":"ROUND(L29 * (1 + VAT), 2)","v":4.79},null,"≥ 500V & < 22kV",null,0.33,{"$f":"ROUND(Q29 * (1 + VAT), 2)","v":0.38},19.010000000000002,{"$f":"ROUND(S29 * (1 + VAT), 2)","v":21.67}]
["Ruraflex","Ru",0,1,{"$f":"B30&C30&D30&IF($A$2=\"Non-municipal\",\"N\",IF($A$2=\"Municiple\",\"Y\",\"error\"))","v":"Ru01Y"},null,null,"> 100 kVA & ≤ 500 kVA",null,50.43,{"$f":"ROUND(J30 * (1 + VAT), 2)","v":57.49},23.37,{"$f":"ROUND(L30 * (1 + VAT), 2)","v":26.64}]
["Ruraflex","Ru",0,1,{"$f":"B31&C31&D31&IF($A$2=\"Non-municipal\",\"N\",IF($A$2=\"Municiple\",\"Y\",\"error\"))","v":"Ru01Y"},null,null,"> 500 kVA & ≤ 1 MVA",null,155.12,{"$f":"ROUND(J31 * (1 + VAT), 2)","v":176.84},35.869999999999997,{"$f":"ROUND(L31 * (1 + VAT), 2)","v":40.89},null,"Reactive energy charge  [c/kVArh]"]
["Ruraflex","Ru",0,1,{"$f":"B32&C32&D32&IF($A$2=\"Non-municipal\",\"N\",IF($A$2=\"Municiple\",\"Y\",\"error\"))","v":"Ru01Y"},null,null,"> 1 MVA",null,155.12,{"$f":"ROUND(J32 * (1 + VAT), 2)","v":176.84},66.58,{"$f":"ROUND(L32 * (1 + VAT), 2)","v":75.900000000000006},null,"High season",null,"Low season"]
["Ruraflex","Ru",0,1,{"$f":"B33&C33&D33&IF($A$2=\"Non-municipal\",\"N\",IF($A$2=\"Municiple\",\"Y\",\"error\"))","v":"Ru01Y"},null,null,"Key customers",null,3039.93,{"$f":"ROUND(J33 * (1 + VAT), 2)","v":3465.52},66.58,{"$f":"ROUND(L33 * (1 + VAT), 2)","v":75.900000000000006},null,null,"VAT incl",null,"VAT incl"]
[null,null,null,null,null,null,null,null,null,null,null,null,null,null,7.22,{"$f":"ROUND(O34 * (1 + VAT), 2)","v":8.23},0,{"$f":"ROUND(Q34 * (1 + VAT), 2)","v":0}]

{"sheet":"Genflex Rural inc","index":23,"n_rows":36,"n_cols":33,"rows_kept":36,"cut":false,"hidden":false,"merged":[[2,6,2,23],[32,18,32,19],[29,7,29,8],[29,14,29,15],[34,7,34,8],[31,7,31,8],[32,7,32,8],[32,14,32,17],[33,7,33,8],[33,14,33,15],[33,16,33,17],[5,19,5,20],[30,7,30,8],[30,14,30,15],[11,7,14,7],[15,7,18,7],[19,7,22,7],[27,9,28,10],[27,11,28,12],[27,16,27,17],[23,7,23,8],[27,7,27,8],[28,7,28,8],[1,19,1,23],[27,14,28,15],[7,7,10,7],[1,6,1,16],[1,17,1,18],[3,9,3,20],[3,21,3,22],[4,7,6,7],[4,9,4,14],[4,15,4,20],[4,21,5,22],[5,9,5,10],[5,11,5,12],[5,13,5,14],[5,15,5,16],[5,17,5,18]]}
[null,null,null,null,null,null,"Back to menu",null,null,null,null,null,null,null,null,null,null,null,null,null,null,null,{"$error":"#REF!"}]
["Non-municipal",null,null,null,null,null,"Genflex Rural tariff",null,null,null,null,null,null,null,null,null,null,null,null,"Non-local authority",null,null,null,null,null,null,null,null,null,null,null,{"$f":"SUM(#REF!,#REF!,#REF!,#REF!,#REF!,#REF!,#REF!,#REF!,#REF!,#REF!,#REF!,#REF!)","v":{"$error":"#REF!"}},"check value"]
[]
[null,null,null,null,null,null,null,null,null,"Active energy charge [c/kWh]",null,null,null,null,null,null,null,null,null,null,null,"Network capacity charges [R/kVA/m]"]
[null,null,null,null,null,null,null,"Transmission zone",null,"High demand season [Jun - Aug]",null,null,null,null,null,"Low demand season [Sep - May]"]
[null,null,null,null,null,null,null,null,"Voltage","Peak",null,"Standard",null,"Off Peak",null,"Peak",null,"Standard",null,"Off Peak"]
["Tariff","Tariff nameBillcode","Tx zone","Voltage","Billcode",null,null,null,null,"","VAT incl",null,"VAT incl",null,"VAT incl",null,"VAT incl",null,"VAT incl",null,"VAT incl",null,"VAT incl"]
["Genflex rural","GR",0,1,{"$f":"B8&C8&D8&IF($A$2=\"Non-municipal\",\"N\",IF($A$2=\"Municiple\",\"Y\",\"error\"))","v":"GR01N"},null,null,"≤ 300km","< 500V",257.77,{"$f":"ROUND(J8 * (1 + VAT), 2)","v":293.86},78.09,{"$f":"ROUND(L8 * (1 + VAT), 2)","v":89.02},42.41,{"$f":"ROUND(N8 * (1 + VAT), 2)","v":48.35},84.09,{"$f":"ROUND(P8 * (1 + VAT), 2)","v":95.86},57.87,{"$f":"ROUND(R8 * (1 + VAT), 2)","v":65.97},36.71,{"$f":"ROUND(T8 * (1 + VAT), 2)","v":41.85},14.88,{"$f":"ROUND(V8 * (1 + VAT), 2)","v":16.96}]
["Genflex rural","GR",0,2,{"$f":"B9&C9&D9&IF($A$2=\"Non-municipal\",\"N\",IF($A$2=\"Municiple\",\"Y\",\"error\"))","v":"GR02N"},null,null,null,"≥ 500V & ≤ 22kV",255.22,290.95,77.319999999999993,88.14,41.98,47.86,83.26,94.92,57.29,65.31,36.340000000000003,41.43,13.64,15.55]
["Genflex rural","GR",null,null,"GRN",null,null,null,null,0,null,0,null,0,null,0,null,0,null,0,null,0]
["Genflex rural","GR",null,null,"GRN",null,null,null,null,0,null,0,null,0,null,0,null,0,null,0,null,0]
["Genflex rural","GR",1,1,"GR11N",null,null,"> 300km and \n≤ 600km","< 500V",260.35000000000002,296.8,78.87,89.91,42.83,48.83,84.92,96.81,58.45,66.63,37.090000000000003,42.28,14.93,17.02]
["Genflex rural","GR",1,2,"GR12N",null,null,null,"≥ 500V & ≤ 22kV",257.76,293.85000000000002,78.08,89.01,42.41,48.35,84.09,95.86,57.86,65.959999999999994,36.71,41.85,13.73,15.65]
["Genflex rural","GR",null,null,"GRN",null,null,null,null,0,null,0,null,0,null,0,null,0,null,0,null,0]
["Genflex rural","GR",null,null,"GRN",null,null,null,null,0,null,0,null,0,null,0,null,0,null,0,null,0]
["Genflex rural","GR",2,1,"GR21N",null,null,"> 600km and \n≤ 900km","< 500V",262.95,299.76,79.66,90.81,43.25,49.31,85.78,97.79,59.03,67.290000000000006,37.46,42.7,15.01,17.11]
["Genflex rural","GR",2,2,"GR22N",null,null,null,"≥ 500V & ≤ 22kV",260.33999999999997,296.79000000000002,78.86,89.9,42.83,48.83,84.92,96.81,58.45,66.63,37.090000000000003,42.28,13.78,15.71]
["Genflex rural","GR",null,null,"GRN",null,null,null,null,0,null,0,null,0,null,0,null,0,null,0,null,0]
["Genflex rural","GR",null,null,"GRN",null,null,null,null,0,null,0,null,0,null,0,null,0,null,0,null,0]
["Genflex rural","GR",3,1,"GR31N",null,null,"> 900km","< 500V",265.58,302.76,80.459999999999994,91.72,43.68,49.8,86.62,98.75,59.62,67.97,37.83,43.13,15.07,17.18]
["Genflex rural","GR",3,2,"GR32N",null,null,null,"≥ 500V & ≤ 22kV",262.94,299.75,79.66,90.81,43.25,49.31,85.78,97.79,59.03,67.290000000000006,37.46,42.7,13.79,15.72]
[null,null,null,null,null,null,null,null,null,null,null,null,null,0]
[null,null,null,null,null,null,null,null,null,null,null,null,null,0]
["Gen-purchase","NLPurchADJ",0,4,{"$f":"B24&C24&D24&IF($A$2=\"Non-municipal\",\"N\",IF($A$2=\"Municiple\",\"Y\",\"error\"))","v":"NLPurchADJ04N"}]
[]
[]
[]
[null,null,null,null,null,null,null,"Customer categories",null,"Service charge  [R/account/day]",null,"Administration charge  [R/POD/day]",null,null,"Voltage",null,"Ancillary service charge [c/kWh]"]
[null,null,null,null,null,null,null,"[kVA or MVA = loads]",null,null,null,null,null,null,null,null,null,"VAT incl"]
["Tariff","Tariff nameBillcode","Tx zone","Voltage","Billcode",null,null,"[kW or MW = generators]",null,null,"VAT incl",null,"VAT incl",null,"< 500V",null,0.33,{"$f":"ROUND(Q30 * (1 + VAT), 2)","v":0.38}]
["Genflex rural","GR",0,1,{"$f":"B31&C31&D31&IF($A$2=\"Non-municipal\",\"N\",IF($A$2=\"Municiple\",\"Y\",\"error\"))","v":"GR01N"},null,null,"≤ 100 kVA/kW",null,14.64,{"$f":"ROUND(J31 * (1 + VAT), 2)","v":16.690000000000001},4.16,{"$f":"ROUND(L31 * (1 + VAT), 2)","v":4.74},null,"≥ 500V & < 22kV",null,0.33,{"$f":"ROUND(Q31 * (1 + VAT), 2)","v":0.38}]
["Genflex rural","GR",0,1,{"$f":"B32&C32&D32&IF($A$2=\"Non-municipal\",\"N\",IF($A$2=\"Municiple\",\"Y\",\"error\"))","v":"GR01N"},null,null,"> 100 KVA/kW & ≤ 500 kVA/kW",null,49.94,{"$f":"ROUND(J32 * (1 + VAT), 2)","v":56.93},23.15,{"$f":"ROUND(L32 * (1 + VAT), 2)","v":26.39}]
["Genflex rural","GR",0,1,{"$f":"B33&C33&D33&IF($A$2=\"Non-municipal\",\"N\",IF($A$2=\"Municiple\",\"Y\",\"error\"))","v":"GR01N"},null,null,"> 500 kVA/kW & ≤ 1 MVA/MW",null,153.63,{"$f":"ROUND(J33 * (1 + VAT), 2)","v":175.14},35.53,{"$f":"ROUND(L33 * (1 + VAT), 2)","v":40.5},null,"Reactive energy charge  [c/kVArh]",null,null,null,"Network demand charge [c/kWh]        \n"]
["Genflex rural","GR",0,1,{"$f":"B34&C34&D34&IF($A$2=\"Non-municipal\",\"N\",IF($A$2=\"Municiple\",\"Y\",\"error\"))","v":"GR01N"},null,null,"> 1 MVA/MW",null,153.63,{"$f":"ROUND(J34 * (1 + VAT), 2)","v":175.14},65.930000000000007,{"$f":"ROUND(L34 * (1 + VAT), 2)","v":75.16},null,"High season",null,"Low season",null,null,"VAT incl"]
["Genflex rural","GR",0,1,{"$f":"B35&C35&D35&IF($A$2=\"Non-municipal\",\"N\",IF($A$2=\"Municiple\",\"Y\",\"error\"))","v":"GR01N"},null,null,"Key customers",null,3010.96,{"$f":"ROUND(J35 * (1 + VAT), 2)","v":3432.49},65.930000000000007,{"$f":"ROUND(L35 * (1 + VAT), 2)","v":75.16},null,null,"VAT incl",null,"VAT incl",21.19,{"$f":"ROUND(S35 * (1 + VAT), 2)","v":24.16}]
[null,null,null,null,null,null,null,null,null,null,null,null,null,null,7.16,{"$f":"ROUND(O36 * (1 + VAT), 2)","v":8.16},0,{"$f":"ROUND(Q36 * (1 + VAT), 2)","v":0},18.57,{"$f":"ROUND(S36 * (1 + VAT), 2)","v":21.17}]

{"sheet":"Landrate inc","index":24,"n_rows":11,"n_cols":19,"rows_kept":11,"cut":false,"hidden":false,"merged":[[3,17,3,18],[10,7,10,8],[3,9,3,10],[3,11,3,12],[3,13,3,14],[3,15,3,16],[5,7,5,8],[6,7,6,8],[7,7,7,8],[8,7,8,8],[9,7,9,8]]}
[null,null,null,null,null,null,null,"Back to menu"]
["Non-municipal",null,null,null,null,null,null,"Landrate tariffs",null,null,null,null,null,null,null,null,null,"Non-local authority"]
[]
[null,null,null,null,null,null,null,null,null,"Energy charge [c/kWh]",null,"Ancillary service charge [c/kWh]",null,"Network demand charge [c/kWh]",null,"Network capacity charge \n[R/POD/day]",null,"Service charge  \n[R/POD/day]"]
["Tariff","Tariff nameBillcode","Tx zone","Voltage","Billcode",null,null,null,null,null,"VAT incl",null,"VAT incl",null,"VAT incl",null,"VAT incl",null,"VAT incl"]
["Landrate 1","L1",0,1,{"$f":"B6&C6&D6&IF($A$2=\"Non-municipal\",\"N\",IF($A$2=\"Municiple\",\"Y\",\"error\"))","v":"L101N"},null,null,"Landrate 1",null,84.82,{"$f":"ROUND(J6 * (1 + VAT), 2)","v":96.69},0.33,{"$f":"ROUND(L6 * (1 + VAT), 2)","v":0.38},21.19,{"$f":"ROUND(N6 * (1 + VAT), 2)","v":24.16},22.65,{"$f":"ROUND(P6 * (1 + VAT), 2)","v":25.82},18.809999999999999,{"$f":"ROUND(R6 * (1 + VAT), 2)","v":21.44}]
["Landrate 2","L2",0,1,{"$f":"B7&C7&D7&IF($A$2=\"Non-municipal\",\"N\",IF($A$2=\"Municiple\",\"Y\",\"error\"))","v":"L201N"},null,null,"Landrate 2",null,84.82,{"$f":"ROUND(J7 * (1 + VAT), 2)","v":96.69},0.33,{"$f":"ROUND(L7 * (1 + VAT), 2)","v":0.38},21.19,{"$f":"ROUND(N7 * (1 + VAT), 2)","v":24.16},34.82,{"$f":"ROUND(P7 * (1 + VAT), 2)","v":39.69},18.809999999999999,{"$f":"ROUND(R7 * (1 + VAT), 2)","v":21.44}]
["Landrate 3","L3",0,1,"L301N",null,null,"Landrate 3",null,84.82,{"$f":"ROUND(J8 * (1 + VAT), 2)","v":96.69},0.33,{"$f":"ROUND(L8 * (1 + VAT), 2)","v":0.38},21.19,{"$f":"ROUND(N8 * (1 + VAT), 2)","v":24.16},55.67,{"$f":"ROUND(P8 * (1 + VAT), 2)","v":63.46},18.809999999999999,{"$f":"ROUND(R8 * (1 + VAT), 2)","v":21.44}]
["Landrate 4","L4",0,1,"L401N",null,null,"Landrate 4",null,183.19,{"$f":"ROUND(J9 * (1 + VAT), 2)","v":208.84},0.33,{"$f":"ROUND(L9 * (1 + VAT), 2)","v":0.38},21.19,{"$f":"ROUND(N9 * (1 + VAT), 2)","v":24.16},18.04,{"$f":"ROUND(P9 * (1 + VAT), 2)","v":20.57},0,{"$f":"ROUND(R9 * (1 + VAT), 2)","v":0}]
["Landlight","Lt",0,1,"Lt01N",null,null,"Landlight",null,313.23,{"$f":"ROUND(J10 * (1 + VAT), 2)","v":357.08}]
["Landrate Dx","Ld",0,1,"Ld01N",null,null,"Landrate Dx",null,null,null,null,null,null,null,null,null,40.346105757692321,{"$f":"ROUND(R11 * (1 + VAT), 2)","v":45.99}]

{"sheet":"Landrate Munic inc","index":25,"n_rows":10,"n_cols":19,"rows_kept":10,"cut":false,"hidden":false,"merged":[[3,9,3,10],[3,11,3,12],[3,13,3,14],[3,15,3,16],[3,17,3,18],[5,7,5,8],[6,7,6,8],[7,7,7,8],[8,7,8,8],[9,7,9,8]]}
[null,null,null,null,null,null,null,"Back to menu"]
["Municiple",null,null,null,null,null,null,"Landrate tariffs",null,null,null,null,null,null,null,null,null,null,"Local authority"]
[]
[null,null,null,null,null,null,null,null,null,"Energy charge [c/kWh]",null,"Ancillary service charge [c/kWh]",null,"Network demand charge [c/kWh]",null,"Network capacity charge [R/POD/day]",null,"Service charge  [R/POD/day]"]
["Tariff","Tariff nameBillcode","Tx zone","Voltage","Billcode",null,null,null,null,null,"VAT incl",null,"VAT incl",null,"VAT incl",null,"VAT incl",null,"VAT incl"]
["Landrate 1","L1",0,1,{"$f":"B6&C6&D6&IF($A$2=\"Non-municipal\",\"N\",IF($A$2=\"Municiple\",\"Y\",\"error\"))","v":"L101Y"},null,null,"Landrate 1",null,88.08,{"$f":"ROUND(J6 * (1 + VAT), 2)","v":100.41},0.33,{"$f":"ROUND(L6 * (1 + VAT), 2)","v":0.38},21.71,{"$f":"ROUND(N6 * (1 + VAT), 2)","v":24.75},23.18,{"$f":"ROUND(P6 * (1 + VAT), 2)","v":26.43},18.989999999999998,{"$f":"ROUND(R6 * (1 + VAT), 2)","v":21.65}]
["Landrate 2","L2",0,1,{"$f":"B7&C7&D7&IF($A$2=\"Non-municipal\",\"N\",IF($A$2=\"Municiple\",\"Y\",\"error\"))","v":"L201Y"},null,null,"Landrate 2",null,88.08,{"$f":"ROUND(J7 * (1 + VAT), 2)","v":100.41},0.33,{"$f":"ROUND(L7 * (1 + VAT), 2)","v":0.38},21.71,{"$f":"ROUND(N7 * (1 + VAT), 2)","v":24.75},35.64,{"$f":"ROUND(P7 * (1 + VAT), 2)","v":40.630000000000003},18.989999999999998,{"$f":"ROUND(R7 * (1 + VAT), 2)","v":21.65}]
["Landrate 3","L3",0,1,"L301Y",null,null,"Landrate 3",null,88.08,{"$f":"ROUND(J8 * (1 + VAT), 2)","v":100.41},0.33,{"$f":"ROUND(L8 * (1 + VAT), 2)","v":0.38},21.71,{"$f":"ROUND(N8 * (1 + VAT), 2)","v":24.75},56.99,{"$f":"ROUND(P8 * (1 + VAT), 2)","v":64.97},18.989999999999998,{"$f":"ROUND(R8 * (1 + VAT), 2)","v":21.65}]
["Landrate 4","L4",0,1,"L401Y",null,null,"Landrate 4",null,190.23,{"$f":"ROUND(J9 * (1 + VAT), 2)","v":216.86},0.33,{"$f":"ROUND(L9 * (1 + VAT), 2)","v":0.38},21.71,{"$f":"ROUND(N9 * (1 + VAT), 2)","v":24.75},18.47,{"$f":"ROUND(P9 * (1 + VAT), 2)","v":21.06}]
["Landrate Dx","Ld",0,1,{"$f":"B10&C10&D10&IF($A$2=\"Non-municipal\",\"N\",IF($A$2=\"Municiple\",\"Y\",\"error\"))","v":"Ld01Y"},null,null,"Landrate Dx",null,null,null,null,null,null,null,null,null,41.080379594104542,{"$f":"ROUND(R10 * (1 + VAT), 2)","v":46.83}]

{"sheet":"Homeflex inc","index":26,"n_rows":14,"n_cols":30,"rows_kept":14,"cut":false,"hidden":false,"merged":[[3,9,3,10],[3,11,3,12],[3,13,3,14],[3,7,3,8],[5,3,6,3],[7,3,8,3],[9,3,10,3],[11,3,12,3],[1,1,1,8],[3,5,3,6]]}
[]
[null,"Homeflex",null,null,null,null,null,null,null,null,null,null,null,null,"Non-local authority",null,null,null,null,null,null,null,null,null,null,null,null,null,{"$f":"SUM(F6,J6:J16,L6:N16)","v":384.5200000000001},"check value"]
[]
[null,null,null,null,null,"Peak energy charge [c/kWh]",null,"Off peak energy charge [c/kWh]",null,"Service & administration charge  [c/kWh]",null,"Network demand charge [c/kWh]",null,"Network capacity charge [R/POD/day]"]
[null,null,null,null,null,null,"VAT incl",null,"VAT incl",null,"VAT incl",null,"VAT incl",null,"VAT incl"]
[null,null,null,"Homeflex 1","High Demand",262.52,{"$f":"ROUND(F6 * (1 + VAT), 2)","v":299.27},85.87,{"$f":"ROUND(H6 * (1 + VAT), 2)","v":97.89},4.37,4.9800000000000004,0,0,5.43,6.19]
[null,null,null,null,"Low Demand",101.74,{"$f":"ROUND(F7 * (1 + VAT), 2)","v":115.98},69.34,79.05,4.37,4.9800000000000004,0,0,5.43,6.19]
[null,null,null,"Homeflex 2","High Demand",262.52,299.27,85.87,97.89,4.37,4.9800000000000004,0,0,11.72,13.36]
[null,null,null,null,"Low Demand",101.74,115.98,69.34,79.05,4.37,4.9800000000000004,0,0,11.72,13.36]
[null,null,null,"Homeflex 3","High Demand",262.52,299.27,85.87,97.89,4.37,4.9800000000000004,0,0,23.6,26.9]
[null,null,null,null,"Low Demand",101.74,115.98,69.34,79.05,4.37,4.9800000000000004,0,0,23.6,26.9]
[null,null,null,"Homeflex 4","High Demand",262.52,299.27,85.87,97.89,4.37,4.9800000000000004,0,0,2.77,3.16]
[null,null,null,null,"Low Demand",101.74,115.98,69.34,79.05,4.37,4.9800000000000004,0,0,2.77,3.16]
[null,null,null,null,null,"The Network capacity charge is a R/kVA charge and is based on the Notified Maximum Demand (NMD)."]

{"sheet":"TOuS Original","index":27,"n_rows":109,"n_cols":14,"rows_kept":109,"cut":false,"hidden":true,"merged":[[103,12,103,13],[89,1,89,2],[90,1,90,2],[91,1,91,2],[93,1,93,3],[93,5,93,7],[103,10,104,11],[88,1,88,2],[73,3,74,4],[73,5,74,6],[73,7,74,8],[75,1,75,2],[76,1,79,2],[82,1,82,6],[83,1,85,2],[83,3,84,4],[83,5,84,6],[86,1,86,2],[87,1,87,2],[72,1,72,8],[56,3,57,4],[56,5,57,6],[58,1,58,2],[59,1,59,2],[60,1,60,2],[63,1,63,4],[64,3,65,4],[66,1,66,2],[67,1,67,2],[68,1,68,2],[69,1,69,2],[55,1,55,6],[35,1,42,1],[41,2,42,2],[45,1,45,8],[46,3,47,4],[46,5,47,6],[46,7,47,8],[48,1,48,2],[49,1,49,2],[50,1,50,2],[51,1,51,2],[52,1,52,2],[3,1,4,2],[3,3,3,4],[11,1,12,2],[11,3,11,4],[19,1,30,1],[28,2,30,2]]}
[]
[]
[]
[null,"Reliability service charge urban",null,"Charge\n[c/kWh]"]
[null,null,null,null,"VAT incl"]
[null,"< 500V",null,0.27,{"$f":"ROUND(D6 * (1 + VAT), 2)","v":0.31}]
[null,"≥ 500V & < 66kV",null,0.26,{"$f":"ROUND(D7 * (1 + VAT), 2)","v":0.3}]
[null,"≥ 66kV & ≤ 132kV",null,0.25,{"$f":"ROUND(D8 * (1 + VAT), 2)","v":0.28999999999999998}]
[null,"> 132kV",null,0.23,{"$f":"ROUND(D9 * (1 + VAT), 2)","v":0.26}]
[]
[]
[null,"Reliability service charge rural",null,"Charge                                           [c/kWh]"]
[null,null,null,null,"VAT incl"]
[null,"< 500V",null,0.27,{"$f":"ROUND(D14 * (1 + VAT), 2)","v":0.31}]
[null,"≥ 500V & ≤ 22kV",null,0.27,{"$f":"ROUND(D15 * (1 + VAT), 2)","v":0.31}]
[]
[]
[null,null,"Transmission zone","Voltage","R/kVA"]
[null,null,null,null,null,"VAT incl"]
[null,"ETUoS\nurban","≤ 300km","< 500V",11.364385961984476,{"$f":"ROUND(E20 * (1 + VAT), 2)","v":12.96}]
[null,null,null,"≥ 500V & < 66kV",11.194005362854275,12.76]
[null,null,null,"≥ 66kV & ≤ 132kV",10.836206104680851,12.35]
[null,null,"> 300km & ≤ 600km","< 500V",11.466614321462599,13.07]
[null,null,null,"≥ 500V & < 66kV",11.313271782245415,12.9]
[null,null,null,"≥ 66kV & ≤ 132kV",10.955472524071991,12.49]
[null,null,"> 600km & ≤ 900km","< 500V",11.585880740853739,13.21]
[null,null,null,"≥ 500V & < 66kV",11.432538201636557,13.03]
[null,null,null,"≥ 66kV & ≤ 132kV",11.057700883550114,12.61]
[null,null,"> 900km","< 500V",11.705147160244881,13.34]
[null,null,null,"≥ 500V & < 66kV",11.551804621027699,13.17]
[null,null,null,"≥ 66kV & ≤ 132kV",11.176967302941254,12.74]
[]
[]
[null,null,"Transmission zone","Voltage","R/kVA"]
[null,null,null,null,null,"VAT incl"]
[null,"ETUoS\nrural","≤ 300km","< 500V",11.773299399896962,{"$f":"ROUND(E36 * (1 + VAT), 2)","v":13.42}]
[null,null,null,"≥ 500V & < 66kV",11.671071040418839,13.31]
[null,null,"> 300km & ≤ 600km","< 500V",11.892565819288103,13.56]
[null,null,null,"≥ 500V & < 66kV",11.790337459809981,13.44]
[null,null,"> 600km & ≤ 900km","< 500V",12.011832238679244,13.69]
[null,null,null,"≥ 500V & < 66kV",11.909603879201123,13.58]
[null,null,"> 900km","< 500V",12.131098658070385,13.83]
[null,null,null,"≥ 500V & < 66kV",12.028870298592263,13.71]
[]
[]
[null,"Distribution network charges urban"]
[null,null,null,"Network access charge    [R/kVA/m]",null,"Network demand charge [R/kVA/m]",null,"Urban low voltage subsidy charge [R/kVA/m]"]
[]
[null,"Voltage ",null,null,"VAT incl",null,"VAT incl",null,"VAT incl"]
[null,"< 500V",null,{"$f":"#REF!","v":{"$error":"#REF!"}},{"$f":"ROUND(D50 * (1 + VAT), 2)","v":{"$error":"#REF!"}},{"$f":"#REF!","v":{"$error":"#REF!"}},{"$f":"ROUND(F50 * (1 + VAT), 2)","v":{"$error":"#REF!"}},{"$f":"#REF!","v":{"$error":"#REF!"}},{"$f":"ROUND(H50 * (1 + VAT), 2)","v":{"$error":"#REF!"}}]
[null,"≥ 500V & < 66kV",null,{"$f":"#REF!","v":{"$error":"#REF!"}},{"$f":"ROUND(D51 * (1 + VAT), 2)","v":{"$error":"#REF!"}},{"$f":"#REF!","v":{"$error":"#REF!"}},{"$f":"ROUND(F51 * (1 + VAT), 2)","v":{"$error":"#REF!"}},{"$f":"#REF!","v":{"$error":"#REF!"}},{"$f":"ROUND(H51 * (1 + VAT), 2)","v":{"$error":"#REF!"}}]
[null,"≥ 66kV & ≤ 132kV",null,{"$f":"#REF!","v":{"$error":"#REF!"}},{"$f":"ROUND(D52 * (1 + VAT), 2)","v":{"$error":"#REF!"}},{"$f":"#REF!","v":{"$error":"#REF!"}},{"$f":"ROUND(F52 * (1 + VAT), 2)","v":{"$error":"#REF!"}},{"$f":"#REF!","v":{"$error":"#REF!"}},{"$f":"ROUND(H52 * (1 + VAT), 2)","v":{"$error":"#REF!"}}]
[null,"> 132kV",null,{"$f":"#REF!","v":{"$error":"#REF!"}},{"$f":"ROUND(D53 * (1 + VAT), 2)","v":{"$error":"#REF!"}},{"$f":"#REF!","v":{"$error":"#REF!"}},{"$f":"ROUND(F53 * (1 + VAT), 2)","v":{"$error":"#REF!"}},{"$f":"#REF!","v":{"$error":"#REF!"}},{"$f":"ROUND(H53 * (1 + VAT), 2)","v":{"$error":"#REF!"}}]
[]
[]
[null,"Distribution network charges rural"]
[null,null,null,"Network access charge [R/kVA/m]",null,"Network demand charge [c/kWh]"]
[]
[null,"Voltage",null,null,"VAT incl",null,"VAT incl"]
[null,"< 500V",null,6.2016647953894406,{"$f":"ROUND(D60 * (1 + VAT), 2)","v":7.07},19.673247251813724,{"$f":"ROUND(F60 * (1 + VAT), 2)","v":22.43}]
[null,"≥ 500V & ≤ 22kV",null,2.2975559127207621,{"$f":"ROUND(D61 * (1 + VAT), 2)","v":2.62},17.238867254434076,{"$f":"ROUND(F61 * (1 + VAT), 2)","v":19.649999999999999}]
[]
[]
[null,"Distribution network charges for Generators"]
[null,null,null,"Network access charge    [R/MW/m]"]
[]
[null,"Voltage ",null,null,"VAT incl"]
[null,"< 500V"]
[null,"≥ 500V & < 66kV"]
[null,"≥ 66kV & ≤ 132kV",null,9.4,{"$f":"ROUND(D70 * (1 + VAT), 2)","v":10.72}]
[]
[]
[null,"Electrification and rural network subsidy charge [c/kWh]"]
[null,null,null,"Rural network subsidy charge            [c/kWh]",null,"Electrification networks subsidy charge  [c/kWh]",null,"Total electrification and rural network subsidy charge [c/kWh]"]
[]
[null,"Tariff",null,null,"VAT incl",null,"VAT incl",null,"VAT incl"]
[null,"Megaflex, Miniflex, Nightsave Urban Large, Nightsave Urban Small, Businessrate \n"]
[null,null,null,2.68,{"$f":"ROUND(D78 * (1 + VAT), 2)","v":3.06},0.91,{"$f":"ROUND(F78 * (1 + VAT), 2)","v":1.04},3.59,{"$f":" ROUND(H78 * (1 + VAT), 2)","v":4.09}]
[]
[]
[]
[]
[null,"Service and admin charges"]
[null,"Customer categories",null,"Service charge  [R/account/day]",null,"Administration charge  [R/POD/day]"]
[]
[null,null,null,null,"VAT incl",null,"VAT incl"]
[null,"≤ 100 kVA",null,9.49,{"$f":"ROUND(D87 * (1 + VAT), 2)","v":10.82},2.08,{"$f":"ROUND(F87 * (1 + VAT), 2)","v":2.37}]
[null,"> 100 kVA & ≤ 500 kVA",null,43.38,{"$f":"ROUND(D88 * (1 + VAT), 2)","v":49.45},12.16,{"$f":"ROUND(F88 * (1 + VAT), 2)","v":13.86}]
[null,"> 500 kVA & ≤ 1 MVA",null,133.5,{"$f":"ROUND(D89 * (1 + VAT), 2)","v":152.19},24.17,{"$f":"ROUND(F89 * (1 + VAT), 2)","v":27.55}]
[null,"> 1 MVA",null,133.5,{"$f":"ROUND(D90 * (1 + VAT), 2)","v":152.19},60.17,{"$f":"ROUND(F90 * (1 + VAT), 2)","v":68.59}]
[null,"Key customers",null,2616.06,{"$f":"ROUND(D91 * (1 + VAT), 2)","v":2982.31},83.55,{"$f":"ROUND(F91 * (1 + VAT), 2)","v":95.25}]
[]
[]
[null,"Distribution loss factors",null,null,null,"Transmission loss factors for loads"]
[null,"Voltage","Urban\nloss factor","Rural\nloss factor",null,"Distance from\nJohannesburg","Zone","Loss\nfactor"]
[null,"< 500V",{"$f":"'Loss Factors'!O6","v":1.1111},{"$f":"'Loss Factors'!P6","v":1.1527000000000001},null,"0 to 300 km",0,{"$f":"'Loss Factors'!T6","v":1.0106999999999999}]
[null,"≥ 500V & < 66kV",{"$f":"'Loss Factors'!O7","v":1.0956999999999999},{"$f":"'Loss Factors'!P7","v":1.1412},null,"301 to 600 km",1,{"$f":"'Loss Factors'!T7","v":1.0207999999999999}]
[null,"≥ 66kV & ≤ 132kV",{"$f":"'Loss Factors'!O8","v":1.0610999999999999},null,null,"601 to 900 km",2,{"$f":"'Loss Factors'!T8","v":1.0309999999999999}]
[null,"> 132kV",{"$f":"'Loss Factors'!O9","v":1},null,null,"> 900 km",3,{"$f":"'Loss Factors'!T9","v":1.0412999999999999}]
[]
[]
[]
[]
[null,null,null,null,null,null,null,null,null,null,"TUoS  [ > 132kV]",null,"Charge\nR/kVA"]
[null,null,null,null,null,null,null,null,null,null,null,null,null,"VAT incl"]
[null,null,null,null,null,null,null,null,null,null,null,"≤ 300km",{"$f":"#REF!","v":{"$error":"#REF!"}},{"$f":"ROUND(M106 * (1 + VAT), 2)","v":{"$error":"#REF!"}}]
[null,null,null,null,null,null,null,null,null,null,null,"> 300km & ≤ 600km",{"$f":"#REF!","v":{"$error":"#REF!"}},{"$f":"ROUND(M107 * (1 + VAT), 2)","v":{"$error":"#REF!"}}]
[null,null,null,null,null,null,null,null,null,null,null,"> 600km & ≤ 900km",{"$f":"#REF!","v":{"$error":"#REF!"}},{"$f":"ROUND(M108 * (1 + VAT), 2)","v":{"$error":"#REF!"}}]
[null,null,null,null,null,null,null,null,null,null,null,"> 900km",{"$f":"#REF!","v":{"$error":"#REF!"}},{"$f":"ROUND(M109 * (1 + VAT), 2)","v":{"$error":"#REF!"}}]

{"sheet":"TOuS","index":28,"n_rows":68,"n_cols":13,"rows_kept":68,"cut":false,"hidden":false,"merged":[[2,7,2,13],[53,7,54,8],[53,9,53,10],[66,7,66,8],[15,9,17,10],[15,11,17,12],[45,9,45,10],[45,7,46,8],[5,7,5,10],[27,7,27,9],[24,7,24,8],[25,7,25,8],[22,7,22,8],[6,9,7,10],[8,7,8,8],[9,7,11,8],[14,7,14,12],[15,7,17,8],[18,7,18,8],[19,7,19,8],[20,7,20,8],[21,7,21,8],[23,7,23,8],[35,7,36,8],[35,9,36,9],[67,7,67,8],[63,9,63,10],[63,7,65,8]]}
[null,null,null,null,null,null,null,"Back to menu"]
["Non-municipal"]
[null,null,null,null,null,null,null," TUoS (Transmission use of system) charges\n(> 132 KV or direct Transmission connected) network charge for loads"]
[]
[]
[null,null,null,null,null,null,null,"Electrification and rural network subsidy charge\n [c/kWh]"]
[null,null,null,null,null,null,null,null,null,"Electrification and rural network subsidy charge [c/kWh]"]
[]
["Tariff","Tariff nameBillcode","Tx zone","Voltage","Billcode",null,null,"Tariff",null,null,"VAT incl"]
[null,null,null,null,null,null,null,"Megaflex, Miniflex, Nightsave Urban Large, Nightsave Urban Small, Businessrate \n"]
["Megaflex","Me",0,1,{"$f":"B11&C11&D11&IF($A$2=\"Non-municipal\",\"N\",IF($A$2=\"Municiple\",\"Y\",\"error\"))","v":"Me01N"},null,null,null,null,{"$f":"'Megaflex inc'!H46","v":6.33},7.17]
[]
[]
[]
[null,null,null,null,null,null,null,"Service and admin charges"]
[null,null,null,null,null,null,null,"Utilised capacity/maximum export capacity",null,"Service charge\n[R/account/day]",null,"Administration charge\n[R/POD/day]"]
[]
[]
[null,null,null,null,null,null,null,"[kVA/MVA = loads]"]
["Tariff","Tariff nameBillcode","Tx zone","Voltage","Billcode",null,null,"[kW/MW = generators]",null,null,"VAT incl",null,"VAT incl"]
["Miniflex","Mi",0,1,{"$f":"B21&C21&D21&IF($B$28=\"Non-municipal\",\"N\",IF($B$28=\"Municiple\",\"Y\",\"error\"))","v":"Mi01N"},null,null,"≤ 100 kVA/kW",null,11.55,13.09,2.54,2.87]
["Miniflex","Mi",0,1,{"$f":"B22&C22&D22&IF($B$28=\"Non-municipal\",\"N\",IF($B$28=\"Municiple\",\"Y\",\"error\"))","v":"Mi01N"},null,null,"> 100 kVA/kW & ≤ 500 kVA/kW",null,52.8,59.82,14.8,16.77]
["Miniflex","Mi",0,1,"Mi01N",null,null,"> 500 kVA/kW & ≤ 1 MVA/MW",null,162.47999999999999,184.09,29.41,33.32]
["Miniflex","Mi",0,1,"Mi01N",null,null,"> 1 MVA/MW",null,162.47999999999999,184.09,73.23,82.97]
["Miniflex","Mi",0,1,"Mi01N",null,null,"Key customers or Transmission connected generators",null,3183.88,3607.39,101.68,115.21]
[]
[]
[null,"Non-municipal",null,null,null,null,null,"Transmission loss factors for loads"]
["Tariff","Tariff nameBillcode","Tx zone","Voltage","Billcode",null,null,"Distance from\nJohannesburg","Zone","Loss\nfactor"]
["Transmission loss factor","TxLoss",0,4,{"$f":"B30&C30&D30&IF($B$28=\"Non-municipal\",\"N\",IF($B$28=\"Municiple\",\"Y\",\"error\"))","v":"TxLoss04N"},null,null,"≤ 300km",0,1.0106999999999999]
["Transmission loss factor","TxLoss",1,4,{"$f":"B31&C31&D31&IF($B$28=\"Non-municipal\",\"N\",IF($B$28=\"Municiple\",\"Y\",\"error\"))","v":"TxLoss14N"},null,null,"> 300km & ≤ 600km",1,1.0207999999999999]
["Transmission loss factor","TxLoss",2,4,{"$f":"B32&C32&D32&IF($B$28=\"Non-municipal\",\"N\",IF($B$28=\"Municiple\",\"Y\",\"error\"))","v":"TxLoss24N"},null,null,"> 600km & ≤ 900km",2,1.0309999999999999]
["Transmission loss factor","TxLoss",3,4,{"$f":"B33&C33&D33&IF($B$28=\"Non-municipal\",\"N\",IF($B$28=\"Municiple\",\"Y\",\"error\"))","v":"TxLoss34N"},null,null,"> 900km",3,1.0412999999999999]
[]
[]
[null,null,null,null,null,null,null,"Loss factors for Transmission connected generators",null,"Loss factor"]
["Tariff","Tariff nameBillcode","Tx zone","Voltage","Billcode"]
["TUoS network charges for Transmission connected generators","GenTUOS","Cape",4,{"$f":"B38&C38&D38&IF($A$2=\"Non-municipal\",\"N\",IF($A$2=\"Municiple\",\"Y\",\"error\"))","v":"GenTUOSCape4N"},null,null,null,"Cape",{"$f":"'Loss Factors'!P14","v":0.97099999999999997}]
["TUoS network charges for Transmission connected generators","GenTUOS","Karoo",4,"GenTUOSKaroo4N",null,null,null,"Karoo",{"$f":"'Loss Factors'!P15","v":0.995}]
["TUoS network charges for Transmission connected generators","GenTUOS","Kwazulu-Natal",4,"GenTUOSKwazulu-Natal4N",null,null,null,"Kwazulu-Natal",{"$f":"'Loss Factors'!P16","v":1.004}]
["TUoS network charges for Transmission connected generators","GenTUOS","Vaal",4,"GenTUOSVaal4N",null,null,null,"Vaal",{"$f":"'Loss Factors'!P17","v":1.02}]
["TUoS network charges for Transmission connected generators","GenTUOS","Waterburg",4,"GenTUOSWaterburg4N",null,null,null,"Waterberg",{"$f":"'Loss Factors'!P18","v":1.0229999999999999}]
["TUoS network charges for Transmission connected generators","GenTUOS","Mpumalanga",4,"GenTUOSMpumalanga4N",null,null,null,"Mpumalanga",{"$f":"'Loss Factors'!P19","v":1.0209999999999999}]
[]
[]
[null,null,null,null,null,null,null,"TUoS  [ > 132kV]",null,"Network capacity charge\n[R/kVA]"]
["Tariff","Tariff nameBillcode","Tx zone","Voltage","Billcode",null,null,null,null,null,"VAT incl"]
["WEPS","We",0,1,{"$f":"B48&C48&D48&IF($A$2=\"Non-municipal\",\"N\",IF($A$2=\"Municiple\",\"Y\",\"error\"))","v":"We01N"},null,null,null,"≤ 300km",{"$f":"'WEPS inc'!V11","v":8.01},9.07]
["WEPS","We",0,2,"We02N",null,null,null,"> 300km & ≤ 600km",{"$f":"'WEPS inc'!V15","v":8.09},9.17]
["WEPS","We",0,3,"We03N",null,null,null,"> 600km & ≤ 900km",{"$f":"'WEPS inc'!V19","v":8.1999999999999993},9.2899999999999991]
["WEPS","We",0,4,"We04N",null,null,null,"> 900km",{"$f":"'WEPS inc'!V23","v":8.26},9.36]
[]
[]
[null,null,null,null,null,null,null,"TUoS network charges for Transmission connected generators",null,"Network charge\n[R/kW]"]
["Tariff","Tariff nameBillcode","Tx zone","Voltage","Billcode",null,null,null,null,null,"VAT incl"]
["TUoS network charges for Transmission connected generators","GenTUOS","Cape",4,{"$f":"B56&C56&D56&IF($A$2=\"Non-municipal\",\"N\",IF($A$2=\"Municiple\",\"Y\",\"error\"))","v":"GenTUOSCape4N"},null,null,null,"Cape",0,0]
["TUoS network charges for Transmission connected generators","GenTUOS","Karoo",4,"GenTUOSKaroo4N",null,null,null,"Karoo",0,0]
["TUoS network charges for Transmission connected generators","GenTUOS","Kwazulu-Natal",4,"GenTUOSKwazulu-Natal4N",null,null,null,"Kwazulu-Natal",1.68,1.9]
["TUoS network charges for Transmission connected generators","GenTUOS","Vaal",4,"GenTUOSVaal4N",null,null,null,"Vaal",5.6,6.35]
["TUoS network charges for Transmission connected generators","GenTUOS","Waterburg",4,"GenTUOSWaterburg4N",null,null,null,"Waterberg",7.18,8.1300000000000008]
["TUoS network charges for Transmission connected generators","GenTUOS","Mpumalanga",4,"GenTUOSMpumalanga4N",null,null,null,"Mpumalanga",6.65,7.54]
[]
[]
[null,null,null,null,null,null,null,"Transmission connected ancillary service charge",null,"Ancillary service charge\n[c/kWh]"]
[]
["Tariff","Tariff nameBillcode","Tx zone","Voltage","Billcode",null,null,null,null,null,"VAT incl"]
["TUoS network charges for Transmission connected generators","GenTUOS","Cape",4,{"$f":"B67&C67&D67&IF($A$2=\"Non-municipal\",\"N\",IF($A$2=\"Municiple\",\"Y\",\"error\"))","v":"GenTUOSCape4N"},null,null,"Generators",null,0.28000000000000003,0.32]
["TUoS network charges for Transmission connected generators","GenTUOS","Cape",4,{"$f":"B68&C68&D68&IF($A$2=\"Non-municipal\",\"N\",IF($A$2=\"Municiple\",\"Y\",\"error\"))","v":"GenTUOSCape4N"},null,null,"Loads",null,0.28000000000000003,0.32]

{"sheet":"DUoS","index":29,"n_rows":125,"n_cols":21,"rows_kept":125,"cut":false,"hidden":false,"merged":[[99,11,101,12],[102,7,102,8],[108,7,108,8],[103,7,103,8],[104,7,104,8],[105,7,105,8],[106,7,106,8],[107,7,107,8],[66,7,66,10],[69,7,69,8],[70,7,70,8],[71,7,71,8],[72,7,72,8],[67,9,68,10],[49,9,50,10],[61,7,61,8],[59,11,60,12],[58,7,58,12],[59,9,60,10],[49,11,50,12],[51,7,51,8],[22,7,33,7],[62,7,62,8],[63,7,63,8],[55,7,55,8],[54,7,54,8],[110,7,110,9],[110,11,110,13],[76,13,77,14],[79,17,82,18],[76,19,77,20],[79,7,82,8],[96,7,96,8],[86,7,88,8],[92,7,92,8],[93,7,93,8],[85,7,85,12],[78,7,78,8],[90,7,90,8],[98,7,98,12],[99,7,101,8],[99,9,101,10],[94,7,94,8],[95,7,95,8],[91,7,91,8],[89,7,89,8],[76,11,77,12],[76,9,77,10],[76,17,78,18],[74,17,75,20],[74,7,75,14],[3,7,3,13],[86,9,88,10],[86,11,88,12],[48,7,48,14],[38,7,45,7],[44,8,45,8],[52,7,52,8],[53,7,53,8],[49,13,50,14],[6,9,6,10],[6,7,7,8],[14,7,15,8],[14,9,14,10]]}
[]
["Non-Municipal",null,null,null,null,null,null,"Back to menu"]
[]
[null,null,null,null,null,null,null,"DUoS (Distribution use of system) charges"]
[]
[]
[null,null,null,null,null,null,null,"Ancillary service charge Urbanp",null,"Charge\n[c/kWh]"]
["Tariff","Tariff nameBillcode","Tx zone","Voltage","Billcode",null,null,null,null,null,"VAT incl"]
["Gen-DUoS urban","NEGenDUoSU",0,1,{"$f":"B9&C9&D9&IF($A$2=\"Non-municipal\",\"N\",IF($A$2=\"Municiple\",\"Y\",\"error\"))","v":"NEGenDUoSU01N"},null,null,"< 500V",null,0.33,{"$f":"ROUND(J9 * (1 + VAT), 2)","v":0.38}]
["Gen-DUoS urban","NEGenDUoSU",0,2,{"$f":"B10&C10&D10&IF($A$2=\"Non-municipal\",\"N\",IF($A$2=\"Municiple\",\"Y\",\"error\"))","v":"NEGenDUoSU02N"},null,null,"≥ 500V & < 66kV",null,0.32,{"$f":"ROUND(J10 * (1 + VAT), 2)","v":0.36}]
["Gen-DUoS urban","NEGenDUoSU",0,3,"NEGenDUoSU03N",null,null,"≥ 66kV & ≤ 132kV",null,0.3,{"$f":"ROUND(J11 * (1 + VAT), 2)","v":0.34}]
[]
[]
[]
[null,null,null,null,null,null,null,"Ancillary service charge Ruralp",null,"Charge                                           [c/kWh]"]
["Tariff","Tariff nameBillcode","Tx zone","Voltage","Billcode",null,null,null,null,null,"VAT incl"]
["Gen-DUoS rural","NEGenDUoSR",0,1,{"$f":"B17&C17&D17&IF($A$2=\"Non-municipal\",\"N\",IF($A$2=\"Municiple\",\"Y\",\"error\"))","v":"NEGenDUoSR01N"},null,null,"< 500V",null,0.33,{"$f":"ROUND(J17 * (1 + VAT), 2)","v":0.38}]
["Gen-DUoS rural","NEGenDUoSR",0,2,{"$f":"B18&C18&D18&IF($A$2=\"Non-municipal\",\"N\",IF($A$2=\"Municiple\",\"Y\",\"error\"))","v":"NEGenDUoSR02N"},null,null,"≥ 500V & ≤ 22kV",null,0.33,{"$f":"ROUND(J18 * (1 + VAT), 2)","v":0.38}]
[]
[]
[null,null,null,null,null,null,null,null,"Transmission zone","Voltage","[R/kVA]"]
["Tariff","Tariff nameBillcode","Tx zone","Voltage","Billcode",null,null,null,null,null,null,"VAT incl"]
[null,null,null,null,null,null,null,"ETUoS\nUrbanp","≤ 300km","< 500V",{"$f":"'Megaflex inc'!V8","v":7.12},{"$f":"ROUND(K23 * (1 + VAT), 2)","v":8.1199999999999992}]
[null,null,null,null,null,null,null,null,null,"≥ 500V & < 66kV",{"$f":"'Megaflex inc'!V9","v":6.51},7.42]
[null,null,null,null,null,null,null,null,null,"≥ 66kV & ≤ 132kV",{"$f":"'Megaflex inc'!V10","v":6.34},7.23]
[null,null,null,null,null,null,null,null,"> 300km & ≤ 600km","< 500V",{"$f":"'Megaflex inc'!V12","v":7.18},8.19]
[null,null,null,null,null,null,null,null,null,"≥ 500V & < 66kV",{"$f":"'Megaflex inc'!V13","v":6.57},7.49]
[null,null,null,null,null,null,null,null,null,"≥ 66kV & ≤ 132kV",{"$f":"'Megaflex inc'!V14","v":6.39},7.28]
[null,null,null,null,null,null,null,null,"> 600km & ≤ 900km","< 500V",{"$f":"'Megaflex inc'!V16","v":7.27},8.2899999999999991]
[null,null,null,null,null,null,null,null,null,"≥ 500V & < 66kV",{"$f":"'Megaflex inc'!V17","v":6.63},7.56]
[null,null,null,null,null,null,null,null,null,"≥ 66kV & ≤ 132kV",{"$f":"'Megaflex inc'!V18","v":6.43},7.33]
[null,null,null,null,null,null,null,null,"> 900km","< 500V",{"$f":"'Megaflex inc'!V20","v":7.29},8.31]
[null,null,null,null,null,null,null,null,null,"≥ 500V & < 66kV",{"$f":"'Megaflex inc'!V21","v":6.71},7.65]
[null,null,null,null,null,null,null,null,null,"≥ 66kV & ≤ 132kV",{"$f":"'Megaflex inc'!V22","v":6.48},7.39]
[]
[]
[null,null,null,null,null,null,null,null,"Transmission zone","Voltage","[R/kVA]"]
["Tariff","Tariff nameBillcode","Tx zone","Voltage","Billcode",null,null,null,null,null,null,"VAT incl"]
[null,null,null,null,null,null,null,"ETUoS\nRural p","≤ 300km","< 500V",{"$f":"'Ruraflex inc'!V8","v":14.88},{"$f":"ROUND(K39 * (1 + VAT), 2)","v":16.96}]
[null,null,null,null,null,null,null,null,null,"≥ 500V & < 66kV",{"$f":"'Ruraflex inc'!V9","v":13.64},15.55]
[null,null,null,null,null,null,null,null,"> 300km & ≤ 600km","< 500V",{"$f":"'Ruraflex inc'!V12","v":14.93},17.02]
[null,null,null,null,null,null,null,null,null,"≥ 500V & < 66kV",{"$f":"'Ruraflex inc'!V13","v":13.73},15.65]
[null,null,null,null,null,null,null,null,"> 600km & ≤ 900km","< 500V",{"$f":"'Ruraflex inc'!V16","v":15.01},17.11]
[null,null,null,null,null,null,null,null,null,"≥ 500V & < 66kV",{"$f":"'Ruraflex inc'!V17","v":13.78},15.71]
[null,null,null,null,null,null,null,null,"> 900km","< 500V",{"$f":"'Ruraflex inc'!V20","v":15.07},17.18]
[null,null,null,null,null,null,null,null,null,"≥ 500V & < 66kV",{"$f":"'Ruraflex inc'!V21","v":13.79},15.72]
[]
[]
[null,null,null,null,null,null,null,"Distribution network charges urbanp"]
[null,null,null,null,null,null,null,null,null,"Network capacity charge                          [R/kVA/m]",null,"Network demand charge \n[R/kVA/m]",null,"Urban low voltage subsidy charge [R/kVA/m]"]
[]
["Tariff","Tariff nameBillcode","Tx zone","Voltage","Billcode",null,null,"Voltage ",null,null,"VAT incl",null,"VAT incl",null,"VAT incl"]
["Gen-DUoS urban","NEGenDUoSU",0,1,{"$f":"B53&C53&D53&IF($A$2=\"Non-municipal\",\"N\",IF($A$2=\"Municiple\",\"Y\",\"error\"))","v":"NEGenDUoSU01N"},null,null,"< 500V",null,{"$f":"'Megaflex inc'!J30","v":14.15},{"$f":"ROUND(J53 * (1 + VAT), 2)","v":16.13},{"$f":"'Megaflex inc'!L30","v":26.83},{"$f":"ROUND(L53 * (1 + VAT), 2)","v":30.59},{"$f":"'Megaflex inc'!N30","v":0},{"$f":"ROUND(N53 * (1 + VAT), 2)","v":0}]
["Gen-DUoS urban","NEGenDUoSU",0,2,{"$f":"B54&C54&D54&IF($A$2=\"Non-municipal\",\"N\",IF($A$2=\"Municiple\",\"Y\",\"error\"))","v":"NEGenDUoSU02N"},null,null,"≥ 500V & < 66kV",null,{"$f":"'Megaflex inc'!J31","v":12.98},{"$f":"ROUND(J54 * (1 + VAT), 2)","v":14.8},{"$f":"'Megaflex inc'!L31","v":24.62},{"$f":"ROUND(L54 * (1 + VAT), 2)","v":28.07},{"$f":"'Megaflex inc'!N31","v":0},{"$f":"ROUND(N54 * (1 + VAT), 2)","v":0}]
["Gen-DUoS urban","NEGenDUoSU",0,3,"NEGenDUoSU03N",null,null,"≥ 66kV & ≤ 132kV",null,{"$f":"'Megaflex inc'!J32","v":4.63},{"$f":"ROUND(J55 * (1 + VAT), 2)","v":5.28},{"$f":"'Megaflex inc'!L32","v":8.58},{"$f":"ROUND(L55 * (1 + VAT), 2)","v":9.7799999999999994},{"$f":"'Megaflex inc'!N32","v":11.43},{"$f":"ROUND(N55 * (1 + VAT), 2)","v":13.03}]
["Gen-DUoS urban","NEGenDUoSU",0,4,{"$f":"B56&C56&D56&IF($A$2=\"Non-municipal\",\"N\",IF($A$2=\"Municiple\",\"Y\",\"error\"))","v":"NEGenDUoSU04N"},null,null,"> 132kV",null,{"$f":"'Megaflex inc'!J33","v":0},{"$f":"ROUND(J56 * (1 + VAT), 2)","v":0},{"$f":"'Megaflex inc'!L33","v":0},{"$f":"ROUND(L56 * (1 + VAT), 2)","v":0},{"$f":"'Megaflex inc'!N33","v":11.43},{"$f":"ROUND(N56 * (1 + VAT), 2)","v":13.03}]
[]
[]
[null,null,null,null,null,null,null,"Distribution network charges ruralp"]
[null,null,null,null,null,null,null,null,null,"Network capacity charge [R/kVA/m]",null,"Network demand charge [c/kWh]"]
[]
["Tariff","Tariff nameBillcode","Tx zone","Voltage","Billcode",null,null,"Voltage",null,null,"VAT incl",null,"VAT incl"]
["Gen-DUoS rural","NEGenDUoSR",0,1,{"$f":"B63&C63&D63&IF($A$2=\"Non-municipal\",\"N\",IF($A$2=\"Municiple\",\"Y\",\"error\"))","v":"NEGenDUoSR01N"},null,null,"< 500V",null,{"$f":"'Ruraflex inc'!V8","v":14.88},{"$f":"ROUND(J63 * (1 + VAT), 2)","v":16.96},{"$f":"'Ruraflex inc'!S28","v":21.19},{"$f":"ROUND(L63 * (1 + VAT), 2)","v":24.16}]
["Gen-DUoS rural","NEGenDUoSR",0,2,{"$f":"B64&C64&D64&IF($A$2=\"Non-municipal\",\"N\",IF($A$2=\"Municiple\",\"Y\",\"error\"))","v":"NEGenDUoSR02N"},null,null,"≥ 500V & ≤ 22kV",null,{"$f":"'Ruraflex inc'!V9","v":13.64},{"$f":"ROUND(J64 * (1 + VAT), 2)","v":15.55},{"$f":"'Ruraflex inc'!S29","v":18.57},{"$f":"ROUND(L64 * (1 + VAT), 2)","v":21.17}]
[]
[]
[null,null,null,null,null,null,null,"Distribution network charges for Generators"]
[null,null,null,null,null,null,null,null,null,"Network capacity charge  [R/kW/m]"]
[]
["Tariff","Tariff nameBillcode","Tx zone","Voltage","Billcode",null,null,"Voltage ",null,null,"VAT incl"]
["Gen-DUoS urban","NEGenDUoSU",0,1,{"$f":"B71&C71&D71&IF($A$2=\"Non-municipal\",\"N\",IF($A$2=\"Municiple\",\"Y\",\"error\"))","v":"NEGenDUoSU01N"},null,null,"< 500V"]
["Gen-DUoS urban","NEGenDUoSU",0,2,{"$f":"B72&C72&D72&IF($A$2=\"Non-municipal\",\"N\",IF($A$2=\"Municiple\",\"Y\",\"error\"))","v":"NEGenDUoSU02N"},null,null,"≥ 500V & < 66kV"]
["Gen-DUoS urban","NEGenDUoSU",0,3,"NEGenDUoSU03N",null,null,"≥ 66kV & ≤ 132kV",null,11.44,{"$f":"ROUND(J73 * (1 + VAT), 2)","v":13.04}]
[]
[null,null,null,null,null,null,null,"Electrification and rural network subsidy charge",null,null,null,null,null,null,null,null,null,"Electrification and rural network subsidy charge "]
[]
[null,null,null,null,null,null,null,null,null,"Rural network subsidy charge            [c/kWh]",null,"Electrification networks subsidy charge [c/kWh]",null,"Total electrification and rural network subsidy charge [c/kWh]",null,null,null,"Tariff",null,"Total electrification and rural network subsidy charge [c/kWh]"]
[]
["Tariff","Tariff nameBillcode","Tx zone","Voltage","Billcode",null,null,"Tariff",null,null,"VAT incl",null,"VAT incl",null,"VAT incl",null,null,null,null,null,"VAT incl"]
[null,null,null,null,null,null,null,"Megaflex, Miniflex, Nightsave Urban Large, Nightsave Urban Small, Businessrate \n",null,null,null,null,null,null,null,null,null,"Megaflex, Miniflex, Nightsave Urban Large, Nightsave Urban Small, Businessrate \n"]
["Megaflex","Me",0,1,{"$f":"B81&C81&D81&IF($A$2=\"Non-municipal\",\"N\",IF($A$2=\"Municiple\",\"Y\",\"error\"))","v":"Me01N"},null,null,null,null,4.2,{"$f":"ROUND(J81 * (1 + VAT), 2)","v":4.79},2.13,{"$f":"ROUND(L81 * (1 + VAT), 2)","v":2.4300000000000002},{"$f":"SUM(J81, L81)","v":6.33},{"$f":" ROUND(N81 * (1 + VAT), 2)","v":7.22},null,null,null,null,6.33,{"$f":" ROUND(T81 * (1 + VAT), 2)","v":7.22}]
[0.66370106761565839]
[0.33629893238434161]
[]
[]
[null,null,null,null,null,null,null,"Service and administration charges (urbanp )"]
[null,null,null,null,null,null,null,"Customer categories \nutilised capacity / maximum export capacity",null,"Service charge\n[R/account/day]",null,"Administration charge\n[R/POD/day]"]
[]
[]
[null,null,null,null,null,null,null,"[kVA or MVA = loads]"]
["Tariff","Tariff nameBillcode","Tx zone","Voltage","Billcode",null,null,"[kW or MW = generators]",null,null,"VAT incl",null,"VAT incl"]
["Miniflex","Mi",0,1,{"$f":"B92&C92&D92&IF($A$2=\"Non-municipal\",\"N\",IF($A$2=\"Municiple\",\"Y\",\"error\"))","v":"Mi01N"},null,null,"≤ 100 kVA/kW",null,11.55,{"$f":"ROUND(J92 * (1 + VAT), 2)","v":13.17},2.54,{"$f":"ROUND(L92 * (1 + VAT), 2)","v":2.9}]
["Miniflex","Mi",0,1,{"$f":"B93&C93&D93&IF($A$2=\"Non-municipal\",\"N\",IF($A$2=\"Municiple\",\"Y\",\"error\"))","v":"Mi01N"},null,null,"> 100 kVA/kW & ≤ 500 kVA/kW",null,52.8,{"$f":"ROUND(J93 * (1 + VAT), 2)","v":60.19},14.8,{"$f":"ROUND(L93 * (1 + VAT), 2)","v":16.87}]
["Miniflex","Mi",0,1,"Mi01N",null,null,"> 500 kVA/kW & ≤ 1 MVA/MW",null,162.47999999999999,{"$f":"ROUND(J94 * (1 + VAT), 2)","v":185.23},29.41,{"$f":"ROUND(L94 * (1 + VAT), 2)","v":33.53}]
["Miniflex","Mi",0,1,"Mi01N",null,null,"> 1 MVA/MW",null,162.47999999999999,{"$f":"ROUND(J95 * (1 + VAT), 2)","v":185.23},73.23,{"$f":"ROUND(L95 * (1 + VAT), 2)","v":83.48}]
["Miniflex","Mi",0,1,"Mi01N",null,null,"Key customers or Transmission connected",null,3183.88,{"$f":"ROUND(J96 * (1 + VAT), 2)","v":3629.62},101.68,{"$f":"ROUND(L96 * (1 + VAT), 2)","v":115.92}]
[]
[]
[null,null,null,null,null,null,null,"Service and administration charges (ruralp)"]
[null,null,null,null,null,null,null,"Customer categories \nutilised capacity / maximum export capacity",null,"Service charge\n[R/account/day]",null,"Administration charge\n[R/POD/day]"]
[]
[]
[null,null,null,null,null,null,null,"[kVA or MVA = loads]"]
["Tariff","Tariff nameBillcode","Tx zone","Voltage","Billcode",null,null,"[kW or MW = generators]",null,null,"VAT incl",null,"VAT incl"]
["Ruraflex","Ru",0,1,{"$f":"B105&C105&D105&IF($A$2=\"Non-municipal\",\"N\",IF($A$2=\"Municiple\",\"Y\",\"error\"))","v":"Ru01N"},null,null,"≤ 100 kVA/kW",null,14.64,{"$f":"ROUND(J105 * (1 + VAT), 2)","v":16.690000000000001},4.16,{"$f":"ROUND(L105 * (1 + VAT), 2)","v":4.74}]
["Ruraflex","Ru",0,1,{"$f":"B106&C106&D106&IF($A$2=\"Non-municipal\",\"N\",IF($A$2=\"Municiple\",\"Y\",\"error\"))","v":"Ru01N"},null,null,"> 100 kVA/kW & ≤ 500 kVA/kW",null,49.94,{"$f":"ROUND(J106 * (1 + VAT), 2)","v":56.93},23.15,{"$f":"ROUND(L106 * (1 + VAT), 2)","v":26.39}]
["Ruraflex","Ru",0,1,"Ru01N",null,null,"> 500 kVA/kW & ≤ 1 MVA/MW",null,153.63,{"$f":"ROUND(J107 * (1 + VAT), 2)","v":175.14},35.53,{"$f":"ROUND(L107 * (1 + VAT), 2)","v":40.5}]
["Ruraflex","Ru",0,1,"Ru01N",null,null,"> 1 MVA/MW",null,153.63,{"$f":"ROUND(J108 * (1 + VAT), 2)","v":175.14},65.930000000000007,{"$f":"ROUND(L108 * (1 + VAT), 2)","v":75.16}]
["Ruraflex","Ru",0,1,"Ru01N",null,null,"Key customers",null,3010.96,{"$f":"ROUND(J109 * (1 + VAT), 2)","v":3432.49},65.930000000000007,{"$f":"ROUND(L109 * (1 + VAT), 2)","v":75.16}]
[]
[null,null,null,null,null,null,null,"Distribution loss factors",null,null,null,"Transmission loss factors for loads"]
["Tariff","Tariff nameBillcode","Tx zone","Voltage","Billcode",null,null,"Voltage","Urban\nloss factor","Rural\nloss factor",null,"Distance from\nJohannesburg","Zone","Loss\nfactor"]
["Distribution loss factor - Urban","DxLossUrb",0,1,{"$f":"B113&C113&D113&IF($A$2=\"Non-municipal\",\"N\",IF($A$2=\"Municiple\",\"Y\",\"error\"))","v":"DxLossUrb01N"},null,null,"< 500V",1.1111,1.1527000000000001,null,"≤ 300km",0,1.0106999999999999]
["Distribution loss factor - Urban","DxLossUrb",0,2,{"$f":"B114&C114&D114&IF($A$2=\"Non-municipal\",\"N\",IF($A$2=\"Municiple\",\"Y\",\"error\"))","v":"DxLossUrb02N"},null,null,"≥ 500V & < 66kV",1.0956999999999999,1.1412,null,"> 300km & ≤ 600km",1,1.0207999999999999]
["Distribution loss factor - Urban","DxLossUrb",0,3,"DxLossUrb03N",null,null,"≥ 66kV & ≤ 132kV",1.0610999999999999,null,null,"> 600km & ≤ 900km",2,1.0309999999999999]
["Distribution loss factor - Urban","DxLossUrb",0,4,"DxLossUrb04N",null,null,"> 132kV",1,null,null,"> 900km",3,1.0412999999999999]
[]
["Distribution loss factor - Rural","DxLossRur",0,1,{"$f":"B118&C118&D118&IF($A$2=\"Non-municipal\",\"N\",IF($A$2=\"Municiple\",\"Y\",\"error\"))","v":"DxLossRur01N"}]
["Distribution loss factor - Rural","DxLossRur",0,2,{"$f":"B119&C119&D119&IF($A$2=\"Non-municipal\",\"N\",IF($A$2=\"Municiple\",\"Y\",\"error\"))","v":"DxLossRur02N"}]
[]
[]
["Transmission loss factor","TxLoss",0,4,{"$f":"B122&C122&D122&IF($A$2=\"Non-municipal\",\"N\",IF($A$2=\"Municiple\",\"Y\",\"error\"))","v":"TxLoss04N"}]
["Transmission loss factor","TxLoss",1,4,{"$f":"B123&C123&D123&IF($A$2=\"Non-municipal\",\"N\",IF($A$2=\"Municiple\",\"Y\",\"error\"))","v":"TxLoss14N"}]
["Transmission loss factor","TxLoss",2,4,"TxLoss24N"]
["Transmission loss factor","TxLoss",3,4,"TxLoss34N"]

{"sheet":"Loss Factors","index":30,"n_rows":19,"n_cols":38,"rows_kept":19,"cut":false,"hidden":false,"merged":[[1,13,1,19],[3,13,3,15],[3,17,3,19],[11,13,12,14],[11,15,12,15]]}
[null,null,null,null,null,null,null,null,null,null,null,null,null,"Back to menu",null,null,null,null,null,null,null,null,null,null,null,null,null,null,null,null,null,null,null,null,null,null,null,0.14000000000000001]
[null,null,null,null,null,null,null,null,null,null,null,null,null,"Loss factors"]
["Non-municipal"]
[null,null,null,null,null,null,null,null,null,null,null,null,null,"Distribution loss factors",null,null,null,"Transmission loss factors for loads"]
["Tariff","Tariff nameBillcode","Tx zone","Voltage","Billcode",null,"Tariff","Tariff nameBillcode","Tx zone","Voltage","Billcode",null,null,"Voltage","Urban\nloss factor","Rural\nloss factor",null,"Distance from\nJohannesburg","Zone","Loss\nfactor"]
["Distribution loss factor - Urban","DxLossUrb",0,1,{"$f":"B6&C6&D6&IF($A$3=\"Non-municipal\",\"N\",IF($A$3=\"Municiple\",\"Y\",\"error\"))","v":"DxLossUrb01N"},null,"Transmission loss factor","TxLoss",0,4,{"$f":"H6&I6&J6&IF($A$3=\"Non-municipal\",\"N\",IF($A$3=\"Municiple\",\"Y\",\"error\"))","v":"TxLoss04N"},null,null,"< 500V",1.1111,1.1527000000000001,null,"≤ 300km",0,1.0106999999999999]
["Distribution loss factor - Urban","DxLossUrb",0,2,{"$f":"B7&C7&D7&IF($A$3=\"Non-municipal\",\"N\",IF($A$3=\"Municiple\",\"Y\",\"error\"))","v":"DxLossUrb02N"},null,"Transmission loss factor","TxLoss",1,4,{"$f":"H7&I7&J7&IF($A$3=\"Non-municipal\",\"N\",IF($A$3=\"Municiple\",\"Y\",\"error\"))","v":"TxLoss14N"},null,null,"≥ 500V & < 66kV",1.0956999999999999,1.1412,null,"> 300km & ≤ 600km",1,1.0207999999999999]
["Distribution loss factor - Urban","DxLossUrb",0,3,{"$f":"B8&C8&D8&IF($A$3=\"Non-municipal\",\"N\",IF($A$3=\"Municiple\",\"Y\",\"error\"))","v":"DxLossUrb03N"},null,"Transmission loss factor","TxLoss",2,4,{"$f":"H8&I8&J8&IF($A$3=\"Non-municipal\",\"N\",IF($A$3=\"Municiple\",\"Y\",\"error\"))","v":"TxLoss24N"},null,null,"≥ 66kV & ≤ 132kV",1.0610999999999999,null,null,"> 600km & ≤ 900km",2,1.0309999999999999]
["Distribution loss factor - Urban","DxLossUrb",0,4,{"$f":"B9&C9&D9&IF($A$3=\"Non-municipal\",\"N\",IF($A$3=\"Municiple\",\"Y\",\"error\"))","v":"DxLossUrb04N"},null,"Transmission loss factor","TxLoss",3,4,{"$f":"H9&I9&J9&IF($A$3=\"Non-municipal\",\"N\",IF($A$3=\"Municiple\",\"Y\",\"error\"))","v":"TxLoss34N"},null,null,"> 132kV/Transmission connected",1,null,null,"> 900km",3,1.0412999999999999]
[]
["Distribution loss factor - Rural","DxLossRur",0,1,{"$f":"B11&C11&D11&IF($A$3=\"Non-municipal\",\"N\",IF($A$3=\"Municiple\",\"Y\",\"error\"))","v":"DxLossRur01N"},null,null,null,null,null,null,null,null,null,null,"2012/13"]
["Distribution loss factor - Rural","DxLossRur",0,2,{"$f":"B12&C12&D12&IF($A$3=\"Non-municipal\",\"N\",IF($A$3=\"Municiple\",\"Y\",\"error\"))","v":"DxLossRur02N"},null,null,null,null,null,null,null,null,"Loss factors for Transmission connected generators",null,"Loss factor"]
["Tariff","Tariff nameBillcode","Tx zone","Voltage","Billcode"]
["TUoS network charges for Transmission connected generators","GenTUOS","Cape",4,{"$f":"B14&C14&D14&IF($A$3=\"Non-municipal\",\"N\",IF($A$3=\"Municiple\",\"Y\",\"error\"))","v":"GenTUOSCape4N"},null,null,null,null,null,null,null,null,null,"Cape",0.97099999999999997]
["TUoS network charges for Transmission connected generators","GenTUOS","Karoo",4,"GenTUOSKaroo4N",null,null,null,null,null,null,null,null,null,"Karoo",0.995]
["TUoS network charges for Transmission connected generators","GenTUOS","Kwazulu-Natal",4,"GenTUOSKwazulu-Natal4N",null,null,null,null,null,null,null,null,null,"Kwazulu-Natal",1.004]
["TUoS network charges for Transmission connected generators","GenTUOS","Vaal",4,"GenTUOSVaal4N",null,null,null,null,null,null,null,null,null,"Vaal",1.02]
["TUoS network charges for Transmission connected generators","GenTUOS","Waterburg",4,"GenTUOSWaterburg4N",null,null,null,null,null,null,null,null,null,"Waterburg",1.0229999999999999]
["TUoS network charges for Transmission connected generators","GenTUOS","Mpumalanga",4,"GenTUOSMpumalanga4N",null,null,null,null,null,null,null,null,null,"Mpumalanga",1.0209999999999999]

{"sheet":"Excess NAC","index":31,"n_rows":47,"n_cols":34,"rows_kept":47,"cut":false,"hidden":false,"merged":[[4,32,5,33],[38,18,41,18],[38,24,41,24],[38,30,41,30],[42,18,45,18],[42,24,45,24],[42,30,45,30],[30,18,33,18],[30,24,33,24],[30,30,33,30],[34,18,37,18],[34,24,37,24],[34,30,37,30],[26,32,26,33],[27,18,29,18],[27,20,28,21],[27,24,29,24],[27,26,28,27],[27,30,29,30],[27,32,28,33],[19,18,22,18],[19,24,22,24],[19,30,22,30],[26,20,26,21],[26,26,26,27],[7,30,10,30],[11,18,14,18],[11,24,14,24],[11,30,14,30],[15,18,18,18],[15,24,18,24],[15,30,18,30],[1,18,1,21],[24,18,24,21],[1,23,1,27],[1,29,1,33],[24,23,24,27],[24,29,24,33],[3,20,3,21],[3,26,3,27],[3,32,3,33],[4,18,6,18],[4,20,5,21],[4,24,6,24],[4,26,5,27],[4,30,6,30],[7,18,10,18],[7,24,10,24]]}
[null,null,null,null,null,null,null,null,null,null,null,null,null,null,null,null,null,null,"Back to menu"]
["Non-municipal",null,null,null,null,null,null,null,null,null,null,null,null,null,null,null,null,null,"Urban - Excess NAC\nMegaflex\n[non local authorities]",null,null,null,null,"Urban - Excess NAC\nNightsave Urban Large\n[non local authorities]",null,null,null,null,null,"Urban - Excess NAC\nMiniflex\n[non local authorities]"]
[]
[null,null,null,null,null,null,null,null,null,null,null,null,null,null,null,null,null,null,null,null,"Excess network charge [R/kVA/m]",null,null,null,null,null,"Excess network charge [R/kVA/m]",null,null,null,null,null,"Excess network charge [R/kVA/m]"]
[null,null,null,null,null,null,null,null,null,null,null,null,null,null,null,null,null,null,"Transmission zone",null,null,null,null,null,"Transmission zone",null,null,null,null,null,"Transmission zone"]
[null,null,null,null,null,null,null,null,null,null,null,null,null,null,null,null,null,null,null,"Voltage",null,null,null,null,null,"Voltage",null,null,null,null,null,"Voltage"]
["Tariff","Tariff nameBillcode","Tx zone","Voltage","Billcode",null,"Tariff","Tariff nameBillcode","Tx zone","Voltage","Billcode",null,"Tariff","Tariff nameBillcode","Tx zone","Voltage","Billcode",null,null,null,null,"VAT incl",null,null,null,null,null,"VAT incl",null,null,null,null,null,"VAT incl"]
["Excess NAC Megaflex","ExNACMe",0,1,{"$f":"B8&C8&D8&IF($A$2=\"Non-municipal\",\"N\",IF($A$2=\"Municiple\",\"Y\",\"error\"))","v":"ExNACMe01N"},null,"Excess NAC Nightsave Large","ExNACNL",0,1,{"$f":"H8&I8&J8&IF($A$2=\"Non-municipal\",\"N\",IF($A$2=\"Municiple\",\"Y\",\"error\"))","v":"ExNACNL01N"},null,"Excess NAC Miniflex","ExNACMi",0,1,{"$f":"N8&O8&P8&IF($A$2=\"Non-municipal\",\"N\",IF($A$2=\"Municiple\",\"Y\",\"error\"))","v":"ExNACMi01N"},null,"≤ 300km","< 500V",21.27,{"$f":"ROUND(U8 * (1 + VAT), 2)","v":24.25},null,null,"≤ 300km","< 500V",21.27,{"$f":"ROUND(AA8 * (1 + VAT), 2)","v":24.25},null,null,"≤ 300km","< 500V",21.25,{"$f":"ROUND(AG8 * (1 + VAT), 2)","v":24.23}]
["Excess NAC Megaflex","ExNACMe",0,2,{"$f":"B9&C9&D9&IF($A$2=\"Non-municipal\",\"N\",IF($A$2=\"Municiple\",\"Y\",\"error\"))","v":"ExNACMe02N"},null,"Excess NAC Nightsave Large","ExNACNL",0,2,{"$f":"H9&I9&J9&IF($A$2=\"Non-municipal\",\"N\",IF($A$2=\"Municiple\",\"Y\",\"error\"))","v":"ExNACNL02N"},null,"Excess NAC Miniflex","ExNACMi",0,2,{"$f":"N9&O9&P9&IF($A$2=\"Non-municipal\",\"N\",IF($A$2=\"Municiple\",\"Y\",\"error\"))","v":"ExNACMi02N"},null,null,"≥ 500V & < 66kV",19.490000000000002,22.22,null,null,null,"≥ 500V & < 66kV",19.490000000000002,22.22,null,null,null,"≥ 500V & < 66kV",19.47,22.2]
["Excess NAC Megaflex","ExNACMe",0,3,"ExNACMe03N",null,"Excess NAC Nightsave Large","ExNACNL",0,3,"ExNACNL03N",null,"Excess NAC Miniflex","ExNACMi",0,3,"ExNACMi03N",null,null,"≥ 66kV & ≤ 132kV",22.4,25.54,null,null,null,"≥ 66kV & ≤ 132kV",22.4,25.54,null,null,null,"≥ 66kV & ≤ 132kV",22.369999999999997,25.5]
["Excess NAC Megaflex","ExNACMe",0,4,"ExNACMe04N",null,"Excess NAC Nightsave Large","ExNACNL",0,4,"ExNACNL04N",null,"Excess NAC Miniflex","ExNACMi",0,4,"ExNACMi04N",null,null,"> 132kV*",19.439999999999998,22.16,null,null,null,"> 132kV*",19.439999999999998,22.16,null,null,null,"> 132kV*",19.399999999999999,22.12]
["Excess NAC Megaflex","ExNACMe",1,1,"ExNACMe11N",null,"Excess NAC Nightsave Large","ExNACNL",1,1,"ExNACNL11N",null,"Excess NAC Miniflex","ExNACMi",1,1,"ExNACMi11N",null,"> 300km and \n≤ 600km","< 500V",21.33,24.32,null,null,"> 300km and \n≤ 600km","< 500V",21.33,24.32,null,null,"> 300km and \n≤ 600km","< 500V",21.3,24.28]
["Excess NAC Megaflex","ExNACMe",1,2,"ExNACMe12N",null,"Excess NAC Nightsave Large","ExNACNL",1,2,"ExNACNL12N",null,"Excess NAC Miniflex","ExNACMi",1,2,"ExNACMi12N",null,null,"≥ 500V & < 66kV",19.55,22.29,null,null,null,"≥ 500V & < 66kV",19.55,22.29,null,null,null,"≥ 500V & < 66kV",19.53,22.26]
["Excess NAC Megaflex","ExNACMe",1,3,"ExNACMe13N",null,"Excess NAC Nightsave Large","ExNACNL",1,3,"ExNACNL13N",null,"Excess NAC Miniflex","ExNACMi",1,3,"ExNACMi13N",null,null,"≥ 66kV & ≤ 132kV",22.45,25.59,null,null,null,"≥ 66kV & ≤ 132kV",22.45,25.59,null,null,null,"≥ 66kV & ≤ 132kV",22.42,25.56]
["Excess NAC Megaflex","ExNACMe",1,4,"ExNACMe14N",null,"Excess NAC Nightsave Large","ExNACNL",1,4,"ExNACNL14N",null,"Excess NAC Miniflex","ExNACMi",1,4,"ExNACMi14N",null,null,"> 132kV*",19.52,22.25,null,null,null,"> 132kV*",19.52,22.25,null,null,null,"> 132kV*",19.490000000000002,22.22]
["Excess NAC Megaflex","ExNACMe",2,1,"ExNACMe21N",null,"Excess NAC Nightsave Large","ExNACNL",2,1,"ExNACNL21N",null,"Excess NAC Miniflex","ExNACMi",2,1,"ExNACMi21N",null,"> 600km and \n≤ 900km","< 500V",21.42,24.42,null,null,"> 600km and \n≤ 900km","< 500V",21.42,24.42,null,null,"> 600km and \n≤ 900km","< 500V",21.4,24.4]
["Excess NAC Megaflex","ExNACMe",2,2,"ExNACMe22N",null,"Excess NAC Nightsave Large","ExNACNL",2,2,"ExNACNL22N",null,"Excess NAC Miniflex","ExNACMi",2,2,"ExNACMi22N",null,null,"≥ 500V & < 66kV",19.61,22.36,null,null,null,"≥ 500V & < 66kV",19.61,22.36,null,null,null,"≥ 500V & < 66kV",19.59,22.33]
["Excess NAC Megaflex","ExNACMe",2,3,"ExNACMe23N",null,"Excess NAC Nightsave Large","ExNACNL",2,3,"ExNACNL23N",null,"Excess NAC Miniflex","ExNACMi",2,3,"ExNACMi23N",null,null,"≥ 66kV & ≤ 132kV",22.49,25.64,null,null,null,"≥ 66kV & ≤ 132kV",22.49,25.64,null,null,null,"≥ 66kV & ≤ 132kV",22.47,25.62]
["Excess NAC Megaflex","ExNACMe",2,4,"ExNACMe24N",null,"Excess NAC Nightsave Large","ExNACNL",2,4,"ExNACNL24N",null,"Excess NAC Miniflex","ExNACMi",2,4,"ExNACMi24N",null,null,"> 132kV*",19.63,22.38,null,null,null,"> 132kV*",19.63,22.38,null,null,null,"> 132kV*",19.600000000000001,22.34]
["Excess NAC Megaflex","ExNACMe",3,1,"ExNACMe31N",null,"Excess NAC Nightsave Large","ExNACNL",3,1,"ExNACNL31N",null,"Excess NAC Miniflex","ExNACMi",3,1,"ExNACMi31N",null,"> 900km","< 500V",21.44,24.44,null,null,"> 900km","< 500V",21.44,24.44,null,null,"> 900km","< 500V",21.42,24.42]
["Excess NAC Megaflex","ExNACMe",3,2,"ExNACMe32N",null,"Excess NAC Nightsave Large","ExNACNL",3,2,"ExNACNL32N",null,"Excess NAC Miniflex","ExNACMi",3,2,"ExNACMi32N",null,null,"≥ 500V & < 66kV",19.690000000000001,22.45,null,null,null,"≥ 500V & < 66kV",19.690000000000001,22.45,null,null,null,"≥ 500V & < 66kV",19.66,22.41]
["Excess NAC Megaflex","ExNACMe",3,3,"ExNACMe33N",null,"Excess NAC Nightsave Large","ExNACNL",3,3,"ExNACNL33N",null,"Excess NAC Miniflex","ExNACMi",3,3,"ExNACMi33N",null,null,"≥ 66kV & ≤ 132kV",22.54,25.7,null,null,null,"≥ 66kV & ≤ 132kV",22.54,25.7,null,null,null,"≥ 66kV & ≤ 132kV",22.52,25.67]
["Excess NAC Megaflex","ExNACMe",3,4,"ExNACMe34N",null,"Excess NAC Nightsave Large","ExNACNL",3,4,"ExNACNL34N",null,"Excess NAC Miniflex","ExNACMi",3,4,"ExNACMi34N",null,null,"> 132kV*",19.689999999999998,22.45,null,null,null,"> 132kV*",19.689999999999998,22.45,null,null,null,"> 132kV*",19.66,22.41]
[null,null,null,null,null,null,null,null,null,null,null,null,null,null,null,null,null,null,null,"* 132 kV or Transmission connected",null,null,null,null,null,"* 132 kV or Transmission connected",null,null,null,null,null,"* 132 kV or Transmission connected"]
[null,null,null,null,null,null,null,null,null,null,null,null,null,null,null,null,null,null,"Urban - Excess NAC\nNightsave Urban Small\n[non local authorities]",null,null,null,null,"Rural - Excess NAC\nNightsave Rural\n[non local authorities]",null,null,null,null,null,"Rural - Excess NAC\nRuraflex\n[non local authorities]"]
[]
[null,null,null,null,null,null,null,null,null,null,null,null,null,null,null,null,null,null,null,null,"Excess network charge [R/kVA/m]",null,null,null,null,null,"Excess network charge [R/kVA/m]",null,null,null,null,null,"Excess network charge [R/kVA/m]"]
[null,null,null,null,null,null,null,null,null,null,null,null,null,null,null,null,null,null,"Transmission zone",null,null,null,null,null,"Transmission zone",null,null,null,null,null,"Transmission zone"]
[null,null,null,null,null,null,null,null,null,null,null,null,null,null,null,null,null,null,null,"Voltage",null,null,null,null,null,"Voltage",null,null,null,null,null,"Voltage"]
["Tariff","Tariff nameBillcode","Tx zone","Voltage","Billcode",null,"Tariff","Tariff nameBillcode","Tx zone","Voltage","Billcode",null,"Tariff","Tariff nameBillcode","Tx zone","Voltage","Billcode",null,null,null,null,"VAT incl",null,null,null,null,null,"VAT incl",null,null,null,null,null,"VAT incl"]
["Excess NAC Nightsave Small","ExNACNS",0,1,{"$f":"B31&C31&D31&IF($A$2=\"Non-municipal\",\"N\",IF($A$2=\"Municiple\",\"Y\",\"error\"))","v":"ExNACNS01N"},null,"Excess NAC Nightsave Rural","ExNACNR",0,1,{"$f":"H31&I31&J31&IF($A$2=\"Non-municipal\",\"N\",IF($A$2=\"Municiple\",\"Y\",\"error\"))","v":"ExNACNR01N"},null,"Excess NAC Ruraflex","ExNACRu",0,1,{"$f":"N31&O31&P31&IF($A$2=\"Non-municipal\",\"N\",IF($A$2=\"Municiple\",\"Y\",\"error\"))","v":"ExNACRu01N"},null,"≤ 300km","< 500V",21.27,{"$f":"ROUND(U31 * (1 + VAT), 2)","v":24.25},null,null,"≤ 300km","< 500V",10.65,{"$f":"ROUND(AA31 * (1 + VAT), 2)","v":12.14},null,null,"≤ 300km","< 500V",14.88,{"$f":"ROUND(AG31 * (1 + VAT), 2)","v":16.96}]
["Excess NAC Nightsave Small","ExNACNS",0,2,{"$f":"B32&C32&D32&IF($A$2=\"Non-municipal\",\"N\",IF($A$2=\"Municiple\",\"Y\",\"error\"))","v":"ExNACNS02N"},null,"Excess NAC Nightsave Rural","ExNACNR",0,2,{"$f":"H32&I32&J32&IF($A$2=\"Non-municipal\",\"N\",IF($A$2=\"Municiple\",\"Y\",\"error\"))","v":"ExNACNR02N"},null,"Excess NAC Ruraflex","ExNACRu",0,2,{"$f":"N32&O32&P32&IF($A$2=\"Non-municipal\",\"N\",IF($A$2=\"Municiple\",\"Y\",\"error\"))","v":"ExNACRu02N"},null,null,"≥ 500V & < 66kV",19.490000000000002,22.22,null,null,null,"≥ 500V & ≤ 22kV",9.7799999999999994,11.15,null,null,null,"≥ 500V & ≤ 22kV",13.64,15.55]
["Excess NAC Nightsave Small","ExNACNS",0,3,"ExNACNS03N",null,"Excess NAC Nightsave Rural","ExNACNR",0,3,"ExNACNR03N",null,"Excess NAC Ruraflex","ExNACRu",0,3,"ExNACRu03N",null,null,"≥ 66kV & ≤ 132kV",22.4,25.54]
["Excess NAC Nightsave Small","ExNACNS",0,4,"ExNACNS04N",null,"Excess NAC Nightsave Rural","ExNACNR",0,4,"ExNACNR04N",null,"Excess NAC Ruraflex","ExNACRu",0,4,"ExNACRu04N",null,null,"> 132kV*",19.439999999999998,22.16]
["Excess NAC Nightsave Small","ExNACNS",1,1,"ExNACNS11N",null,"Excess NAC Nightsave Rural","ExNACNR",1,1,"ExNACNR11N",null,"Excess NAC Ruraflex","ExNACRu",1,1,"ExNACRu11N",null,"> 300km and \n≤ 600km","< 500V",21.33,24.32,null,null,"> 300km and \n≤ 600km","< 500V",10.68,{"$f":"ROUND(AA35 * (1 + VAT), 2)","v":12.18},null,null,"> 300km and \n≤ 600km","< 500V",14.93,{"$f":"ROUND(AG35 * (1 + VAT), 2)","v":17.02}]
["Excess NAC Nightsave Small","ExNACNS",1,2,"ExNACNS12N",null,"Excess NAC Nightsave Rural","ExNACNR",1,2,"ExNACNR12N",null,"Excess NAC Ruraflex","ExNACRu",1,2,"ExNACRu12N",null,null,"≥ 500V & < 66kV",19.55,22.29,null,null,null,"≥ 500V & ≤ 22kV",9.83,11.21,null,null,null,"≥ 500V & ≤ 22kV",13.73,15.65]
["Excess NAC Nightsave Small","ExNACNS",1,3,"ExNACNS13N",null,"Excess NAC Nightsave Rural","ExNACNR",1,3,"ExNACNR13N",null,"Excess NAC Ruraflex","ExNACRu",1,3,"ExNACRu13N",null,null,"≥ 66kV & ≤ 132kV",22.45,25.59]
["Excess NAC Nightsave Small","ExNACNS",1,4,"ExNACNS14N",null,"Excess NAC Nightsave Rural","ExNACNR",1,4,"ExNACNR14N",null,"Excess NAC Ruraflex","ExNACRu",1,4,"ExNACRu14N",null,null,"> 132kV*",19.52,22.25]
["Excess NAC Nightsave Small","ExNACNS",2,1,"ExNACNS21N",null,"Excess NAC Nightsave Rural","ExNACNR",2,1,"ExNACNR21N",null,"Excess NAC Ruraflex","ExNACRu",2,1,"ExNACRu21N",null,"> 600km and \n≤ 900km","< 500V",21.42,24.42,null,null,"> 600km and \n≤ 900km","< 500V",10.78,{"$f":"ROUND(AA39 * (1 + VAT), 2)","v":12.29},null,null,"> 600km and \n≤ 900km","< 500V",15.01,{"$f":"ROUND(AG39 * (1 + VAT), 2)","v":17.11}]
["Excess NAC Nightsave Small","ExNACNS",2,2,"ExNACNS22N",null,"Excess NAC Nightsave Rural","ExNACNR",2,2,"ExNACNR22N",null,"Excess NAC Ruraflex","ExNACRu",2,2,"ExNACRu22N",null,null,"≥ 500V & < 66kV",19.61,22.36,null,null,null,"≥ 500V & ≤ 22kV",9.89,11.27,null,null,null,"≥ 500V & ≤ 22kV",13.78,15.71]
["Excess NAC Nightsave Small","ExNACNS",2,3,"ExNACNS23N",null,"Excess NAC Nightsave Rural","ExNACNR",2,3,"ExNACNR23N",null,"Excess NAC Ruraflex","ExNACRu",2,3,"ExNACRu23N",null,null,"≥ 66kV & ≤ 132kV",22.49,25.64]
["Excess NAC Nightsave Small","ExNACNS",2,4,"ExNACNS24N",null,"Excess NAC Nightsave Rural","ExNACNR",2,4,"ExNACNR24N",null,"Excess NAC Ruraflex","ExNACRu",2,4,"ExNACRu24N",null,null,"> 132kV*",19.63,22.38]
["Excess NAC Nightsave Small","ExNACNS",3,1,"ExNACNS31N",null,"Excess NAC Nightsave Rural","ExNACNR",3,1,"ExNACNR31N",null,"Excess NAC Ruraflex","ExNACRu",3,1,"ExNACRu31N",null,"> 900km","< 500V",21.44,24.44,null,null,"> 900km","< 500V",10.8,{"$f":"ROUND(AA43 * (1 + VAT), 2)","v":12.31},null,null,"> 900km","< 500V",15.07,{"$f":"ROUND(AG43 * (1 + VAT), 2)","v":17.18}]
["Excess NAC Nightsave Small","ExNACNS",3,2,"ExNACNS32N",null,"Excess NAC Nightsave Rural","ExNACNR",3,2,"ExNACNR32N",null,"Excess NAC Ruraflex","ExNACRu",3,2,"ExNACRu32N",null,null,"≥ 500V & < 66kV",19.690000000000001,22.45,null,null,null,"≥ 500V & ≤ 22kV",9.91,11.3,null,null,null,"≥ 500V & ≤ 22kV",13.79,15.72]
["Excess NAC Nightsave Small","ExNACNS",3,3,"ExNACNS33N",null,"Excess NAC Nightsave Rural","ExNACNR",3,3,"ExNACNR33N",null,"Excess NAC Ruraflex","ExNACRu",3,3,"ExNACRu33N",null,null,"≥ 66kV & ≤ 132kV",22.54,25.7]
["Excess NAC Nightsave Small","ExNACNS",3,4,"ExNACNS34N",null,"Excess NAC Nightsave Rural","ExNACNR",3,4,"ExNACNR34N",null,"Excess NAC Ruraflex","ExNACRu",3,4,"ExNACRu34N",null,null,"> 132kV*",19.689999999999998,22.45]
[null,null,null,null,null,null,null,null,null,null,null,null,null,null,null,null,null,null,null,"* 132 kV or Transmission connected"]

{"sheet":"Excess NAC Munic","index":32,"n_rows":47,"n_cols":34,"rows_kept":47,"cut":false,"hidden":false,"merged":[[4,32,5,33],[1,18,1,21],[1,23,1,27],[1,29,1,33],[3,20,3,21],[3,26,3,27],[3,32,3,33],[4,18,6,18],[4,20,5,21],[4,24,6,24],[4,26,5,27],[4,30,6,30],[7,18,10,18],[7,24,10,24],[7,30,10,30],[11,18,14,18],[11,24,14,24],[11,30,14,30],[15,18,18,18],[15,24,18,24],[15,30,18,30],[19,18,22,18],[19,24,22,24],[19,30,22,30],[27,32,28,33],[24,18,24,21],[24,23,24,27],[24,29,24,33],[26,20,26,21],[26,26,26,27],[26,32,26,33],[27,18,29,18],[27,20,28,21],[27,24,29,24],[27,26,28,27],[27,30,29,30],[30,18,33,18],[30,24,33,24],[30,30,33,30],[34,18,37,18],[34,24,37,24],[34,30,37,30],[38,18,41,18],[38,24,41,24],[38,30,41,30],[42,18,45,18],[42,24,45,24],[42,30,45,30]]}
[null,null,null,null,null,null,null,null,null,null,null,null,null,null,null,null,null,null,"Back to menu"]
["Municiple",null,null,null,null,null,null,null,null,null,null,null,null,null,null,null,null,null,"Urban - Excess NAC\nMegaflex\n[Local authorities]",null,null,null,null,"Urban - Excess NAC\nNightsave Urban Large\n[Local authorities]",null,null,null,null,null,"Urban - Excess NAC\nMiniflex\n[Local authorities]"]
[]
[null,null,null,null,null,null,null,null,null,null,null,null,null,null,null,null,null,null,null,null,"Excess network charge [R/kVA/m]",null,null,null,null,null,"Excess network charge [R/kVA/m]",null,null,null,null,null,"Excess network charge [R/kVA/m]"]
[null,null,null,null,null,null,null,null,null,null,null,null,null,null,null,null,null,null,"Transmission zone",null,null,null,null,null,"Transmission zone",null,null,null,null,null,"Transmission zone"]
[null,null,null,null,null,null,null,null,null,null,null,null,null,null,null,null,null,null,null,"Voltage",null,null,null,null,null,"Voltage",null,null,null,null,null,"Voltage"]
["Tariff","Tariff nameBillcode","Tx zone","Voltage","Billcode",null,"Tariff","Tariff nameBillcode","Tx zone","Voltage","Billcode",null,"Tariff","Tariff nameBillcode","Tx zone","Voltage","Billcode",null,null,null,null,"VAT incl",null,null,null,null,null,"VAT incl",null,null,null,null,null,"VAT incl"]
["Excess NAC Megaflex","ExNACMe",0,1,{"$f":"B8&C8&D8&IF($A$2=\"Non-municipal\",\"N\",IF($A$2=\"Municiple\",\"Y\",\"error\"))","v":"ExNACMe01Y"},null,"Excess NAC Nightsave Large","ExNACNL",0,1,{"$f":"H8&I8&J8&IF($A$2=\"Non-municipal\",\"N\",IF($A$2=\"Municiple\",\"Y\",\"error\"))","v":"ExNACNL01Y"},null,"Excess NAC Miniflex","ExNACMi",0,1,{"$f":"N8&O8&P8&IF($A$2=\"Non-municipal\",\"N\",IF($A$2=\"Municiple\",\"Y\",\"error\"))","v":"ExNACMi01Y"},null,"≤ 300km","< 500V",21.56,{"$f":"ROUND(U8 * (1 + VAT), 2)","v":24.58},null,null,"≤ 300km","< 500V",21.56,{"$f":"ROUND(AA8 * (1 + VAT), 2)","v":24.58},null,null,"≤ 300km","< 500V",21.56,{"$f":"ROUND(AG8 * (1 + VAT), 2)","v":24.58}]
["Excess NAC Megaflex","ExNACMe",0,2,{"$f":"B9&C9&D9&IF($A$2=\"Non-municipal\",\"N\",IF($A$2=\"Municiple\",\"Y\",\"error\"))","v":"ExNACMe02Y"},null,"Excess NAC Nightsave Large","ExNACNL",0,2,{"$f":"H9&I9&J9&IF($A$2=\"Non-municipal\",\"N\",IF($A$2=\"Municiple\",\"Y\",\"error\"))","v":"ExNACNL02Y"},null,"Excess NAC Miniflex","ExNACMi",0,2,{"$f":"N9&O9&P9&IF($A$2=\"Non-municipal\",\"N\",IF($A$2=\"Municiple\",\"Y\",\"error\"))","v":"ExNACMi02Y"},null,null,"≥ 500V & < 66kV",19.740000000000002,22.5,null,null,null,"≥ 500V & < 66kV",19.740000000000002,22.5,null,null,null,"≥ 500V & < 66kV",19.75,22.52]
["Excess NAC Megaflex","ExNACMe",0,3,"ExNACMe03Y",null,"Excess NAC Nightsave Large","ExNACNL",0,3,"ExNACNL03Y",null,"Excess NAC Miniflex","ExNACMi",0,3,"ExNACMi03Y",null,null,"≥ 66kV & ≤ 132kV",22.64,25.81,null,null,null,"≥ 66kV & ≤ 132kV",22.64,25.81,null,null,null,"≥ 66kV & ≤ 132kV",22.619999999999997,25.79]
["Excess NAC Megaflex","ExNACMe",0,4,"ExNACMe04Y",null,"Excess NAC Nightsave Large","ExNACNL",0,4,"ExNACNL04Y",null,"Excess NAC Miniflex","ExNACMi",0,4,"ExNACMi04Y",null,null,"> 132kV*",19.619999999999997,22.37,null,null,null,"> 132kV*",19.619999999999997,22.37,null,null,null,"> 132kV*",19.619999999999997,22.37]
["Excess NAC Megaflex","ExNACMe",1,1,"ExNACMe11Y",null,"Excess NAC Nightsave Large","ExNACNL",1,1,"ExNACNL11Y",null,"Excess NAC Miniflex","ExNACMi",1,1,"ExNACMi11Y",null,"> 300km and \n≤ 600km","< 500V",21.6,24.62,null,null,"> 300km and \n≤ 600km","< 500V",21.6,24.62,null,null,"> 300km and \n≤ 600km","< 500V",21.6,24.62]
["Excess NAC Megaflex","ExNACMe",1,2,"ExNACMe12Y",null,"Excess NAC Nightsave Large","ExNACNL",1,2,"ExNACNL12Y",null,"Excess NAC Miniflex","ExNACMi",1,2,"ExNACMi12Y",null,null,"≥ 500V & < 66kV",19.809999999999999,22.58,null,null,null,"≥ 500V & < 66kV",19.809999999999999,22.58,null,null,null,"≥ 500V & < 66kV",19.809999999999999,22.58]
["Excess NAC Megaflex","ExNACMe",1,3,"ExNACMe13Y",null,"Excess NAC Nightsave Large","ExNACNL",1,3,"ExNACNL13Y",null,"Excess NAC Miniflex","ExNACMi",1,3,"ExNACMi13Y",null,null,"≥ 66kV & ≤ 132kV",22.68,25.86,null,null,null,"≥ 66kV & ≤ 132kV",22.68,25.86,null,null,null,"≥ 66kV & ≤ 132kV",22.68,25.86]
["Excess NAC Megaflex","ExNACMe",1,4,"ExNACMe14Y",null,"Excess NAC Nightsave Large","ExNACNL",1,4,"ExNACNL14Y",null,"Excess NAC Miniflex","ExNACMi",1,4,"ExNACMi14Y",null,null,"> 132kV*",19.7,22.46,null,null,null,"> 132kV*",19.7,22.46,null,null,null,"> 132kV*",19.7,22.46]
["Excess NAC Megaflex","ExNACMe",2,1,"ExNACMe21Y",null,"Excess NAC Nightsave Large","ExNACNL",2,1,"ExNACNL21Y",null,"Excess NAC Miniflex","ExNACMi",2,1,"ExNACMi21Y",null,"> 600km and \n≤ 900km","< 500V",21.689999999999998,24.73,null,null,"> 600km and \n≤ 900km","< 500V",21.689999999999998,24.73,null,null,"> 600km and \n≤ 900km","< 500V",21.71,24.75]
["Excess NAC Megaflex","ExNACMe",2,2,"ExNACMe22Y",null,"Excess NAC Nightsave Large","ExNACNL",2,2,"ExNACNL22Y",null,"Excess NAC Miniflex","ExNACMi",2,2,"ExNACMi22Y",null,null,"≥ 500V & < 66kV",19.86,22.64,null,null,null,"≥ 500V & < 66kV",19.86,22.64,null,null,null,"≥ 500V & < 66kV",19.87,22.65]
["Excess NAC Megaflex","ExNACMe",2,3,"ExNACMe23Y",null,"Excess NAC Nightsave Large","ExNACNL",2,3,"ExNACNL23Y",null,"Excess NAC Miniflex","ExNACMi",2,3,"ExNACMi23Y",null,null,"≥ 66kV & ≤ 132kV",22.74,25.92,null,null,null,"≥ 66kV & ≤ 132kV",22.74,25.92,null,null,null,"≥ 66kV & ≤ 132kV",22.729999999999997,25.91]
["Excess NAC Megaflex","ExNACMe",2,4,"ExNACMe24Y",null,"Excess NAC Nightsave Large","ExNACNL",2,4,"ExNACNL24Y",null,"Excess NAC Miniflex","ExNACMi",2,4,"ExNACMi24Y",null,null,"> 132kV*",19.809999999999999,22.58,null,null,null,"> 132kV*",19.809999999999999,22.58,null,null,null,"> 132kV*",19.809999999999999,22.58]
["Excess NAC Megaflex","ExNACMe",3,1,"ExNACMe31Y",null,"Excess NAC Nightsave Large","ExNACNL",3,1,"ExNACNL31Y",null,"Excess NAC Miniflex","ExNACMi",3,1,"ExNACMi31Y",null,"> 900km","< 500V",21.73,24.77,null,null,"> 900km","< 500V",21.73,24.77,null,null,"> 900km","< 500V",21.73,24.77]
["Excess NAC Megaflex","ExNACMe",3,2,"ExNACMe32Y",null,"Excess NAC Nightsave Large","ExNACNL",3,2,"ExNACNL32Y",null,"Excess NAC Miniflex","ExNACMi",3,2,"ExNACMi32Y",null,null,"≥ 500V & < 66kV",19.93,22.72,null,null,null,"≥ 500V & < 66kV",19.93,22.72,null,null,null,"≥ 500V & < 66kV",19.95,22.74]
["Excess NAC Megaflex","ExNACMe",3,3,"ExNACMe33Y",null,"Excess NAC Nightsave Large","ExNACNL",3,3,"ExNACNL33Y",null,"Excess NAC Miniflex","ExNACMi",3,3,"ExNACMi33Y",null,null,"≥ 66kV & ≤ 132kV",22.79,25.98,null,null,null,"≥ 66kV & ≤ 132kV",22.79,25.98,null,null,null,"≥ 66kV & ≤ 132kV",22.77,25.96]
["Excess NAC Megaflex","ExNACMe",3,4,"ExNACMe34Y",null,"Excess NAC Nightsave Large","ExNACNL",3,4,"ExNACNL34Y",null,"Excess NAC Miniflex","ExNACMi",3,4,"ExNACMi34Y",null,null,"> 132kV*",19.869999999999997,22.65,null,null,null,"> 132kV*",19.869999999999997,22.65,null,null,null,"> 132kV*",19.869999999999997,22.65]
[null,null,null,null,null,null,null,null,null,null,null,null,null,null,null,null,null,null,null,"* 132 kV or Transmission connected",null,null,null,null,null,"* 132 kV or Transmission connected",null,null,null,null,null,"* 132 kV or Transmission connected"]
[null,null,null,null,null,null,null,null,null,null,null,null,null,null,null,null,null,null,"Urban - Excess NAC\nNightsave Urban Small\n[Local authorities]",null,null,null,null,"Rural - Excess NAC\nNightsave Rural\n[Local authorities]",null,null,null,null,null,"Rural - Excess NAC\nRuraflex\n[Local authorities]"]
[]
[null,null,null,null,null,null,null,null,null,null,null,null,null,null,null,null,null,null,null,null,"Excess network charge [R/kVA/m]",null,null,null,null,null,"Excess network charge [R/kVA/m]",null,null,null,null,null,"Excess network charge [R/kVA/m]"]
[null,null,null,null,null,null,null,null,null,null,null,null,null,null,null,null,null,null,"Transmission zone",null,null,null,null,null,"Transmission zone",null,null,null,null,null,"Transmission zone"]
[null,null,null,null,null,null,null,null,null,null,null,null,null,null,null,null,null,null,null,"Voltage",null,null,null,null,null,"Voltage",null,null,null,null,null,"Voltage"]
["Tariff","Tariff nameBillcode","Tx zone","Voltage","Billcode",null,"Tariff","Tariff nameBillcode","Tx zone","Voltage","Billcode",null,"Tariff","Tariff nameBillcode","Tx zone","Voltage","Billcode",null,null,null,null,"VAT incl",null,null,null,null,null,"VAT incl",null,null,null,null,null,"VAT incl"]
["Excess NAC Nightsave Small","ExNACNS",0,1,{"$f":"B31&C31&D31&IF($A$2=\"Non-municipal\",\"N\",IF($A$2=\"Municiple\",\"Y\",\"error\"))","v":"ExNACNS01Y"},null,"Excess NAC Nightsave Rural","ExNACNR",0,1,{"$f":"H31&I31&J31&IF($A$2=\"Non-municipal\",\"N\",IF($A$2=\"Municiple\",\"Y\",\"error\"))","v":"ExNACNR01Y"},null,"Excess NAC Ruraflex","ExNACRu",0,1,{"$f":"N31&O31&P31&IF($A$2=\"Non-municipal\",\"N\",IF($A$2=\"Municiple\",\"Y\",\"error\"))","v":"ExNACRu01Y"},null,"≤ 300km","< 500V",21.56,{"$f":"ROUND(U31 * (1 + VAT), 2)","v":24.58},null,null,"≤ 300km","< 500V",10.91,{"$f":"ROUND(AA31 * (1 + VAT), 2)","v":12.44},null,null,"≤ 300km","< 500V",15.22,{"$f":"ROUND(AG31 * (1 + VAT), 2)","v":17.350000000000001}]
["Excess NAC Nightsave Small","ExNACNS",0,2,{"$f":"B32&C32&D32&IF($A$2=\"Non-municipal\",\"N\",IF($A$2=\"Municiple\",\"Y\",\"error\"))","v":"ExNACNS02Y"},null,"Excess NAC Nightsave Rural","ExNACNR",0,2,{"$f":"H32&I32&J32&IF($A$2=\"Non-municipal\",\"N\",IF($A$2=\"Municiple\",\"Y\",\"error\"))","v":"ExNACNR02Y"},null,"Excess NAC Ruraflex","ExNACRu",0,2,{"$f":"N32&O32&P32&IF($A$2=\"Non-municipal\",\"N\",IF($A$2=\"Municiple\",\"Y\",\"error\"))","v":"ExNACRu02Y"},null,null,"≥ 500V & < 66kV",19.740000000000002,22.5,null,null,null,"≥ 500V & ≤ 22kV",10.02,11.42,null,null,null,"≥ 500V & ≤ 22kV",13.96,15.91]
["Excess NAC Nightsave Small","ExNACNS",0,3,"ExNACNS03Y",null,"Excess NAC Nightsave Rural","ExNACNR",0,3,"ExNACNR03Y",null,"Excess NAC Ruraflex","ExNACRu",0,3,"ExNACRu03Y",null,null,"≥ 66kV & ≤ 132kV",22.64,25.81]
["Excess NAC Nightsave Small","ExNACNS",0,4,"ExNACNS04Y",null,"Excess NAC Nightsave Rural","ExNACNR",0,4,"ExNACNR04Y",null,"Excess NAC Ruraflex","ExNACRu",0,4,"ExNACRu04Y",null,null,"> 132kV*",19.619999999999997,22.37]
["Excess NAC Nightsave Small","ExNACNS",1,1,"ExNACNS11Y",null,"Excess NAC Nightsave Rural","ExNACNR",1,1,"ExNACNR11Y",null,"Excess NAC Ruraflex","ExNACRu",1,1,"ExNACRu11Y",null,"> 300km and \n≤ 600km","< 500V",21.6,24.62,null,null,"> 300km and \n≤ 600km","< 500V",10.93,{"$f":"ROUND(AA35 * (1 + VAT), 2)","v":12.46},null,null,"> 300km and \n≤ 600km","< 500V",15.29,{"$f":"ROUND(AG35 * (1 + VAT), 2)","v":17.43}]
["Excess NAC Nightsave Small","ExNACNS",1,2,"ExNACNS12Y",null,"Excess NAC Nightsave Rural","ExNACNR",1,2,"ExNACNR12Y",null,"Excess NAC Ruraflex","ExNACRu",1,2,"ExNACRu12Y",null,null,"≥ 500V & < 66kV",19.809999999999999,22.58,null,null,null,"≥ 500V & ≤ 22kV",10.06,11.47,null,null,null,"≥ 500V & ≤ 22kV",14.05,16.02]
["Excess NAC Nightsave Small","ExNACNS",1,3,"ExNACNS13Y",null,"Excess NAC Nightsave Rural","ExNACNR",1,3,"ExNACNR13Y",null,"Excess NAC Ruraflex","ExNACRu",1,3,"ExNACRu13Y",null,null,"≥ 66kV & ≤ 132kV",22.68,25.86]
["Excess NAC Nightsave Small","ExNACNS",1,4,"ExNACNS14Y",null,"Excess NAC Nightsave Rural","ExNACNR",1,4,"ExNACNR14Y",null,"Excess NAC Ruraflex","ExNACRu",1,4,"ExNACRu14Y",null,null,"> 132kV*",19.7,22.46]
["Excess NAC Nightsave Small","ExNACNS",2,1,"ExNACNS21Y",null,"Excess NAC Nightsave Rural","ExNACNR",2,1,"ExNACNR21Y",null,"Excess NAC Ruraflex","ExNACRu",2,1,"ExNACRu21Y",null,"> 600km and \n≤ 900km","< 500V",21.689999999999998,24.73,null,null,"> 600km and \n≤ 900km","< 500V",11.04,{"$f":"ROUND(AA39 * (1 + VAT), 2)","v":12.59},null,null,"> 600km and \n≤ 900km","< 500V",15.37,{"$f":"ROUND(AG39 * (1 + VAT), 2)","v":17.52}]
["Excess NAC Nightsave Small","ExNACNS",2,2,"ExNACNS22Y",null,"Excess NAC Nightsave Rural","ExNACNR",2,2,"ExNACNR22Y",null,"Excess NAC Ruraflex","ExNACRu",2,2,"ExNACRu22Y",null,null,"≥ 500V & < 66kV",19.86,22.64,null,null,null,"≥ 500V & ≤ 22kV",10.119999999999999,11.54,null,null,null,"≥ 500V & ≤ 22kV",14.11,16.09]
["Excess NAC Nightsave Small","ExNACNS",2,3,"ExNACNS23Y",null,"Excess NAC Nightsave Rural","ExNACNR",2,3,"ExNACNR23Y",null,"Excess NAC Ruraflex","ExNACRu",2,3,"ExNACRu23Y",null,null,"≥ 66kV & ≤ 132kV",22.74,25.92]
["Excess NAC Nightsave Small","ExNACNS",2,4,"ExNACNS24Y",null,"Excess NAC Nightsave Rural","ExNACNR",2,4,"ExNACNR24Y",null,"Excess NAC Ruraflex","ExNACRu",2,4,"ExNACRu24Y",null,null,"> 132kV*",19.809999999999999,22.58]
["Excess NAC Nightsave Small","ExNACNS",3,1,"ExNACNS31Y",null,"Excess NAC Nightsave Rural","ExNACNR",3,1,"ExNACNR31Y",null,"Excess NAC Ruraflex","ExNACRu",3,1,"ExNACRu31Y",null,"> 900km","< 500V",21.73,24.77,null,null,"> 900km","< 500V",11.05,{"$f":"ROUND(AA43 * (1 + VAT), 2)","v":12.6},null,null,"> 900km","< 500V",15.42,{"$f":"ROUND(AG43 * (1 + VAT), 2)","v":17.579999999999998}]
["Excess NAC Nightsave Small","ExNACNS",3,2,"ExNACNS32Y",null,"Excess NAC Nightsave Rural","ExNACNR",3,2,"ExNACNR32Y",null,"Excess NAC Ruraflex","ExNACRu",3,2,"ExNACRu32Y",null,null,"≥ 500V & < 66kV",19.93,22.72,null,null,null,"≥ 500V & ≤ 22kV",10.130000000000001,11.55,null,null,null,"≥ 500V & ≤ 22kV",14.12,16.100000000000001]
["Excess NAC Nightsave Small","ExNACNS",3,3,"ExNACNS33Y",null,"Excess NAC Nightsave Rural","ExNACNR",3,3,"ExNACNR33Y",null,"Excess NAC Ruraflex","ExNACRu",3,3,"ExNACRu33Y",null,null,"≥ 66kV & ≤ 132kV",22.79,25.98]
["Excess NAC Nightsave Small","ExNACNS",3,4,"ExNACNS34Y",null,"Excess NAC Nightsave Rural","ExNACNR",3,4,"ExNACNR34Y",null,"Excess NAC Ruraflex","ExNACRu",3,4,"ExNACRu34Y",null,null,"> 132kV*",19.869999999999997,22.65]
[null,null,null,null,null,null,null,null,null,null,null,null,null,null,null,null,null,null,null,"* 132 kV or Transmission connected"]

{"sheet":"Miniflex CPD","index":33,"n_rows":44,"n_cols":31,"rows_kept":44,"cut":false,"hidden":false,"merged":[[1,13,1,14],[1,15,1,30],[3,5,3,16],[3,17,3,28],[3,29,3,30],[4,23,4,28],[4,29,5,30],[5,5,5,6],[5,7,5,8],[5,9,5,10],[5,11,5,12],[5,25,5,26],[5,27,5,28],[5,23,5,24],[19,3,22,3],[5,13,5,14],[5,15,5,16],[5,17,5,18],[5,19,5,20],[4,3,6,3],[4,5,4,10],[4,11,4,16],[4,17,4,22],[7,3,10,3],[11,3,14,3],[15,3,18,3],[5,21,5,22],[32,3,32,4],[25,3,26,4],[25,5,26,6],[25,7,26,8],[27,3,27,4],[27,16,27,18],[28,3,28,4],[29,3,29,4],[30,3,30,4],[31,3,31,4],[27,11,27,12],[27,13,27,14],[35,3,36,4],[35,5,36,6],[35,10,36,13],[37,3,37,4],[37,5,37,6],[37,10,37,11],[37,12,37,13]]}
["MiCPDPf",null,null,null,null,null,null,null,null,null,null,null,null,null,null,null,null,null,null,null,null,null,null,null,null,null,null,null,null,null,{"$error":"#REF!"}]
["MiCPDPn",null,null,"Miniflex Critical Peak Day tariff ",null,null,null,null,null,null,null,null,null,null,null,"Non-local authority"]
[0,1,null,"N"]
[1,2,null,null,null,"Active energy charge [c/kWh] NON-CRITICAL PEAK DAY rates for 348 NORMAL days ",null,null,null,null,null,null,null,null,null,null,null,"Active energy charge [c/kWh] CRITICAL PEAK DAY rates for 17 CRITICAL PEAK days ",null,null,null,null,null,null,null,null,null,null,null,"Network capacity charges [R/kVA/m]*"]
[2,3,null,"Transmission zone",null,"High demand season [Jun - Aug]",null,null,null,null,null,"Low demand season [Sep - May]",null,null,null,null,null,"High demand season [Jun - Aug]",null,null,null,null,null,"Low demand season [Sep - May]"]
[3,4,null,null,"Voltage","Peak",null,"Standard",null,"Off Peak",null,"Peak",null,"Standard",null,"Off Peak",null,"Peak",null,"Standard",null,"Off Peak",null,"Peak",null,"Standard",null,"Off Peak"]
[null,null,null,null,null,"","VAT incl",null,"VAT incl",null,"VAT incl",null,"VAT incl",null,"VAT incl",null,"VAT incl","","VAT incl",null,"VAT incl",null,"VAT incl",null,"VAT incl",null,"VAT incl",null,"VAT incl",null,"VAT incl"]
[{"$f":"$A$2&$A$3&$B$3&$D$3","v":"MiCPDPn01N"},{"$f":"$A$1&$A$3&$B$3&$D$3","v":"MiCPDPf01N"},null,"≤ 300km","< 500V",204.13,{"$f":"ROUND(F8 * (1 + VAT), 2)","v":232.71},62.1,{"$f":"ROUND(H8 * (1 + VAT), 2)","v":70.790000000000006},41.35,{"$f":"ROUND(J8 * (1 + VAT), 2)","v":47.14},66.84,{"$f":"ROUND(L8 * (1 + VAT), 2)","v":76.2},46.12,{"$f":"ROUND(N8 * (1 + VAT), 2)","v":52.58},35.86,{"$f":"ROUND(P8 * (1 + VAT), 2)","v":40.880000000000003},447.54,{"$f":"ROUND(R8 * (1 + VAT), 2)","v":510.2},305.51,{"$f":"ROUND(T8 * (1 + VAT), 2)","v":348.28},41.35,{"$f":"ROUND(V8 * (1 + VAT), 2)","v":47.14},310.25,{"$f":"ROUND(X8 * (1 + VAT), 2)","v":353.69},289.52999999999997,{"$f":"ROUND(Z8 * (1 + VAT), 2)","v":330.06},35.86,{"$f":"ROUND(AB8 * (1 + VAT), 2)","v":40.880000000000003},21.25,{"$f":"ROUND(AD8 * (1 + VAT), 2)","v":24.23}]
[{"$f":"$A$2&$A$3&$B$4&$D$3","v":"MiCPDPn02N"},{"$f":"$A$1&$A$3&$B$4&$D$3","v":"MiCPDPf02N"},null,null,"≥ 500V & < 66kV",200.92,229.05,60.86,69.38,40.31,45.95,65.540000000000006,74.72,45.11,51.43,34.9,39.79,444.33,506.54,304.27,346.87,40.31,45.95,308.95,352.2,288.52,328.91,34.9,39.79,19.47,22.2]
[{"$f":"$A$2&$A$3&$B$5&$D$3","v":"MiCPDPn03N"},{"$f":"$A$1&$A$3&$B$5&$D$3","v":"MiCPDPf03N"},null,null,"≥ 66kV & ≤ 132kV",194.56,221.8,58.94,67.19,39.04,44.51,63.47,72.36,43.68,49.8,33.799999999999997,38.53,437.97,499.29,302.35000000000002,344.68,39.04,44.51,306.88,349.84,287.08999999999997,327.27999999999997,33.799999999999997,38.53,10.94,12.47]
[{"$f":"$A$2&$A$3&$B$6&$D$3","v":"MiCPDPn04N"},{"$f":"$A$1&$A$3&$B$6&$D$3","v":"MiCPDPf04N"},null,null,"> 132kV*",183.37,209.04,55.54,63.32,36.79,41.94,59.82,68.19,41.17,46.93,31.86,36.32,426.78,486.53,298.95999999999998,340.81,36.79,41.94,303.23,345.68,284.58,324.42,31.86,36.32,7.97,9.09]
[{"$f":"$A$2&$A$4&$B$3&$D$3","v":"MiCPDPn11N"},{"$f":"$A$1&$A$4&$B$3&$D$3","v":"MiCPDPf11N"},null,"> 300km and \n≤ 600km","< 500V",205.78,234.59,62.35,71.08,41.29,47.07,67.13,76.53,46.21,52.68,35.76,40.770000000000003,449.19,512.08000000000004,305.76,348.57,41.29,47.07,310.54000000000002,354.02,289.62,330.17,35.76,40.770000000000003,21.3,24.28]
[{"$f":"$A$2&$A$4&$B$4&$D$3","v":"MiCPDPn12N"},{"$f":"$A$1&$A$4&$B$4&$D$3","v":"MiCPDPf12N"},null,null,"≥ 500V & < 66kV",202.92,231.33,61.47,70.08,40.71,46.41,66.209999999999994,75.48,45.55,51.93,35.25,40.19,446.33,508.82,304.88,347.56,40.71,46.41,309.62,352.97,288.95999999999998,329.41,35.25,40.19,19.53,22.26]
[{"$f":"$A$2&$A$4&$B$5&$D$3","v":"MiCPDPn13N"},{"$f":"$A$1&$A$4&$B$5&$D$3","v":"MiCPDPf13N"},null,null,"≥ 66kV & ≤ 132kV",196.48,223.99,59.51,67.84,39.409999999999997,44.93,64.09,73.06,44.1,50.27,34.119999999999997,38.9,439.89,501.47,302.92,345.33,39.409999999999997,44.93,307.5,350.55,287.51,327.76,34.119999999999997,38.9,10.99,12.53]
[{"$f":"$A$2&$A$4&$B$6&$D$3","v":"MiCPDPn14N"},{"$f":"$A$1&$A$4&$B$6&$D$3","v":"MiCPDPf14N"},null,null,"> 132kV*",185.19,211.12,56.11,63.97,37.14,42.34,60.4,68.86,41.57,47.39,32.159999999999997,36.659999999999997,428.61,488.62,299.52,341.45,37.14,42.34,303.81,346.34,284.98,324.88,32.159999999999997,36.659999999999997,8.06,9.19]
[{"$f":"$A$2&$A$5&$B$3&$D$3","v":"MiCPDPn21N"},{"$f":"$A$1&$A$5&$B$3&$D$3","v":"MiCPDPf21N"},null,"> 600km and \n≤ 900km","< 500V",207.83,236.93,62.95,71.760000000000005,41.68,47.52,67.790000000000006,77.28,46.66,53.19,36.090000000000003,41.14,451.24,514.41,306.36,349.25,41.68,47.52,311.2,354.77,290.08,330.69,36.090000000000003,41.14,21.4,24.4]
[{"$f":"$A$2&$A$5&$B$4&$D$3","v":"MiCPDPn22N"},{"$f":"$A$1&$A$5&$B$4&$D$3","v":"MiCPDPf22N"},null,null,"≥ 500V & < 66kV",204.95,233.64,62.09,70.78,41.12,46.88,66.86,76.22,46.01,52.45,35.6,40.58,448.36,511.13,305.5,348.27,41.12,46.88,310.27,353.71,289.42,329.94,35.6,40.58,19.59,22.33]
[{"$f":"$A$2&$A$5&$B$5&$D$3","v":"MiCPDPn23N"},{"$f":"$A$1&$A$5&$B$5&$D$3","v":"MiCPDPf23N"},null,null,"≥ 66kV & ≤ 132kV",198.47,226.26,60.12,68.540000000000006,39.81,45.38,64.739999999999995,73.8,44.56,50.8,34.47,39.299999999999997,441.88,503.74,303.52999999999997,346.02,39.81,45.38,308.14999999999998,351.29,287.97000000000003,328.29,34.47,39.299999999999997,11.04,12.59]
[{"$f":"$A$2&$A$5&$B$6&$D$3","v":"MiCPDPn24N"},{"$f":"$A$1&$A$5&$B$6&$D$3","v":"MiCPDPf24N"},null,null,"> 132kV*",187.05,213.24,56.66,64.59,37.54,42.8,61.02,69.56,41.99,47.87,32.5,37.049999999999997,430.46,490.72,300.07,342.08,37.54,42.8,304.43,347.05,285.39999999999998,325.36,32.5,37.049999999999997,8.17,9.31]
[{"$f":"$A$2&$A$6&$B$3&$D$3","v":"MiCPDPn31N"},{"$f":"$A$1&$A$6&$B$3&$D$3","v":"MiCPDPf31N"},null,"> 900km","< 500V",209.92,239.31,63.6,72.5,42.12,48.02,68.48,78.069999999999993,47.13,53.73,36.479999999999997,41.59,453.33,516.79999999999995,307.01,349.99,42.12,48.02,311.89,355.55,290.54000000000002,331.22,36.479999999999997,41.59,21.42,24.42]
[{"$f":"$A$2&$A$6&$B$4&$D$3","v":"MiCPDPn32N"},{"$f":"$A$1&$A$6&$B$4&$D$3","v":"MiCPDPf32N"},null,null,"≥ 500V & < 66kV",207,235.98,62.7,71.48,41.51,47.32,67.52,76.97,46.46,52.96,35.950000000000003,40.98,450.41,513.47,306.11,348.97,41.51,47.32,310.93,354.46,289.87,330.45,35.950000000000003,40.98,19.66,22.41]
[{"$f":"$A$2&$A$6&$B$5&$D$3","v":"MiCPDPn33N"},{"$f":"$A$1&$A$6&$B$5&$D$3","v":"MiCPDPf33N"},null,null,"≥ 66kV & ≤ 132kV",200.46,228.52,60.73,69.23,40.21,45.84,65.38,74.53,45.01,51.31,34.82,39.69,443.87,506.01,304.14,346.72,40.21,45.84,308.79000000000002,352.02,288.42,328.8,34.82,39.69,11.09,12.64]
[{"$f":"$A$2&$A$6&$B$6&$D$3","v":"MiCPDPn34N"},{"$f":"$A$1&$A$6&$B$6&$D$3","v":"MiCPDPf34N"},null,null,"> 132kV*",188.89,215.33,57.25,65.27,37.93,43.24,61.65,70.28,42.44,48.38,32.86,37.46,432.3,492.82,300.66000000000003,342.75,37.93,43.24,305.06,347.77,285.85000000000002,325.87,32.86,37.46,8.23,9.3800000000000008]
[null,null,null,null,"* 132 kV or Transmission connected"]
[]
[null,null,null,"Customer categories",null,"Service charge  [R/account/day]*",null,"Administration charge  [R/POD/day]*"]
[]
[null,null,null,null,null,null,"VAT incl",null,"VAT incl",null,null,"Ancillary service charge [c/kWh]*",null,"Network demand charge [c/kWh]*\n     [Peak & Standard]",null,null,"Urban low voltage subsidy charge [R/kVA/m]*"]
[{"$f":"$A$2&$A$3&$B$3&$D$3","v":"MiCPDPn01N"},null,null,"≤ 100 kVA",null,11.55,{"$f":"ROUND(F29 * (1 + VAT), 2)","v":13.17},2.54,{"$f":"ROUND(H29 * (1 + VAT), 2)","v":2.9},null,"Voltage",null,"VAT incl",null,"VAT incl",null,null,null,"VAT incl"]
[{"$f":"$A$2&$A$3&$B$3&$D$3","v":"MiCPDPn01N"},null,null,"> 100 kVA & ≤ 500 kVA",null,52.8,{"$f":"ROUND(F30 * (1 + VAT), 2)","v":60.19},14.8,{"$f":"ROUND(H30 * (1 + VAT), 2)","v":16.87},null,"< 500V",0.33,{"$f":"ROUND(L30 * (1 + VAT), 2)","v":0.38},13.14,{"$f":"ROUND(N30 * (1 + VAT), 2)","v":14.98},null,"< 500V",0,{"$f":"ROUND(R30 * (1 + VAT), 2)","v":0}]
[{"$f":"$A$2&$A$3&$B$4&$D$3","v":"MiCPDPn02N"},null,null,"> 500 kVA & ≤ 1 MVA",null,162.47999999999999,{"$f":"ROUND(F31 * (1 + VAT), 2)","v":185.23},29.41,{"$f":"ROUND(H31 * (1 + VAT), 2)","v":33.53},null,"≥ 500V & < 66kV",0.32,{"$f":"ROUND(L31 * (1 + VAT), 2)","v":0.36},5.51,{"$f":"ROUND(N31 * (1 + VAT), 2)","v":6.28},null,"≥ 500V & < 66kV",0,{"$f":"ROUND(R31 * (1 + VAT), 2)","v":0}]
[{"$f":"$A$2&$A$3&$B$5&$D$3","v":"MiCPDPn03N"},null,null,"> 1 MVA",null,162.47999999999999,{"$f":"ROUND(F32 * (1 + VAT), 2)","v":185.23},73.23,{"$f":"ROUND(H32 * (1 + VAT), 2)","v":83.48},null,"≥ 66kV & ≤ 132kV",0.3,{"$f":"ROUND(L32 * (1 + VAT), 2)","v":0.34},1.92,{"$f":"ROUND(N32 * (1 + VAT), 2)","v":2.19},null,"≥ 66kV & ≤ 132kV",11.43,{"$f":"ROUND(R32 * (1 + VAT), 2)","v":13.03}]
[{"$f":"$A$2&$A$3&$B$6&$D$3","v":"MiCPDPn04N"},null,null,"Key customers",null,3183.88,{"$f":"ROUND(F33 * (1 + VAT), 2)","v":3629.62},101.68,{"$f":"ROUND(H33 * (1 + VAT), 2)","v":115.92},null,"> 132kV / Transmission connected",0.28000000000000003,{"$f":"ROUND(L33 * (1 + VAT), 2)","v":0.32},0,{"$f":"ROUND(N33 * (1 + VAT), 2)","v":0},null,"> 132kV / Transmission connected",11.43,{"$f":"ROUND(R33 * (1 + VAT), 2)","v":13.03}]
[]
[]
[null,null,null,"Electrification and rural network subsidy charge [c/kWh]*",null,"Affordability subsidy charge [c/kWh] payable by non-local authority tariffs*",null,null,null,null,"Reactive energy charge  [c/kVArh]*"]
[]
[null,null,null,"All seasons",null,"All seasons",null,null,null,null,"High season",null,"Low season"]
[null,null,null,null,"VAT incl",null,"VAT incl",null,null,null,null,"VAT incl",null,"VAT incl"]
[{"$f":"$A$2&$A$3&$B$3&$D$3","v":"MiCPDPn01N"},null,null,6.33,{"$f":"ROUND(D40 * (1 + VAT), 2)","v":7.22},2.44,{"$f":"ROUND(F40 * (1 + VAT), 2)","v":2.78},null,null,null,4.99,{"$f":"ROUND(K40 * (1 + VAT), 2)","v":5.69},0,{"$f":"ROUND(M40 * (1 + VAT), 2)","v":0}]
[]
[]
[]
[null,null,null,"*These charges are the same as the standard tariff and remain unchanged."]

{"sheet":"Nightsave Small CPD","index":34,"n_rows":51,"n_cols":19,"rows_kept":51,"cut":false,"hidden":false,"merged":[[4,15,5,16],[4,17,5,18],[7,3,10,3],[1,17,1,18],[3,5,3,8],[3,9,3,12],[3,13,3,16],[3,17,3,18],[11,3,14,3],[15,3,18,3],[4,11,5,12],[4,13,5,14],[26,9,27,10],[27,13,27,14],[25,3,25,10],[26,5,27,6],[26,7,27,8],[19,3,22,3],[4,3,6,3],[4,5,5,6],[4,7,5,8],[4,9,5,10],[28,3,28,4],[35,6,36,7],[43,3,45,4],[43,5,44,6],[45,5,45,6],[29,3,29,4],[30,3,30,4],[31,3,31,4],[32,3,32,4],[35,3,36,3],[35,4,36,5]]}
["NSCPDPF",null,null,null,null,null,null,null,null,null,null,null,null,null,null,null,null,null,{"$error":"#REF!"}]
["NSCPDPn",null,null,"Nightsave Urban Small Critical Peak Day tariff",null,null,null,null,null,null,null,null,null,null,null,null,null,"Non-local authority"]
[0,1,null,null,"N"]
[1,2,null,null,null,"Active energy charge [c/kWh] NON-CRITICAL PEAK DAY rates for 348 NORMAL days ",null,null,null,"Active energy charge [c/kWh] CRITICAL PEAK DAY rates for 17 CRITICAL PEAK days ",null,null,null,"Energy demand charge [R/kVA/m]*",null,null,null,"Transmission network charges [R/kVA/m]*"]
[2,3,null,"Transmission zone",null,"High demand season \n[Jun - Aug]",null,"Low demand season \n[Sep - May]",null,"High demand season \n[Jun - Aug]",null,"Low demand season \n[Sep - May]",null,"High demand season \n[Jun - Aug]",null,"Low demand season \n[Sep - May]"]
[3,4,null,null,"Voltage"]
[null,null,null,null,null,"","VAT incl",null,"VAT incl","","VAT incl",null,"VAT incl","","VAT incl",null,"VAT incl",null,"VAT incl"]
[{"$f":"$A$2&$A$3&$B$3&$E$3","v":"NSCPDPn01N"},{"$f":"$A$1&$A$3&$B$3&$E$3","v":"NSCPDPF01N"},null,"≤ 300km","< 500V",51.67,{"$f":"ROUND(F8 * (1 + VAT), 2)","v":58.9},40.17,{"$f":"ROUND(H8 * (1 + VAT), 2)","v":45.79},295.08,{"$f":"ROUND(J8 * (1 + VAT), 2)","v":336.39},283.58,{"$f":"ROUND(L8 * (1 + VAT), 2)","v":323.27999999999997},131.38999999999999,{"$f":"ROUND(N8 * (1 + VAT), 2)","v":149.78},16.93,{"$f":"ROUND(P8 * (1 + VAT), 2)","v":19.3},7.12,{"$f":"ROUND(R8 * (1 + VAT), 2)","v":8.1199999999999992}]
[{"$f":"$A$2&$A$3&$B$4&$E$3","v":"NSCPDPn02N"},{"$f":"$A$1&$A$3&$B$4&$E$3","v":"NSCPDPF02N"},null,null,"≥ 500V & < 66kV",48.93,55.78,38.19,43.54,292.33999999999997,333.27,281.60000000000002,321.02,127.16,144.96,16.36,18.649999999999999,6.51,7.42]
[{"$f":"$A$2&$A$3&$B$5&$E$3","v":"NSCPDPn03N"},{"$f":"$A$1&$A$3&$B$5&$E$3","v":"NSCPDPF03N"},null,null,"≥ 66kV & ≤ 132kV",48.57,55.37,37.729999999999997,43.01,291.98,332.86,281.14,320.5,122.48,139.63,15.75,17.96,6.34,7.23]
[{"$f":"$A$2&$A$3&$B$6&$E$3","v":"NSCPDPn04N"},{"$f":"$A$1&$A$3&$B$6&$E$3","v":"NSCPDPF04N"},null,null,"> 132kV*",45.44,51.8,35.340000000000003,40.29,288.85000000000002,329.29,278.75,317.77999999999997,118.2,134.75,15.2,17.329999999999998,8.01,9.1300000000000008]
[{"$f":"$A$2&$A$4&$B$3&$E$3","v":"NSCPDPn11N"},{"$f":"$A$1&$A$4&$B$3&$E$3","v":"NSCPDPF11N"},null,"> 300km and \n≤ 600km","< 500V",52.36,59.69,40.6,46.28,295.77,337.18,284.01,323.77,132.72999999999999,151.31,17.07,19.46,7.18,8.19]
[{"$f":"$A$2&$A$4&$B$4&$E$3","v":"NSCPDPn12N"},{"$f":"$A$1&$A$4&$B$4&$E$3","v":"NSCPDPF12N"},null,null,"≥ 500V & < 66kV",49.96,56.95,38.97,44.43,293.37,334.44,282.38,321.91000000000003,128.44,146.41999999999999,16.52,18.829999999999998,6.57,7.49]
[{"$f":"$A$2&$A$4&$B$5&$E$3","v":"NSCPDPn13N"},{"$f":"$A$1&$A$4&$B$5&$E$3","v":"NSCPDPF13N"},null,null,"≥ 66kV & ≤ 132kV",49.58,56.52,38.49,43.88,292.99,334.01,281.91000000000003,321.38,123.74,141.06,15.92,18.149999999999999,6.39,7.28]
[{"$f":"$A$2&$A$4&$B$6&$E$3","v":"NSCPDPn14N"},{"$f":"$A$1&$A$4&$B$6&$E$3","v":"NSCPDPF14N"},null,null,"> 132kV*",46.38,52.87,36.049999999999997,41.1,289.79000000000002,330.36,279.45999999999998,318.58,119.38,136.09,15.36,17.510000000000002,8.09,9.2200000000000006]
[{"$f":"$A$2&$A$5&$B$3&$E$3","v":"NSCPDPn21N"},{"$f":"$A$1&$A$5&$B$3&$E$3","v":"NSCPDPF21N"},null,"> 600km and \n≤ 900km","< 500V",52.85,60.25,41.01,46.75,296.26,337.74,284.42,324.24,134.03,152.79,17.23,19.64,7.27,8.2899999999999991]
[{"$f":"$A$2&$A$5&$B$4&$E$3","v":"NSCPDPn22N"},{"$f":"$A$1&$A$5&$B$4&$E$3","v":"NSCPDPF22N"},null,null,"≥ 500V & < 66kV",50.45,57.51,39.36,44.87,293.86,335,282.77,322.36,129.75,147.91999999999999,16.690000000000001,19.03,6.63,7.56]
[{"$f":"$A$2&$A$5&$B$5&$E$3","v":"NSCPDPn23N"},{"$f":"$A$1&$A$5&$B$5&$E$3","v":"NSCPDPF23N"},null,null,"≥ 66kV & ≤ 132kV",50.08,57.09,38.89,44.33,293.49,334.58,282.3,321.82,124.98,142.47999999999999,16.079999999999998,18.329999999999998,6.43,7.33]
[{"$f":"$A$2&$A$5&$B$6&$E$3","v":"NSCPDPn24N"},{"$f":"$A$1&$A$5&$B$6&$E$3","v":"NSCPDPF24N"},null,null,"> 132kV*",46.85,53.41,36.42,41.52,290.26,330.9,279.83,319.01,120.56,137.44,15.51,17.68,8.1999999999999993,9.35]
[{"$f":"$A$2&$A$6&$B$3&$E$3","v":"NSCPDPn31N"},{"$f":"$A$1&$A$6&$B$3&$E$3","v":"NSCPDPF31N"},null,"> 900km","< 500V",53.42,60.9,41.42,47.22,296.83,338.39,284.83999999999997,324.72000000000003,135.4,154.36000000000001,17.41,19.850000000000001,7.29,8.31]
[{"$f":"$A$2&$A$6&$B$4&$E$3","v":"NSCPDPn32N"},{"$f":"$A$1&$A$6&$B$4&$E$3","v":"NSCPDPF32N"},null,null,"≥ 500V & < 66kV",50.95,58.08,39.75,45.32,294.36,335.57,283.16000000000003,322.8,131.02000000000001,149.36000000000001,16.86,19.22,6.71,7.65]
[{"$f":"$A$2&$A$6&$B$5&$E$3","v":"NSCPDPn33N"},{"$f":"$A$1&$A$6&$B$5&$E$3","v":"NSCPDPF33N"},null,null,"≥ 66kV & ≤ 132kV",50.59,57.67,39.270000000000003,44.77,294,335.16,282.68,322.26,126.26,143.94,16.25,18.53,6.48,7.39]
[{"$f":"$A$2&$A$6&$B$6&$E$3","v":"NSCPDPn34N"},{"$f":"$A$1&$A$6&$B$6&$E$3","v":"NSCPDPF34N"},null,null,"> 132kV*",47.34,53.97,36.82,41.97,290.75,331.46,280.23,319.45999999999998,121.82,138.87,15.69,17.89,8.26,9.42]
[null,null,null,null,"* 132 kV or Transmission connected"]
[]
[null,null,null,"Distribution network charges*"]
[null,null,null,null,null,"Network capacity charge*\n[R/kVA/m]",null,"Network demand charge* \n[R/kVA/m]",null,"Urban low voltage subsidy charge [R/kVA/m]*"]
[null,null,null,null,null,null,null,null,null,null,null,null,null,"Ancillary service charge [c/kWh]*"]
[null,null,null,"Voltage",null,null,"VAT incl",null,"VAT incl",null,"VAT incl",null,"Voltage",null,"VAT incl"]
[{"$f":"$A$2&$A$3&$B$3&$E$3","v":"NSCPDPn01N"},null,null,"< 500V",null,14.15,{"$f":"ROUND(F30 * (1 + VAT), 2)","v":16.13},26.83,{"$f":"ROUND(H30 * (1 + VAT), 2)","v":30.59},0,{"$f":"ROUND(J30 * (1 + VAT), 2)","v":0},null,"< 500V",0.33,{"$f":"ROUND(N30 * (1 + VAT), 2)","v":0.38}]
[{"$f":"$A$2&$A$3&$B$4&$E$3","v":"NSCPDPn02N"},null,null,"≥ 500V & < 66kV",null,12.98,{"$f":"ROUND(F31 * (1 + VAT), 2)","v":14.8},24.62,{"$f":"ROUND(H31 * (1 + VAT), 2)","v":28.07},0,{"$f":"ROUND(J31 * (1 + VAT), 2)","v":0},null,"≥ 500V & < 66kV",0.32,{"$f":"ROUND(N31 * (1 + VAT), 2)","v":0.36}]
[{"$f":"$A$2&$A$3&$B$5&$E$3","v":"NSCPDPn03N"},null,null,"≥ 66kV & ≤ 132kV",null,4.63,{"$f":"ROUND(F32 * (1 + VAT), 2)","v":5.28},8.58,{"$f":"ROUND(H32 * (1 + VAT), 2)","v":9.7799999999999994},11.43,{"$f":"ROUND(J32 * (1 + VAT), 2)","v":13.03},null,"≥ 66kV & ≤ 132kV",0.3,{"$f":"ROUND(N32 * (1 + VAT), 2)","v":0.34}]
[{"$f":"$A$2&$A$3&$B$6&$E$3","v":"NSCPDPn04N"},null,null,"> 132kV / Transmission connected",null,0,{"$f":"ROUND(F33 * (1 + VAT), 2)","v":0},0,{"$f":"ROUND(H33 * (1 + VAT), 2)","v":0},11.43,{"$f":"ROUND(J33 * (1 + VAT), 2)","v":13.03},null,"> 132kV / Transmission connected",0.28000000000000003,{"$f":"ROUND(N33 * (1 + VAT), 2)","v":0.32}]
[]
[]
[null,null,null,"Customer categories","Service charge  [R/account/day]*",null,"Administration charge  [R/POD/day]*"]
[]
[null,null,null,null,null,"VAT incl",null,"VAT incl"]
[{"$f":"$A$2&$A$3&$B$3&$E$3","v":"NSCPDPn01N"},null,null,"≤ 100 kVA",11.55,{"$f":"ROUND(E39 * (1 + VAT), 2)","v":13.17},2.54,{"$f":"ROUND(G39 * (1 + VAT), 2)","v":2.9}]
[{"$f":"$A$2&$A$3&$B$4&$E$3","v":"NSCPDPn02N"},null,null,"> 100 kVA & ≤ 500 kVA",52.8,{"$f":"ROUND(E40 * (1 + VAT), 2)","v":60.19},14.8,{"$f":"ROUND(G40 * (1 + VAT), 2)","v":16.87}]
[{"$f":"$A$2&$A$3&$B$5&$E$3","v":"NSCPDPn03N"},null,null,"> 500 kVA & ≤ 1 MVA",162.47999999999999,{"$f":"ROUND(E41 * (1 + VAT), 2)","v":185.23},29.41,{"$f":"ROUND(G41 * (1 + VAT), 2)","v":33.53}]
[{"$f":"$A$2&$A$3&$B$6&$E$3","v":"NSCPDPn04N"},null,null,"Key customers",3183.88,{"$f":"ROUND(E42 * (1 + VAT), 2)","v":3629.62},101.68,{"$f":"ROUND(G42 * (1 + VAT), 2)","v":115.92}]
[]
[null,null,null,"Electrification and rural network subsidy charge  [c/kWh]*",null,"Affordability subsidy charge [c/kWh] payable by non-local authority tariffs*"]
[]
[null,null,null,null,null,"All seasons"]
[null,null,null,null,"VAT incl",null,"VAT incl"]
[{"$f":"$A$2&$A$3&$B$3&$E$3","v":"NSCPDPn01N"},null,null,6.33,{"$f":"ROUND(D48 * (1 + VAT), 2)","v":7.22},2.44,{"$f":"ROUND(F48 * (1 + VAT), 2)","v":2.78}]
[]
[]
[null,null,null,"*These charges are the same as the standard tariff and remain unchanged."]

{"sheet":"Ruraflex CPD","index":35,"n_rows":36,"n_cols":31,"rows_kept":36,"cut":false,"hidden":false,"merged":[[31,3,31,4],[31,10,31,11],[31,12,31,13],[32,3,32,4],[27,3,27,4],[27,10,27,11],[28,3,28,4],[28,10,28,11],[29,3,29,4],[30,3,30,4],[30,10,30,13],[25,3,26,4],[25,5,26,6],[25,7,26,8],[25,12,25,13],[25,14,25,15],[26,10,26,11],[19,3,22,3],[5,13,5,14],[5,15,5,16],[5,17,5,18],[5,19,5,20],[4,3,6,3],[4,5,4,10],[4,11,4,16],[4,17,4,22],[7,3,10,3],[11,3,14,3],[15,3,18,3],[5,21,5,22],[4,23,4,28],[4,29,5,30],[5,5,5,6],[5,7,5,8],[5,9,5,10],[5,11,5,12],[5,25,5,26],[5,27,5,28],[5,23,5,24],[0,2,0,4],[1,3,1,12],[1,13,1,14],[1,15,1,30],[3,5,3,16],[3,17,3,28],[3,29,3,30]]}
["RuCPDPF",null,"Back to menu",null,null,null,null,null,null,null,null,null,null,null,null,null,null,null,null,null,null,null,null,null,null,null,null,null,null,null,{"$error":"#REF!"}]
["RuCPDPn",null,null,"Ruraflex Critical Peak Day tariff ",null,null,null,null,null,null,null,null,null,null,null,"Non-local authority"]
[0,1,null,null,"N"]
[1,2,null,null,null,"Active energy charge [c/kWh] NON-CRITICAL PEAK DAY rates for 348 NORMAL days ",null,null,null,null,null,null,null,null,null,null,null,"Active energy charge [c/kWh] CRITICAL PEAK DAY rates for 17 CRITICAL PEAK days ",null,null,null,null,null,null,null,null,null,null,null,"Network capacity charges [R/kVA/m]*"]
[2,3,null,"Transmission zone",null,"High demand season [Jun - Aug]",null,null,null,null,null,"Low demand season [Sep - May]",null,null,null,null,null,"High demand season [Jun - Aug]",null,null,null,null,null,"Low demand season [Sep - May]"]
[3,4,null,null,"Voltage","Peak",null,"Standard",null,"Off Peak",null,"Peak",null,"Standard",null,"Off Peak",null,"Peak",null,"Standard",null,"Off Peak",null,"Peak",null,"Standard",null,"Off Peak"]
[null,null,null,null,null,"","VAT incl",null,"VAT incl",null,"VAT incl",null,"VAT incl",null,"VAT incl",null,"VAT incl","","VAT incl",null,"VAT incl",null,"VAT incl",null,"VAT incl",null,"VAT incl",null,"VAT incl",null,"VAT incl"]
[{"$f":"$A$2&$A$3&$B$3&$E$3","v":"RuCPDPn01N"},{"$f":"$A$1&$A$3&$B$3&$E$3","v":"RuCPDPF01N"},null,"≤ 300km","< 500V",209.9,{"$f":"ROUND(F8 * (1 + VAT), 2)","v":239.29},63.59,{"$f":"ROUND(H8 * (1 + VAT), 2)","v":72.489999999999995},42.41,{"$f":"ROUND(J8 * (1 + VAT), 2)","v":48.35},68.47,{"$f":"ROUND(L8 * (1 + VAT), 2)","v":78.06},47.13,{"$f":"ROUND(N8 * (1 + VAT), 2)","v":53.73},36.71,{"$f":"ROUND(P8 * (1 + VAT), 2)","v":41.85},453.31,{"$f":"ROUND(R8 * (1 + VAT), 2)","v":516.77},307,{"$f":"ROUND(T8 * (1 + VAT), 2)","v":349.98},42.41,{"$f":"ROUND(V8 * (1 + VAT), 2)","v":48.35},311.88,{"$f":"ROUND(X8 * (1 + VAT), 2)","v":355.54},290.54000000000002,{"$f":"ROUND(Z8 * (1 + VAT), 2)","v":331.22},36.71,{"$f":"ROUND(AB8 * (1 + VAT), 2)","v":41.85},14.88,{"$f":"ROUND(AD8 * (1 + VAT), 2)","v":16.96}]
[{"$f":"$A$2&$A$3&$B$4&$E$3","v":"RuCPDPn02N"},{"$f":"$A$1&$A$3&$B$4&$E$3","v":"RuCPDPF02N"},null,null,"≥ 500V & ≤ 22kV",207.81,236.9,62.96,71.77,41.98,47.86,67.790000000000006,77.28,46.64,53.17,36.340000000000003,41.43,451.22,514.39,306.37,349.26,41.98,47.86,311.2,354.77,290.05,330.66,36.340000000000003,41.43,13.64,15.55]
[{"$f":"$A$2&$A$3&$B$5&$E$3","v":"RuCPDPn03N"},{"$f":"$A$1&$A$3&$B$5&$E$3","v":"RuCPDPF03N"},null,null,null,0,null,0,null,0,null,0,null,0,null,0,null,0,null,0,null,0,null,0,null,0,null,0,null,0]
[{"$f":"$A$2&$A$3&$B$6&$E$3","v":"RuCPDPn04N"},{"$f":"$A$1&$A$3&$B$6&$E$3","v":"RuCPDPF04N"},null,null,null,0,null,0,null,0,null,0,null,0,null,0,null,0,null,0,null,0,null,0,null,0,null,0,null,0]
[{"$f":"$A$2&$A$4&$B$3&$E$3","v":"RuCPDPn11N"},{"$f":"$A$1&$A$4&$B$3&$E$3","v":"RuCPDPF11N"},null,"> 300km and \n≤ 600km","< 500V",211.99,241.67,64.22,73.209999999999994,42.83,48.83,69.150000000000006,78.83,47.6,54.26,37.090000000000003,42.28,455.4,{"$f":"ROUND(R12 * (1 + VAT), 2)","v":519.16},307.63,{"$f":"ROUND(T12 * (1 + VAT), 2)","v":350.7},42.83,{"$f":"ROUND(V12 * (1 + VAT), 2)","v":48.83},312.56,{"$f":"ROUND(X12 * (1 + VAT), 2)","v":356.32},291.01,{"$f":"ROUND(Z12 * (1 + VAT), 2)","v":331.75},37.090000000000003,{"$f":"ROUND(AB12 * (1 + VAT), 2)","v":42.28},14.93,17.02]
[{"$f":"$A$2&$A$4&$B$4&$E$3","v":"RuCPDPn12N"},{"$f":"$A$1&$A$4&$B$4&$E$3","v":"RuCPDPF12N"},null,null,"≥ 500V & ≤ 22kV",209.89,239.27,63.58,72.48,42.41,48.35,68.47,78.06,47.12,53.72,36.71,41.85,453.3,516.76,306.99,349.97,42.41,48.35,311.88,355.54,290.52999999999997,331.2,36.71,41.85,13.73,15.65]
[{"$f":"$A$2&$A$4&$B$5&$E$3","v":"RuCPDPn13N"},{"$f":"$A$1&$A$4&$B$5&$E$3","v":"RuCPDPF13N"},null,null,null,0,null,0,null,0,null,0,null,0,null,0,null,0,null,0,null,0,null,0,null,0,null,0,null,0]
[{"$f":"$A$2&$A$4&$B$6&$E$3","v":"RuCPDPn14N"},{"$f":"$A$1&$A$4&$B$6&$E$3","v":"RuCPDPF14N"},null,null,null,0,null,0,null,0,null,0,null,0,null,0,null,0,null,0,null,0,null,0,null,0,null,0,null,0]
[{"$f":"$A$2&$A$5&$B$3&$E$3","v":"RuCPDPn21N"},{"$f":"$A$1&$A$5&$B$3&$E$3","v":"RuCPDPF21N"},null,"> 600km and \n≤ 900km","< 500V",214.11,244.09,64.86,73.94,43.25,49.31,69.849999999999994,79.63,48.06,54.79,37.46,42.7,457.52,{"$f":"ROUND(R16 * (1 + VAT), 2)","v":521.57000000000005},308.27,{"$f":"ROUND(T16 * (1 + VAT), 2)","v":351.43},43.25,{"$f":"ROUND(V16 * (1 + VAT), 2)","v":49.31},313.26,{"$f":"ROUND(X16 * (1 + VAT), 2)","v":357.12},291.47000000000003,{"$f":"ROUND(Z16 * (1 + VAT), 2)","v":332.28},37.46,{"$f":"ROUND(AB16 * (1 + VAT), 2)","v":42.7},15.01,17.11]
[{"$f":"$A$2&$A$5&$B$4&$E$3","v":"RuCPDPn22N"},{"$f":"$A$1&$A$5&$B$4&$E$3","v":"RuCPDPF22N"},null,null,"≥ 500V & ≤ 22kV",211.98,241.66,64.209999999999994,73.2,42.83,48.83,69.150000000000006,78.83,47.6,54.26,37.090000000000003,42.28,455.39,519.14,307.62,350.69,42.83,48.83,312.56,356.32,291.01,331.75,37.090000000000003,42.28,13.78,15.71]
[{"$f":"$A$2&$A$5&$B$5&$E$3","v":"RuCPDPn23N"},{"$f":"$A$1&$A$5&$B$5&$E$3","v":"RuCPDPF23N"},null,null,null,0,null,0,null,0,null,0,null,0,null,0,null,0,null,0,null,0,null,0,null,0,null,0,null,0]
[{"$f":"$A$2&$A$5&$B$6&$E$3","v":"RuCPDPn24N"},{"$f":"$A$1&$A$5&$B$6&$E$3","v":"RuCPDPF24N"},null,null,null,0,null,0,null,0,null,0,null,0,null,0,null,0,null,0,null,0,null,0,null,0,null,0,null,0]
[{"$f":"$A$2&$A$6&$B$3&$E$3","v":"RuCPDPn31N"},{"$f":"$A$1&$A$6&$B$3&$E$3","v":"RuCPDPF31N"},null,"> 900km","< 500V",216.24,246.51,65.52,74.69,43.68,49.8,70.540000000000006,80.42,48.55,55.35,37.83,43.13,459.65,{"$f":"ROUND(R20 * (1 + VAT), 2)","v":524},308.93,{"$f":"ROUND(T20 * (1 + VAT), 2)","v":352.18},43.68,{"$f":"ROUND(V20 * (1 + VAT), 2)","v":49.8},313.95,{"$f":"ROUND(X20 * (1 + VAT), 2)","v":357.9},291.95999999999998,{"$f":"ROUND(Z20 * (1 + VAT), 2)","v":332.83},37.83,{"$f":"ROUND(AB20 * (1 + VAT), 2)","v":43.13},15.07,17.18]
[{"$f":"$A$2&$A$6&$B$4&$E$3","v":"RuCPDPn32N"},{"$f":"$A$1&$A$6&$B$4&$E$3","v":"RuCPDPF32N"},null,null,"≥ 500V & ≤ 22kV",214.1,244.07,64.86,73.94,43.25,49.31,69.849999999999994,79.63,48.06,54.79,37.46,42.7,457.51,521.55999999999995,308.27,351.43,43.25,49.31,313.26,357.12,291.47000000000003,332.28,37.46,42.7,13.79,15.72]
[{"$f":"$A$2&$A$6&$B$5&$E$3","v":"RuCPDPn33N"},{"$f":"$A$1&$A$6&$B$5&$E$3","v":"RuCPDPF33N"},null,null,null,0,null,0,null,0,null,0,null,0,null,0,null,0,null,0,null,0,null,0,null,0,null,0,null,0]
[{"$f":"$A$2&$A$6&$B$6&$E$3","v":"RuCPDPn34N"},{"$f":"$A$1&$A$6&$B$6&$E$3","v":"RuCPDPF34N"},null,null,null,0,null,0,null,0,null,0,null,0,null,0,null,0,null,0,null,0,null,0,null,0,null,0,null,0]
[]
[]
[null,null,null,"Customer categories",null,"Service charge  [R/account/day]*",null,"Administration charge  [R/POD/day]*",null,null,null,null,"Ancillary service charge [c/kWh]*",null,"Network demand charge [c/kWh]*        \n     [All time of use periods]"]
[null,null,null,null,null,null,null,null,null,null,"Voltage",null,null,"VAT incl",null,"VAT incl"]
[{"$f":"$A$2&$A$3&$B$3&$E$3","v":"RuCPDPn01N"},null,null,null,null,null,"VAT incl",null,"VAT incl",null,"< 500V",null,0.33,{"$f":"ROUND(M28 * (1 + VAT), 2)","v":0.38},21.19,{"$f":"ROUND(O28 * (1 + VAT), 2)","v":24.16}]
[{"$f":"$A$2&$A$3&$B$4&$E$3","v":"RuCPDPn02N"},null,null,"≤ 100 kVA",null,14.64,{"$f":"ROUND(F29 * (1 + VAT), 2)","v":16.690000000000001},4.16,{"$f":"ROUND(H29 * (1 + VAT), 2)","v":4.74},null,"≥ 500V & < 22kV",null,0.33,{"$f":"ROUND(M29 * (1 + VAT), 2)","v":0.38},18.57,{"$f":"ROUND(O29 * (1 + VAT), 2)","v":21.17}]
[{"$f":"$A$2&$A$3&$B$4&$E$3","v":"RuCPDPn02N"},null,null,"> 100 kVA & ≤ 500 kVA",null,49.94,{"$f":"ROUND(F30 * (1 + VAT), 2)","v":56.93},23.15,{"$f":"ROUND(H30 * (1 + VAT), 2)","v":26.39}]
["RuCPDPn02N",null,null,"> 500 kVA & ≤ 1 MVA",null,153.63,{"$f":"ROUND(F31 * (1 + VAT), 2)","v":175.14},35.53,{"$f":"ROUND(H31 * (1 + VAT), 2)","v":40.5},null,"Reactive energy charge  [c/kVArh]*"]
["RuCPDPn02N",null,null,"> 1 MVA",null,153.63,{"$f":"ROUND(F32 * (1 + VAT), 2)","v":175.14},65.930000000000007,{"$f":"ROUND(H32 * (1 + VAT), 2)","v":75.16},null,"High season",null,"Low season"]
["RuCPDPn02N",null,null,"Key customers",null,3010.96,{"$f":"ROUND(F33 * (1 + VAT), 2)","v":3432.49},65.930000000000007,{"$f":"ROUND(H33 * (1 + VAT), 2)","v":75.16},null,null,"VAT incl",null,"VAT incl"]
[{"$f":"$A$2&$A$3&$B$3&$E$3","v":"RuCPDPn01N"},null,null,null,null,null,null,null,null,null,7.16,{"$f":"ROUND(K34 * (1 + VAT), 2)","v":8.16},0,{"$f":"ROUND(M34 * (1 + VAT), 2)","v":0}]
[]
[null,null,"*These charges are the same as the standard tariff and remain unchanged."]

{"sheet":"Nightsave Rural CPD","index":36,"n_rows":35,"n_cols":33,"rows_kept":35,"cut":false,"hidden":false,"merged":[[29,11,29,12],[29,13,29,14],[30,3,30,4],[31,3,31,4],[32,3,32,4],[29,3,29,4],[25,3,26,4],[25,5,26,6],[25,7,26,8],[27,3,27,4],[28,3,28,4],[4,15,5,16],[4,17,5,18],[7,3,10,3],[11,3,14,3],[15,3,18,3],[4,11,5,12],[4,13,5,14],[19,3,22,3],[4,3,6,3],[4,5,5,6],[4,7,5,8],[4,9,5,10],[0,2,0,4],[1,3,1,12],[1,17,1,18],[3,5,3,8],[3,9,3,12],[3,13,3,16],[3,17,3,18]]}
["NRCPDPF",null,"Back to menu",null,null,null,null,null,null,null,null,null,null,null,null,null,null,null,{"$error":"#REF!"}]
["NRCPDPn",null,null,"Nightsave Rural Critical Peak Day tariff ",null,null,null,null,null,null,null,null,null,null,null,null,null,"Non-local authority",null,null,null,null,null,null,null,null,null,null,null,null,null,{"$f":"SUM(#REF!,#REF!,#REF!,#REF!,#REF!,#REF!,#REF!,#REF!,#REF!,#REF!,#REF!,#REF!,#REF!,#REF!,#REF!)","v":{"$error":"#REF!"}},"check value"]
[0,1,null,null,"N"]
[1,2,null,null,null,"Active energy charge [c/kWh] NON-CRITICAL PEAK DAY rates for 348 NORMAL days ",null,null,null,"Active energy charge [c/kWh] CRITICAL PEAK DAY rates for 17 CRITICAL PEAK days ",null,null,null,"Energy demand charges [R/kVA/m]*",null,null,null,"Network capacity charges [R/kVA/m]*"]
[2,3,null,"Transmission zone",null,"High demand season \n[Jun - Aug]",null,"Low demand season \n[Sep - May]",null,"High demand season \n[Jun - Aug]",null,"Low demand season \n[Sep - May]",null,"High demand season \n[Jun - Aug]",null,"Low demand season \n[Sep - May]"]
[3,4,null,null,"Voltage"]
[null,null,null,null,null,"","VAT incl",null,"VAT incl","","VAT incl",null,"VAT incl","","VAT incl",null,"VAT incl",null,"VAT incl"]
[{"$f":"$A$2&$A$3&$B$3&$E$3","v":"NRCPDPn01N"},{"$f":"$A$1&$A$3&$B$3&$E$3","v":"NRCPDPF01N"},null,"≤ 300km","< 500V",53.14,{"$f":"ROUND(F8 * (1 + VAT), 2)","v":60.58},41.3,{"$f":"ROUND(H8 * (1 + VAT), 2)","v":47.08},296.56,{"$f":"ROUND(J8 * (1 + VAT), 2)","v":338.08},284.70999999999998,{"$f":"ROUND(L8 * (1 + VAT), 2)","v":324.57},210.66,{"$f":"ROUND(N8 * (1 + VAT), 2)","v":240.15},111.5,{"$f":"ROUND(P8 * (1 + VAT), 2)","v":127.11},10.65,{"$f":"ROUND(R8 * (1 + VAT), 2)","v":12.14}]
[{"$f":"$A$2&$A$3&$B$4&$E$3","v":"NRCPDPn02N"},{"$f":"$A$1&$A$3&$B$4&$E$3","v":"NRCPDPF02N"},null,null,"≥ 500V & ≤ 22kV",52.52,59.87,40.840000000000003,46.56,295.94,337.37,284.25,324.05,204.13,232.71,107.53,122.58,9.7799999999999994,11.15]
[{"$f":"$A$2&$A$3&$B$5&$E$3","v":"NRCPDPn03N"},{"$f":"$A$1&$A$3&$B$5&$E$3","v":"NRCPDPF03N"},null,null,null,0,null,0,null,0,null,0,null,0,null,0,null,0]
[{"$f":"$A$2&$A$3&$B$6&$E$3","v":"NRCPDPn04N"},{"$f":"$A$1&$A$3&$B$6&$E$3","v":"NRCPDPF04N"},null,null,null,0,null,0,null,0,null,0,null,0,null,0,null,0]
[{"$f":"$A$2&$A$4&$B$3&$E$3","v":"NRCPDPn11N"},{"$f":"$A$1&$A$4&$B$3&$E$3","v":"NRCPDPF11N"},null,"> 300km and \n≤ 600km","< 500V",53.67,61.18,41.71,47.55,297.08,{"$f":"ROUND(J12 * (1 + VAT), 2)","v":338.67},285.12,{"$f":"ROUND(L12 * (1 + VAT), 2)","v":325.04000000000002},213.2,243.05,113.04,128.87,10.68,12.18]
[{"$f":"$A$2&$A$4&$B$4&$E$3","v":"NRCPDPn12N"},{"$f":"$A$1&$A$4&$B$4&$E$3","v":"NRCPDPF12N"},null,null,"≥ 500V & ≤ 22kV",53.05,60.48,41.24,47.01,296.45999999999998,337.96,284.64999999999998,324.5,206.63,235.56,109.03,124.29,9.83,11.21]
[{"$f":"$A$2&$A$4&$B$5&$E$3","v":"NRCPDPn13N"},{"$f":"$A$1&$A$4&$B$5&$E$3","v":"NRCPDPF13N"},null,null,null,0,null,0,null,0,null,0,null,0,null,0,null,0]
[{"$f":"$A$2&$A$4&$B$6&$E$3","v":"NRCPDPn14N"},{"$f":"$A$1&$A$4&$B$6&$E$3","v":"NRCPDPF14N"},null,null,null,0,null,0,null,0,null,0,null,0,null,0,null,0]
[{"$f":"$A$2&$A$5&$B$3&$E$3","v":"NRCPDPn21N"},{"$f":"$A$1&$A$5&$B$3&$E$3","v":"NRCPDPF21N"},null,"> 600km and \n≤ 900km","< 500V",54.2,61.79,42.12,48.02,297.61,{"$f":"ROUND(J16 * (1 + VAT), 2)","v":339.28},285.52999999999997,{"$f":"ROUND(L16 * (1 + VAT), 2)","v":325.5},215.76,245.97,114.56,130.6,10.78,12.29]
[{"$f":"$A$2&$A$5&$B$4&$E$3","v":"NRCPDPn22N"},{"$f":"$A$1&$A$5&$B$4&$E$3","v":"NRCPDPF22N"},null,null,"≥ 500V & ≤ 22kV",53.57,61.07,41.66,47.49,296.98,338.56,285.07,324.98,209.1,238.37,110.54,126.02,9.89,11.27]
[{"$f":"$A$2&$A$5&$B$5&$E$3","v":"NRCPDPn23N"},{"$f":"$A$1&$A$5&$B$5&$E$3","v":"NRCPDPF23N"},null,null,null,0,null,0,null,0,null,0,null,0,null,0,null,0]
[{"$f":"$A$2&$A$5&$B$6&$E$3","v":"NRCPDPn24N"},{"$f":"$A$1&$A$5&$B$6&$E$3","v":"NRCPDPF24N"},null,null,null,0,null,0,null,0,null,0,null,0,null,0,null,0]
[{"$f":"$A$2&$A$6&$B$3&$E$3","v":"NRCPDPn31N"},{"$f":"$A$1&$A$6&$B$3&$E$3","v":"NRCPDPF31N"},null,"> 900km","< 500V",54.74,62.4,42.54,48.5,298.16000000000003,{"$f":"ROUND(J20 * (1 + VAT), 2)","v":339.9},285.95,{"$f":"ROUND(L20 * (1 + VAT), 2)","v":325.98},218.37,248.94,116.14,132.4,10.8,12.31]
[{"$f":"$A$2&$A$6&$B$4&$E$3","v":"NRCPDPn32N"},{"$f":"$A$1&$A$6&$B$4&$E$3","v":"NRCPDPF32N"},null,null,"≥ 500V & ≤ 22kV",54.09,61.66,42.06,47.95,297.5,339.15,285.47000000000003,325.44,211.65,241.28,112.08,127.77,9.91,11.3]
[null,null,null,null,null,0,null,0,null,0,null,0,null,0,null,0,null,0]
[null,null,null,null,null,0,null,0,null,0,null,0,null,0,null,0,null,0]
[]
[]
[null,null,null,"Customer categories",null,"Service charge  [R/account/day]*",null,"Administration charge  [R/POD/day]*"]
[]
[{"$f":"$A$2&$A$3&$B$3&$E$3","v":"NRCPDPn01N"},null,null,null,null,null,"VAT incl",null,"VAT incl"]
[{"$f":"$A$2&$A$3&$B$3&$E$3","v":"NRCPDPn01N"},null,null,"≤ 100 kVA",null,14.64,{"$f":"ROUND(F29 * (1 + VAT), 2)","v":16.690000000000001},4.16,{"$f":"ROUND(H29 * (1 + VAT), 2)","v":4.74}]
["NRCPDPn01N",null,null,"> 100 kVA & ≤ 500 kVA",null,49.94,{"$f":"ROUND(F30 * (1 + VAT), 2)","v":56.93},23.15,{"$f":"ROUND(H30 * (1 + VAT), 2)","v":26.39},null,null,"Ancillary service charge [c/kWh]*",null,"Network demand charge [c/kWh]*         \n       [All time of use periods]"]
["NRCPDPn01N",null,null,"> 500 kVA & ≤ 1 MVA",null,153.63,{"$f":"ROUND(F31 * (1 + VAT), 2)","v":175.14},35.53,{"$f":"ROUND(H31 * (1 + VAT), 2)","v":40.5},null,"Voltage",null,"VAT incl",null,"VAT incl"]
[{"$f":"$A$2&$A$3&$B$3&$E$3","v":"NRCPDPn01N"},null,null,"> 1 MVA",null,153.63,{"$f":"ROUND(F32 * (1 + VAT), 2)","v":175.14},65.930000000000007,{"$f":"ROUND(H32 * (1 + VAT), 2)","v":75.16},null,"< 500V",0.33,{"$f":"ROUND(L32 * (1 + VAT), 2)","v":0.38},21.19,{"$f":"ROUND(N32 * (1 + VAT), 2)","v":24.16}]
[{"$f":"$A$2&$A$3&$B$4&$E$3","v":"NRCPDPn02N"},null,null,"Key customers",null,3010.96,{"$f":"ROUND(F33 * (1 + VAT), 2)","v":3432.49},65.930000000000007,{"$f":"ROUND(H33 * (1 + VAT), 2)","v":75.16},null,"≥ 500V & ≤ 22kV",0.33,{"$f":"ROUND(L33 * (1 + VAT), 2)","v":0.38},18.57,{"$f":"ROUND(N33 * (1 + VAT), 2)","v":21.17}]
[]
[null,null,null,"*These charges are the same as the standard tariff and remain unchanged."]

{"sheet":"Env levy","index":37,"n_rows":22,"n_cols":7,"rows_kept":22,"cut":false,"hidden":true,"merged":[]}
[]
[null,"Urban"]
[null,"Ave c/kWh","Column Labels"]
[null,"Row Labels",0,1,2,3,"Grand Total"]
[null,1,4.2441734963618041,3.9229221124432589,3.9527382105199051,3.9951826601450668,4.2303256421082995]
[null,2,3.8186059651047737,3.8567920247728718,3.895359945114679,3.9343135444971589,3.8300318858177489]
[null,3,3.6978495999019296,3.7348280958939521,3.7721763768754322,3.8098981406339028,3.7495844042255713]
[null,4,3.4850235973906436,3.5198738333649109,3.5550725710602902,3.6325745024653484,3.4978362022439597]
[null,"Grand Total",3.7686931970332931,3.6664747565850311,3.7989660387480506,3.8482092095507561,3.7606121708915037]
[]
[null,"Rural pivot(excluding landrate)"]
[null,"Ave c/kWh","Column Labels"]
[null,"Row Labels",0,1,2,3,"Grand Total"]
[null,1,0,0,0,0,0]
[null,2,0,0,0,0,0]
[null,"Grand Total",0,0,0,0,0]
[]
[null,"Landrate"]
[null,"Ave c/kWh","Column Labels"]
[null,"Row Labels",0,"Grand Total"]
[null,1,0,0]
[null,"Grand Total",0,0]