{"text_format":"1","workbook":"xlsx","n_sheets":13,"sheets":["Menu","Inputs","Monthly Average Bill","Tariff Comparison","FAQ","Rates Table","Workings High","Workings Low","Rates SPU - New","Rates SPU - Current","Mapping","Lists","Notes on updates"],"not_rendered":{"charts":4,"images":2,"macros":1,"external_links":0,"defined_names":148,"comments":1,"pivot_tables":0},"unopened":[],"bounds":{"document_bytes":16777216,"sheet_cells":100000,"rows_first":2000,"rows_last":500,"rows_between":2000,"halvings":0,"cell_chars":16384,"cell_head_chars":4096},"cells_cut":0,"cells_raw":0,"read":"whole","date_system":"1900"}

{"sheet":"Menu","index":0,"n_rows":22,"n_cols":5,"rows_kept":22,"cut":false,"hidden":false,"merged":[[7,1,7,18],[21,3,21,4]]}
[]
[]
[]
[]
[]
[]
[]
[null,"Tariff Comparison Tool (TCT)\n2024/25 retail tariff plan"]
{"$rows_left_out":15}
{"sheet":"Inputs","index":1,"n_rows":42,"n_cols":19,"rows_kept":42,"cut":false,"hidden":false,"merged":[[42,15,42,17],[31,6,31,8],[7,6,7,7],[8,6,8,7],[9,6,9,7],[20,15,35,24],[22,3,22,6],[26,6,26,8],[26,9,26,11],[26,12,27,12],[34,6,34,8],[34,9,34,11]]}
[]
[null,null,null,null,null,null,null,null,null,null,null,null,null,null,null,null,null,null,"Version 6.12    7 August 2024"]
[]
[null,"Tariff Input Sheet"]
[]
[null,"Please enter the required information below:"]
[]
[null,null,null,"Customer Name",null,null,"Customer Name",null,"Enter the customer name as it is displayed on the rates bill."]
{"$rows_left_out":35}
{"sheet":"Monthly Average Bill","index":2,"n_rows":76,"n_cols":18,"rows_kept":76,"cut":false,"hidden":false,"merged":[[9,13,9,14],[9,5,9,6],[4,7,4,8],[4,16,4,17]]}
[]
[]
[]
[null,"Monthly Average Bill",null,null,null,null,null,null,{"$f":"D10","v":"Landrate 1"},null,{"$f":"B4","v":"Monthly Average Bill"},null,null,null,null,null,null,{"$f":"I4","v":"Landrate 1"}]
[null,null,null,null,null,null,null,{"$f":"IF(Dropdown_Category = 2, \"Proposed RTP tariff is \" & VLOOKUP(Selected_Base_Tariff, Mapping!$B$8:$D$34, 3, FALSE), \"\")","v":""},null,null,null,null,null,null,null,null,{"$f":"IF(Dropdown_Category = 2, \"Proposed RTP tariff is \" & VLOOKUP(Selected_Base_Tariff, Mapping!$B$8:$D$34, 3, FALSE), \"\")","v":""}]
[null,"High Demand",null,null,null,null,null,null,null,null,"Low Demand"]
[]
[null,"Customer Name",null,{"$f":"Customer_Name","v":"Customer Name"},null,null,null,null,null,null,{"$f":"B8","v":"Customer Name"},null,{"$f":"D8","v":"Customer Name"}]
{"$rows_left_out":69}
{"sheet":"Tariff Comparison","index":3,"n_rows":112,"n_cols":18,"rows_kept":112,"cut":false,"hidden":false,"merged":[[4,15,4,16]]}
[]
[null,null,null,null,null,null,null,"Please select tariffs from the dropdown boxes to set up the Comparison Report.\n"]
[]
[null,"Comparison against other tariffs High Demand",null,null,null,null,null,null,null,null,null,null,null,null,null,null,null,{"$f":"'Monthly Average Bill'!I4","v":"Landrate 1"}]
[null,null,null,null,null,null,null,{"$f":"IF(Dropdown_Category = 2, \"Proposed RTP tariff is \" & VLOOKUP(J6, Lists!$G$17:$H$37, 2, FALSE), \"\")","v":""},null,null,null,{"$f":"IF(Dropdown_Category = 2, \"Proposed RTP tariff is \" & VLOOKUP(N6, Lists!$G$17:$H$37, 2, FALSE), \"\")","v":""},null,null,null,{"$f":"IF(Dropdown_Category = 2, \"Proposed RTP tariff is \" & VLOOKUP(R6, Lists!$G$17:$H$37, 2, FALSE), \"\")","v":""}]
[null,null,null,null,null,null,null,1,null,{"$f":"MATCH(H8,Full_Tariff_List,0)","v":1},null,3,null,{"$f":"MATCH(L8,Full_Tariff_List,0)","v":10},null,2,null,{"$f":"MATCH(P8,Full_Tariff_List,0)","v":4}]
[]
[null,null,null,{"$f":"'Monthly Average Bill'!I4","v":"Landrate 1"},null,null,null,{"$f":"IFERROR(INDEX(Compare_Tariff_List,Dropdown_Compare_1),$D$8)","v":"Businessrate 1"},null,null,null,{"$f":"IFERROR(INDEX(Compare_Tariff_List,Dropdown_Compare_2),$D$8)","v":"Homepower 4"},null,null,null,{"$f":"IFERROR(INDEX(Compare_Tariff_List,Dropdown_Compare_3),$D$8)","v":"Businessrate 4"}]
{"$rows_left_out":105}
{"sheet":"FAQ","index":4,"n_rows":4,"n_cols":2,"rows_kept":4,"cut":false,"hidden":true,"merged":[]}
[]
[]
[]
[null,"Frequently Asked Questions"]

{"sheet":"Rates Table","index":5,"n_rows":53,"n_cols":57,"rows_kept":53,"cut":false,"hidden":true,"merged":[]}
[]
[]
[]
[null,"Rates by Tariff"]
[]
[null,"Tariffs",null,null,{"$f":"Selected_Base_Tariff","v":"Landrate 1"},{"$f":"INDEX(Full_Tariff_List,F$7,)","v":"Businessrate 1"},"Businessrate 2","Businessrate 3","Businessrate 4","Homelight 20A","Homelight 60A","Homepower 1","Homepower 2","Homepower 3","Homepower 4","Homepower Bulk","Landrate 1","Landrate 2","Landrate 3","Landrate 4","Landrate Dx","Landlight 20A","Landlight 60A","Public Lighting All Night","Public Lighting 24 Hours","Public Lighting Urban Fixed","Homeflex 1","Homeflex 2","Homeflex 3","Homeflex 4",null,{"$f":"E6","v":"Landrate 1"},"Businessrate 1","Businessrate 2","Businessrate 3","Businessrate 4","Homelight 20A","Homelight 60A","Homepower 1","Homepower 2","Homepower 3","Homepower 4","Homepower Bulk","Landrate 1","Landrate 2","Landrate 3","Landrate 4","Landrate Dx","Landlight 20A","Landlight 60A","Public Lighting All Night","Public Lighting 24 Hours","Public Lighting Urban Fixed","Homeflex 1","Homeflex 2","Homeflex 3","Homeflex 4"]
[null,null,null,null,null,1,{"$f":"F7+1","v":2},{"$f":"G7+1","v":3},4,5,6,7,8,9,10,11,12,13,14,15,{"$f":"T7+1","v":16},17,18,19,20,21,33,{"$f":"AA7+1","v":34},{"$f":"AB7+1","v":35},{"$f":"AC7+1","v":36}]
[null,"Network charges",null,"Units",{"$f":"Current_Period&\" Rates\"","v":"2024/25 Tariff Book Rates"},"2024/25 Tariff Book Rates","2024/25 Tariff Book Rates","2024/25 Tariff Book Rates","2024/25 Tariff Book Rates","2024/25 Tariff Book Rates","2024/25 Tariff Book Rates","2024/25 Tariff Book Rates","2024/25 Tariff Book Rates","2024/25 Tariff Book Rates","2024/25 Tariff Book Rates","2024/25 Tariff Book Rates","2024/25 Tariff Book Rates","2024/25 Tariff Book Rates","2024/25 Tariff Book Rates","2024/25 Tariff Book Rates","2024/25 Tariff Book Rates","2024/25 Tariff Book Rates","2024/25 Tariff Book Rates","2024/25 Tariff Book Rates","2024/25 Tariff Book Rates","2024/25 Tariff Book Rates","2024/25 Tariff Book Rates","2024/25 Tariff Book Rates","2024/25 Tariff Book Rates","2024/25 Tariff Book Rates",null,{"$f":"New_Period&\" Rates\"","v":"2024/25 RTP Rates"},{"$f":"AF8","v":"2024/25 RTP Rates"},{"$f":"AG8","v":"2024/25 RTP Rates"},"2024/25 RTP Rates","2024/25 RTP Rates","2024/25 RTP Rates","2024/25 RTP Rates","2024/25 RTP Rates","2024/25 RTP Rates","2024/25 RTP Rates","2024/25 RTP Rates","2024/25 RTP Rates","2024/25 RTP Rates","2024/25 RTP Rates","2024/25 RTP Rates","2024/25 RTP Rates",{"$f":"AU8","v":"2024/25 RTP Rates"},"2024/25 RTP Rates","2024/25 RTP Rates","2024/25 RTP Rates","2024/25 RTP Rates","2024/25 RTP Rates",{"$f":"AZ8","v":"2024/25 RTP Rates"},"2024/25 RTP Rates","2024/25 RTP Rates","2024/25 RTP Rates"]
{"$rows_left_out":46}
{"sheet":"Workings High","index":6,"n_rows":46,"n_cols":57,"rows_kept":46,"cut":false,"hidden":true,"merged":[]}
[]
[]
[]
[null,"Calculations by Tariff"]
[]
[null,"Tariffs",null,null,{"$f":"Selected_Base_Tariff","v":"Landrate 1"},{"$f":"INDEX(Full_Tariff_List,F$7,)","v":"Businessrate 1"},"Businessrate 2","Businessrate 3","Businessrate 4","Homelight 20A","Homelight 60A","Homepower 1","Homepower 2","Homepower 3","Homepower 4","Homepower Bulk","Landrate 1","Landrate 2","Landrate 3","Landrate 4","Landrate Dx","Landlight 20A","Landlight 60A","Public Lighting All Night","Public Lighting 24 Hours","Public Lighting Urban Fixed","Homeflex 1","Homeflex 2","Homeflex 3","Homeflex 4",null,{"$f":"E6","v":"Landrate 1"},"Businessrate 1","Businessrate 2","Businessrate 3","Businessrate 4","Homelight 20A","Homelight 60A","Homepower 1","Homepower 2","Homepower 3",{"$f":"O6","v":"Homepower 4"},"Homepower Bulk","Landrate 1","Landrate 2","Landrate 3","Landrate 4","Landrate Dx","Landlight 20A","Landlight 60A","Public Lighting All Night",{"$f":"Y6","v":"Public Lighting 24 Hours"},"Public Lighting Urban Fixed","Homeflex 1","Homeflex 2","Homeflex 3","Homeflex 4"]
[null,null,null,null,null,1,{"$f":"F7+1","v":2},{"$f":"G7+1","v":3},4,5,6,7,8,9,10,11,12,13,14,15,{"$f":"T7+1","v":16},17,18,19,20,21,33,{"$f":"AA7+1","v":34},{"$f":"AB7+1","v":35},{"$f":"AC7+1","v":36},null,0,1,2,3,4,5,6,7,8,9,10,11,12,13,14,15,16,17,18,19,20,21,33,34,35,36]
[null,"Network charges",null,"Units",{"$f":"Current_Period&\" Rates\"","v":"2024/25 Tariff Book Rates"},{"$f":"E8","v":"2024/25 Tariff Book Rates"},{"$f":"F8","v":"2024/25 Tariff Book Rates"},"2024/25 Tariff Book Rates","2024/25 Tariff Book Rates","2024/25 Tariff Book Rates","2024/25 Tariff Book Rates","2024/25 Tariff Book Rates","2024/25 Tariff Book Rates","2024/25 Tariff Book Rates","2024/25 Tariff Book Rates","2024/25 Tariff Book Rates","2024/25 Tariff Book Rates","2024/25 Tariff Book Rates","2024/25 Tariff Book Rates","2024/25 Tariff Book Rates",{"$f":"T8","v":"2024/25 Tariff Book Rates"},"2024/25 Tariff Book Rates","2024/25 Tariff Book Rates","2024/25 Tariff Book Rates","2024/25 Tariff Book Rates","2024/25 Tariff Book Rates",{"$f":"Y8","v":"2024/25 Tariff Book Rates"},"2024/25 Tariff Book Rates","2024/25 Tariff Book Rates","2024/25 Tariff Book Rates",null,{"$f":"New_Period&\" Rates\"","v":"2024/25 RTP Rates"},{"$f":"AF8","v":"2024/25 RTP Rates"},{"$f":"AG8","v":"2024/25 RTP Rates"},"2024/25 RTP Rates","2024/25 RTP Rates","2024/25 RTP Rates","2024/25 RTP Rates","2024/25 RTP Rates","2024/25 RTP Rates","2024/25 RTP Rates","2024/25 RTP Rates","2024/25 RTP Rates","2024/25 RTP Rates","2024/25 RTP Rates","2024/25 RTP Rates","2024/25 RTP Rates",{"$f":"AU8","v":"2024/25 RTP Rates"},"2024/25 RTP Rates","2024/25 RTP Rates","2024/25 RTP Rates","2024/25 RTP Rates","2024/25 RTP Rates",{"$f":"AZ8","v":"2024/25 RTP Rates"},"2024/25 RTP Rates","2024/25 RTP Rates","2024/25 RTP Rates"]
{"$rows_left_out":39}
{"sheet":"Workings Low","index":7,"n_rows":46,"n_cols":57,"rows_kept":46,"cut":false,"hidden":true,"merged":[]}
[]
[]
[]
[null,"Calculations by Tariff"]
[]
[null,"Tariffs",null,null,{"$f":"Selected_Base_Tariff","v":"Landrate 1"},{"$f":"INDEX(Full_Tariff_List,F$7,)","v":"Businessrate 1"},"Businessrate 2","Businessrate 3","Businessrate 4","Homelight 20A","Homelight 60A","Homepower 1","Homepower 2","Homepower 3","Homepower 4","Homepower Bulk","Landrate 1","Landrate 2","Landrate 3","Landrate 4","Landrate Dx","Landlight 20A","Landlight 60A","Public Lighting All Night","Public Lighting 24 Hours","Public Lighting Urban Fixed","Homeflex 1","Homeflex 2","Homeflex 3","Homeflex 4",null,{"$f":"E6","v":"Landrate 1"},"Businessrate 1","Businessrate 2","Businessrate 3","Businessrate 4","Homelight 20A","Homelight 60A","Homepower 1","Homepower 2","Homepower 3",{"$f":"O6","v":"Homepower 4"},"Homepower Bulk","Landrate 1","Landrate 2","Landrate 3","Landrate 4","Landrate Dx","Landlight 20A","Landlight 60A","Public Lighting All Night",{"$f":"Y6","v":"Public Lighting 24 Hours"},"Public Lighting Urban Fixed","Homeflex 1","Homeflex 2","Homeflex 3","Homeflex 4"]
[null,null,null,null,null,1,{"$f":"F7+1","v":2},{"$f":"G7+1","v":3},4,5,6,7,8,9,10,11,12,13,14,15,16,17,18,19,20,21,33,{"$f":"AA7+1","v":34},{"$f":"AB7+1","v":35},{"$f":"AC7+1","v":36},null,0,1,2,3,4,5,6,7,8,9,10,11,12,13,14,15,16,17,18,19,20,21,33,34,35,36]
[null,"Network charges",null,"Units",{"$f":"Current_Period&\" Rates\"","v":"2024/25 Tariff Book Rates"},{"$f":"E8","v":"2024/25 Tariff Book Rates"},{"$f":"F8","v":"2024/25 Tariff Book Rates"},"2024/25 Tariff Book Rates","2024/25 Tariff Book Rates","2024/25 Tariff Book Rates","2024/25 Tariff Book Rates","2024/25 Tariff Book Rates","2024/25 Tariff Book Rates","2024/25 Tariff Book Rates","2024/25 Tariff Book Rates","2024/25 Tariff Book Rates","2024/25 Tariff Book Rates","2024/25 Tariff Book Rates","2024/25 Tariff Book Rates","2024/25 Tariff Book Rates","2024/25 Tariff Book Rates","2024/25 Tariff Book Rates","2024/25 Tariff Book Rates","2024/25 Tariff Book Rates","2024/25 Tariff Book Rates","2024/25 Tariff Book Rates",{"$f":"Y8","v":"2024/25 Tariff Book Rates"},"2024/25 Tariff Book Rates","2024/25 Tariff Book Rates","2024/25 Tariff Book Rates",null,{"$f":"New_Period&\" Rates\"","v":"2024/25 RTP Rates"},{"$f":"AF8","v":"2024/25 RTP Rates"},{"$f":"AG8","v":"2024/25 RTP Rates"},"2024/25 RTP Rates","2024/25 RTP Rates","2024/25 RTP Rates","2024/25 RTP Rates","2024/25 RTP Rates","2024/25 RTP Rates","2024/25 RTP Rates","2024/25 RTP Rates","2024/25 RTP Rates","2024/25 RTP Rates","2024/25 RTP Rates","2024/25 RTP Rates","2024/25 RTP Rates","2024/25 RTP Rates","2024/25 RTP Rates","2024/25 RTP Rates","2024/25 RTP Rates","2024/25 RTP Rates","2024/25 RTP Rates",{"$f":"AZ8","v":"2024/25 RTP Rates"},"2024/25 RTP Rates","2024/25 RTP Rates","2024/25 RTP Rates"]
{"$rows_left_out":39}
{"sheet":"Rates SPU - New","index":8,"n_rows":51,"n_cols":29,"rows_kept":51,"cut":false,"hidden":true,"merged":[]}
[]
[]
[]
[null,null,{"$f":"\"Small Power User | Tariff Inputs | \"&New_Period","v":"Small Power User | Tariff Inputs | 2024/25 RTP"}]
[null,null,null,null,null,null,null,null,null,null,null,null,null,null,null,null,null,null,null,null,"Dx NAC"]
[null,null,"Rates - All Other",null,null,null,null,null,"kWhHP","kWhHS","kWhHO","kWhLP","kWhLS","kWhLO","kWhRBlock1","kWhRBlock4","kWhHP","Reliab","DxNDC Energy","DxNDC Energy","NAC POD","SerS",null,"ERS","GCC","Legacy"]
[null,null,"Tariff","Tariff Category","Type","Column1","Code","Matrix Code","High - Peak","High - Standard","High-Off Peak","Low - Peak","Low - Standard","Low-Off Peak","Energy charge Block 1 [c/kWh]","Energy charge Block 2 [c/kWh]","Energy charge [c/kWh]","Ancillary service charge [c/kWh]","Network demand charge [c/kWh]","Network demand charge, Ancillary service charge and retail [c/kWh]","Network capacity charge [R/POD/day]","Service and administration charge [R/POD/day]","Environmental levy charge [c/kWh]","Electrification and rural subsidy [c/kWh]","Generation capacity charge [R/POD/day]","Legacy charge [c/kWh]",null,null,"check"]
[null,null,"Businessrate 1","Non-Local Authority",null,null,{"$f":"C8&\"_\"&D8","v":"Businessrate 1_Non-Local Authority"},{"$f":"INDEX(Matrix_Tariff_Map,MATCH(C8,Matrix_Model_Tariffs,0),2)&IFERROR(INDEX(Matrix_Transmission_Map,MATCH(E8,Matrix_Model_Transmission,0),2),0)&IFERROR(INDEX(Matrix_Voltage_Map,MATCH(F8,Matrix_Model_Voltage,0),2),1)&INDEX(Matrix_Category_Map,MATCH(D8,Matrix_Model_Category,0),2)","v":"B101N"},0,0,0,0,0,0,0,0,188.86,0.36,12.9,null,18.04,13.04,"n/a",4.63,8.82,0]
{"$rows_left_out":44}
{"sheet":"Rates SPU - Current","index":9,"n_rows":51,"n_cols":23,"rows_kept":51,"cut":false,"hidden":true,"merged":[]}
[]
[]
[]
[null,null,{"$f":"\"Small Power User | Tariff Inputs | \"&Current_Period","v":"Small Power User | Tariff Inputs | 2024/25 Tariff Book"}]
[null,null,null,null,null,null,null,null,null,null,null,null,null,null,null,null,null,null,null,null,"Dx NAC"]
[null,null,"Rates - All Other",null,null,null,null,null,"kWhHP","kWhHS","kWhHO","kWhLP","kWhLS","kWhLO","kWhRBlock1","kWhRBlock4","kWhHP","Reliab","DxNDC Energy","DxNDC Energy","NAC POD","SerS"]
[null,null,"Tariff","Tariff Category","Type","Column1","Code","Matrix Code","High - Peak","High - Standard","High-Off Peak","Low - Peak","Low - Standard","Low-Off Peak","Energy charge Block 1 [c/kWh]","Energy charge Block 2 [c/kWh]","Energy charge [c/kWh]","Ancillary service charge [c/kWh]","Network demand charge [c/kWh]","Network demand charge, Ancillary service charge and retail [c/kWh]","Network capacity charge [R/POD/day]","Service and administration charge [R/POD/day]","Environmental levy charge [c/kWh]"]
[null,null,"Businessrate 1","Non-Local Authority",null,null,{"$f":"C8&\"_\"&D8","v":"Businessrate 1_Non-Local Authority"},{"$f":"INDEX(Matrix_Tariff_Map,MATCH(C8,Matrix_Model_Tariffs,0),2)&IFERROR(INDEX(Matrix_Transmission_Map,MATCH(E8,Matrix_Model_Transmission,0),2),0)&IFERROR(INDEX(Matrix_Voltage_Map,MATCH(F8,Matrix_Model_Voltage,0),2),1)&INDEX(Matrix_Category_Map,MATCH(D8,Matrix_Model_Category,0),2)","v":"B101N"},0,0,0,0,0,0,0,0,209.5,0.8,29.57,null,42.47,36.71,"n/a"]
{"$rows_left_out":44}
{"sheet":"Mapping","index":10,"n_rows":43,"n_cols":7,"rows_kept":43,"cut":false,"hidden":true,"merged":[]}
[]
[]
[]
[null,"Mapping"]
[]
[]
[null,"Model Tariffs","Matrix Code","Munic RTP Tariff",null,"Model Transmission Zone","Matrix Code"]
[null,{"$f":"Lists!B17","v":"Businessrate 1"},"B1","Municrate 1",null,"Not Applicable",0]
{"$rows_left_out":36}
{"sheet":"Lists","index":11,"n_rows":115,"n_cols":29,"rows_kept":115,"cut":false,"hidden":true,"merged":[[54,17,54,28],[82,17,82,28]]}
[]
[]
[]
[null,"Model Lists"]
[]
[null,"Selections","Dropbox ID","Description","ID",null,null,null,null,null,"Description","Dates","Units",null,"Customer Category","Tariff Category ID"]
[null,"Selected Tariff Category",1,{"$f":"INDEX(Tariff_Category_List,Dropdown_Category)","v":"Non-Local Authority"},{"$f":"MATCH(D7,Tariff_Category_List,0)","v":1},{"$f":"Selected_Tariff_Category_ID","v":1},null,null,null,null,"ESKOM Financial Year End","2025-03-31","dd-mmm-yy",null,"Small Power User",1]
[null,"Selected Customer Category",1,{"$f":"INDEX(Customer_Category_List,Dropdown_Customer)","v":"Small Power User"},{"$f":"MATCH(D8,Customer_Category_List,0)","v":1},null,null,null,null,null,"Municipality Financial Year End",{"$f":"EOMONTH(ESKOM_Period,3)","v":"2025-06-30"},"dd-mmm-yy",null,"Large Power User",2]
{"$rows_left_out":108}
{"sheet":"Notes on updates","index":12,"n_rows":104,"n_cols":7,"rows_kept":104,"cut":false,"hidden":true,"merged":[[104,0,109,0],[103,1,108,1],[2,1,16,1],[18,1,26,1],[28,1,33,1],[35,1,41,1],[43,1,49,1],[51,1,57,1],[59,1,69,1],[70,1,80,1],[81,1,91,1],[92,1,102,1]]}
[]
[null,null,"Notes on updates",null,"Sheet",null,"Status"]
[null,"2015/16","]","Need to add SPU tariffs"]
[null,null,null,"Public Lighting All Night",null,null,"Done"]
[null,null,null,"Public Lighting 24 Hours"]
[null,null,null,"Public Lighting Urban Fixed"]
[null,null,null,"Landlight"]
[]
{"$rows_left_out":96}